libvirt List Archives
Sign In Sign Up
Manage this list Sign In Sign Up

Keyboard Shortcuts

Thread View

  • j: Next unread message
  • k: Previous unread message
  • j a: Jump to all threads
  • j l: Jump to MailingList overview

CI

Thread Start a new thread
Download
Threads by month
  • ----- 2025 -----
  • August
  • July
  • June
  • May
  • April
  • March
  • February
  • January
  • ----- 2024 -----
  • December
  • November
  • October
  • September
  • August
  • July
  • June
  • May
  • April
  • March
  • February
  • January
  • ----- 2023 -----
  • December
  • November
  • October
  • September
  • August
  • July
  • June
  • May
  • April
  • March
  • February
  • January
  • ----- 2022 -----
  • December
  • November
  • October
  • September
  • August
  • July
  • June
  • May
  • April
  • March
  • February
  • January
  • ----- 2021 -----
  • December
  • November
  • October
  • September
  • August
  • July
  • June
  • May
  • April
  • March
  • February
  • January
  • ----- 2020 -----
  • December
  • November
  • October
  • September
  • August
  • July
  • June
  • May
  • April
  • March
  • February
  • January
  • ----- 2019 -----
  • December
  • November
  • October
  • September
  • August
  • July
  • June
  • May
  • April
  • March
  • February
  • January
  • ----- 2018 -----
  • December
  • November
  • October
  • September
  • August
  • July
  • June
  • May
  • April
  • March
  • February
  • January
  • ----- 2017 -----
  • December
  • November
  • October
  • September
  • August
  • July
  • June
  • May
  • April
  • March
  • February
  • January
  • ----- 2016 -----
  • December
  • November
  • October
  • September
  • August
  • July
ci@lists.libvirt.org

February 2019

  • 2 participants
  • 132 discussions
[Libvirt-ci] Build failed in Jenkins: libosinfo-check » libvirt-debian-9 #93
by ci@centos.org 18 Feb '19

18 Feb '19
See <https://ci.centos.org/job/libosinfo-check/systems=libvirt-debian-9/93/displ…> ------------------------------------------ Started by upstream project "libosinfo-check" build number 93 originally caused by: Started by upstream project "libosinfo-syntax-check" build number 94 originally caused by: Started by upstream project "libosinfo-build" build number 97 originally caused by: Started by an SCM change [EnvInject] - Loading node environment variables. Building remotely on libvirt-debian-9 (libvirt) in workspace <https://ci.centos.org/job/libosinfo-check/systems=libvirt-debian-9/ws/> [libosinfo] $ /bin/sh -xe /tmp/jenkins4611442150616819388.sh + cd build + /usr/bin/make check GEN public-submodule-commit Making check in osinfo make[1]: Entering directory '<https://ci.centos.org/job/libosinfo-check/systems=libvirt-debian-9/ws/build…'> /usr/bin/make check-am make[2]: Entering directory '<https://ci.centos.org/job/libosinfo-check/systems=libvirt-debian-9/ws/build…'> /usr/bin/make check-local make[3]: Entering directory '<https://ci.centos.org/job/libosinfo-check/systems=libvirt-debian-9/ws/build…'> GEN check-symfile GEN check-symsorting make[3]: Leaving directory '<https://ci.centos.org/job/libosinfo-check/systems=libvirt-debian-9/ws/build…'> make[2]: Leaving directory '<https://ci.centos.org/job/libosinfo-check/systems=libvirt-debian-9/ws/build…'> make[1]: Leaving directory '<https://ci.centos.org/job/libosinfo-check/systems=libvirt-debian-9/ws/build…'> Making check in tools make[1]: Entering directory '<https://ci.centos.org/job/libosinfo-check/systems=libvirt-debian-9/ws/build…'> make[1]: Nothing to be done for 'check'. make[1]: Leaving directory '<https://ci.centos.org/job/libosinfo-check/systems=libvirt-debian-9/ws/build…'> Making check in docs make[1]: Entering directory '<https://ci.centos.org/job/libosinfo-check/systems=libvirt-debian-9/ws/build…'> Making check in reference make[2]: Entering directory '<https://ci.centos.org/job/libosinfo-check/systems=libvirt-debian-9/ws/build…'> make[2]: Nothing to be done for 'check'. make[2]: Leaving directory '<https://ci.centos.org/job/libosinfo-check/systems=libvirt-debian-9/ws/build…'> make[2]: Entering directory '<https://ci.centos.org/job/libosinfo-check/systems=libvirt-debian-9/ws/build…'> make[2]: Nothing to be done for 'check-am'. make[2]: Leaving directory '<https://ci.centos.org/job/libosinfo-check/systems=libvirt-debian-9/ws/build…'> make[1]: Leaving directory '<https://ci.centos.org/job/libosinfo-check/systems=libvirt-debian-9/ws/build…'> Making check in po make[1]: Entering directory '<https://ci.centos.org/job/libosinfo-check/systems=libvirt-debian-9/ws/build…'> INTLTOOL_EXTRACT="/usr/bin/intltool-extract" XGETTEXT="/usr/bin/xgettext" srcdir=../../po /usr/bin/intltool-update --gettext-package libosinfo --pot rm -f missing notexist srcdir=../../po /usr/bin/intltool-update -m Unescaped left brace in regex is deprecated, passed through in regex; marked by <-- HERE in m/\${ <-- HERE ?PACKAGE_NAME}?/ at /usr/bin/intltool-update line 1071, <CONF> line 295. if [ -r missing -o -r notexist ]; then \ exit 1; \ fi make[1]: Leaving directory '<https://ci.centos.org/job/libosinfo-check/systems=libvirt-debian-9/ws/build…'> Making check in examples make[1]: Entering directory '<https://ci.centos.org/job/libosinfo-check/systems=libvirt-debian-9/ws/build…'> make[1]: Nothing to be done for 'check'. make[1]: Leaving directory '<https://ci.centos.org/job/libosinfo-check/systems=libvirt-debian-9/ws/build…'> Making check in tests make[1]: Entering directory '<https://ci.centos.org/job/libosinfo-check/systems=libvirt-debian-9/ws/build…'> /usr/bin/make test-entity test-device test-list test-devicelist test-devicelinklist test-filter test-media test-product test-os test-oslist test-productfilter test-platform test-platformlist test-db test-loader test-isodetect test-install-script test-image test-imagelist test-mediauris test-treeuris test-imageuris make[2]: Entering directory '<https://ci.centos.org/job/libosinfo-check/systems=libvirt-debian-9/ws/build…'> CC test_entity-test-entity.o CC test_list-test-list.o CC test_device-test-device.o CC test_devicelist-test-devicelist.o CC test_devicelinklist-test-devicelinklist.o CC test_filter-test-filter.o CC test_media-test-media.o CC test_product-test-product.o CC test_os-test-os.o CC test_productfilter-test-productfilter.o CC test_oslist-test-oslist.o CC test_platform-test-platform.o CC test_platformlist-test-platformlist.o CC test_db-test-db.o CC test_loader-test-loader.o CC test_isodetect-test-isodetect.o CC test_install_script-test-install-script.o CC test_image-test-image.o CC test_imagelist-test-imagelist.o CC test_mediauris-test-mediauris.o CC test_treeuris-test-treeuris.o CC test_imageuris-test-imageuris.o CCLD test-entity CCLD test-device CCLD test-list CCLD test-devicelist CCLD test-devicelinklist CCLD test-filter CCLD test-media CCLD test-product CCLD test-os CCLD test-oslist CCLD test-productfilter CCLD test-platform CCLD test-platformlist CCLD test-db CCLD test-loader CCLD test-isodetect CCLD test-install-script CCLD test-image CCLD test-imagelist CCLD test-mediauris CCLD test-treeuris CCLD test-imageuris make[2]: Leaving directory '<https://ci.centos.org/job/libosinfo-check/systems=libvirt-debian-9/ws/build…'> /usr/bin/make check-TESTS make[2]: Entering directory '<https://ci.centos.org/job/libosinfo-check/systems=libvirt-debian-9/ws/build…'> make[3]: Entering directory '<https://ci.centos.org/job/libosinfo-check/systems=libvirt-debian-9/ws/build…'> PASS: test-entity PASS: test-device PASS: test-list PASS: test-devicelist PASS: test-devicelinklist PASS: test-filter PASS: test-product PASS: test-media PASS: test-oslist PASS: test-productfilter PASS: test-platform PASS: test-platformlist PASS: test-db PASS: test-loader PASS: test-install-script PASS: test-image PASS: test-imagelist SKIP: test-mediauris SKIP: test-treeuris SKIP: test-imageuris PASS: test-os FAIL: test-isodetect ============================================================================ Testsuite summary for libosinfo 1.4.0 ============================================================================ # TOTAL: 22 # PASS: 18 # SKIP: 3 # XFAIL: 0 # FAIL: 1 # XPASS: 0 # ERROR: 0 ============================================================================ See tests/test-suite.log Please report to libosinfo(a)redhat.com ============================================================================ Makefile:1412: recipe for target 'test-suite.log' failed make[3]: *** [test-suite.log] Error 1 make[3]: Leaving directory '<https://ci.centos.org/job/libosinfo-check/systems=libvirt-debian-9/ws/build…'> Makefile:1518: recipe for target 'check-TESTS' failed make[2]: *** [check-TESTS] Error 2 make[2]: Leaving directory '<https://ci.centos.org/job/libosinfo-check/systems=libvirt-debian-9/ws/build…'> Makefile:1738: recipe for target 'check-am' failed make[1]: *** [check-am] Error 2 make[1]: Leaving directory '<https://ci.centos.org/job/libosinfo-check/systems=libvirt-debian-9/ws/build…'> Makefile:595: recipe for target 'check-recursive' failed make: *** [check-recursive] Error 1 + cat tests/test-suite.log =========================================== libosinfo 1.4.0: tests/test-suite.log =========================================== # TOTAL: 22 # PASS: 18 # SKIP: 3 # XFAIL: 0 # FAIL: 1 # XPASS: 0 # ERROR: 0 .. contents:: :depth: 2 FAIL: test-isodetect ==================== /isodetect/haiku: OK /isodetect/android-x86: OK /isodetect/eos: OK /isodetect/pureos: OK /isodetect/windows: OK /isodetect/ubuntu: ISO ubuntu-18.04.1.0-live-server-amd64.iso.txt was not matched by OS ubuntu18.04 /isodetect/ubuntu: FAIL /isodetect/sles: OK /isodetect/sled: OK /isodetect/rhel: OK /isodetect/popos: OK /isodetect/opensuse: OK /isodetect/openbsd: OK /isodetect/netbsd: OK /isodetect/mageia: OK /isodetect/gnome: OK /isodetect/freedos: OK /isodetect/freebsd: OK /isodetect/fedora: OK /isodetect/debian: OK /isodetect/centos: OK /isodetect/asianux: OK /isodetect/altlinux: OK /isodetect/alpinelinux: OK /isodetect/dragonflybsd: OK FAIL test-isodetect (exit status: 1) SKIP: test-mediauris ==================== SKIP test-mediauris (exit status: 77) SKIP: test-treeuris =================== SKIP test-treeuris (exit status: 77) SKIP: test-imageuris ==================== SKIP test-imageuris (exit status: 77) + exit 1 Build step 'Execute shell' marked build as failure
1 1
0 0
[Libvirt-ci] Build failed in Jenkins: libosinfo-check » libvirt-fedora-29 #93
by ci@centos.org 18 Feb '19

18 Feb '19
See <https://ci.centos.org/job/libosinfo-check/systems=libvirt-fedora-29/93/disp…> ------------------------------------------ Started by upstream project "libosinfo-check" build number 93 originally caused by: Started by upstream project "libosinfo-syntax-check" build number 94 originally caused by: Started by upstream project "libosinfo-build" build number 97 originally caused by: Started by an SCM change [EnvInject] - Loading node environment variables. Building remotely on libvirt-fedora-29 (libvirt) in workspace <https://ci.centos.org/job/libosinfo-check/systems=libvirt-fedora-29/ws/> [libosinfo] $ /bin/sh -xe /tmp/jenkins1259647501541371167.sh + cd build + /usr/bin/gmake check GEN public-submodule-commit Making check in osinfo gmake[1]: Entering directory '<https://ci.centos.org/job/libosinfo-check/systems=libvirt-fedora-29/ws/buil…'> /usr/bin/gmake check-am gmake[2]: Entering directory '<https://ci.centos.org/job/libosinfo-check/systems=libvirt-fedora-29/ws/buil…'> /usr/bin/gmake check-local gmake[3]: Entering directory '<https://ci.centos.org/job/libosinfo-check/systems=libvirt-fedora-29/ws/buil…'> GEN check-symfile GEN check-symsorting gmake[3]: Leaving directory '<https://ci.centos.org/job/libosinfo-check/systems=libvirt-fedora-29/ws/buil…'> gmake[2]: Leaving directory '<https://ci.centos.org/job/libosinfo-check/systems=libvirt-fedora-29/ws/buil…'> gmake[1]: Leaving directory '<https://ci.centos.org/job/libosinfo-check/systems=libvirt-fedora-29/ws/buil…'> Making check in tools gmake[1]: Entering directory '<https://ci.centos.org/job/libosinfo-check/systems=libvirt-fedora-29/ws/buil…'> gmake[1]: Nothing to be done for 'check'. gmake[1]: Leaving directory '<https://ci.centos.org/job/libosinfo-check/systems=libvirt-fedora-29/ws/buil…'> Making check in docs gmake[1]: Entering directory '<https://ci.centos.org/job/libosinfo-check/systems=libvirt-fedora-29/ws/buil…'> Making check in reference gmake[2]: Entering directory '<https://ci.centos.org/job/libosinfo-check/systems=libvirt-fedora-29/ws/buil…'> gmake[2]: Nothing to be done for 'check'. gmake[2]: Leaving directory '<https://ci.centos.org/job/libosinfo-check/systems=libvirt-fedora-29/ws/buil…'> gmake[2]: Entering directory '<https://ci.centos.org/job/libosinfo-check/systems=libvirt-fedora-29/ws/buil…'> gmake[2]: Nothing to be done for 'check-am'. gmake[2]: Leaving directory '<https://ci.centos.org/job/libosinfo-check/systems=libvirt-fedora-29/ws/buil…'> gmake[1]: Leaving directory '<https://ci.centos.org/job/libosinfo-check/systems=libvirt-fedora-29/ws/buil…'> Making check in po gmake[1]: Entering directory '<https://ci.centos.org/job/libosinfo-check/systems=libvirt-fedora-29/ws/buil…'> INTLTOOL_EXTRACT="/usr/bin/intltool-extract" XGETTEXT="/usr/bin/xgettext" srcdir=../../po /usr/bin/intltool-update --gettext-package libosinfo --pot rm -f missing notexist srcdir=../../po /usr/bin/intltool-update -m if [ -r missing -o -r notexist ]; then \ exit 1; \ fi gmake[1]: Leaving directory '<https://ci.centos.org/job/libosinfo-check/systems=libvirt-fedora-29/ws/buil…'> Making check in examples gmake[1]: Entering directory '<https://ci.centos.org/job/libosinfo-check/systems=libvirt-fedora-29/ws/buil…'> gmake[1]: Nothing to be done for 'check'. gmake[1]: Leaving directory '<https://ci.centos.org/job/libosinfo-check/systems=libvirt-fedora-29/ws/buil…'> Making check in tests gmake[1]: Entering directory '<https://ci.centos.org/job/libosinfo-check/systems=libvirt-fedora-29/ws/buil…'> /usr/bin/gmake test-entity test-device test-list test-devicelist test-devicelinklist test-filter test-media test-product test-os test-oslist test-productfilter test-platform test-platformlist test-db test-loader test-isodetect test-install-script test-image test-imagelist test-mediauris test-treeuris test-imageuris gmake[2]: Entering directory '<https://ci.centos.org/job/libosinfo-check/systems=libvirt-fedora-29/ws/buil…'> CC test_entity-test-entity.o CC test_device-test-device.o CC test_list-test-list.o CC test_devicelist-test-devicelist.o CC test_devicelinklist-test-devicelinklist.o CC test_filter-test-filter.o CC test_media-test-media.o CC test_product-test-product.o CC test_os-test-os.o CC test_oslist-test-oslist.o CC test_productfilter-test-productfilter.o CC test_platform-test-platform.o CC test_platformlist-test-platformlist.o CC test_db-test-db.o CC test_loader-test-loader.o CC test_isodetect-test-isodetect.o CC test_install_script-test-install-script.o CC test_image-test-image.o CC test_imagelist-test-imagelist.o CC test_treeuris-test-treeuris.o CC test_mediauris-test-mediauris.o CC test_imageuris-test-imageuris.o CCLD test-entity CCLD test-list CCLD test-device CCLD test-devicelist CCLD test-devicelinklist CCLD test-filter CCLD test-media CCLD test-product CCLD test-os CCLD test-oslist CCLD test-productfilter CCLD test-platform CCLD test-platformlist CCLD test-db CCLD test-loader CCLD test-isodetect CCLD test-install-script CCLD test-image CCLD test-imagelist CCLD test-mediauris CCLD test-treeuris CCLD test-imageuris gmake[2]: Leaving directory '<https://ci.centos.org/job/libosinfo-check/systems=libvirt-fedora-29/ws/buil…'> /usr/bin/gmake check-TESTS gmake[2]: Entering directory '<https://ci.centos.org/job/libosinfo-check/systems=libvirt-fedora-29/ws/buil…'> gmake[3]: Entering directory '<https://ci.centos.org/job/libosinfo-check/systems=libvirt-fedora-29/ws/buil…'> PASS: test-list PASS: test-device PASS: test-entity PASS: test-devicelinklist PASS: test-devicelist PASS: test-product PASS: test-filter PASS: test-oslist PASS: test-media PASS: test-productfilter PASS: test-platform PASS: test-platformlist PASS: test-db PASS: test-loader PASS: test-install-script PASS: test-image PASS: test-imagelist SKIP: test-mediauris SKIP: test-treeuris SKIP: test-imageuris PASS: test-os FAIL: test-isodetect ============================================================================ Testsuite summary for libosinfo 1.4.0 ============================================================================ # TOTAL: 22 # PASS: 18 # SKIP: 3 # XFAIL: 0 # FAIL: 1 # XPASS: 0 # ERROR: 0 ============================================================================ See tests/test-suite.log Please report to libosinfo(a)redhat.com ============================================================================ gmake[3]: *** [Makefile:1440: test-suite.log] Error 1 gmake[3]: Leaving directory '<https://ci.centos.org/job/libosinfo-check/systems=libvirt-fedora-29/ws/buil…'> gmake[2]: *** [Makefile:1548: check-TESTS] Error 2 gmake[2]: Leaving directory '<https://ci.centos.org/job/libosinfo-check/systems=libvirt-fedora-29/ws/buil…'> gmake[1]: *** [Makefile:1769: check-am] Error 2 gmake[1]: Leaving directory '<https://ci.centos.org/job/libosinfo-check/systems=libvirt-fedora-29/ws/buil…'> gmake: *** [Makefile:594: check-recursive] Error 1 + cat tests/test-suite.log =========================================== libosinfo 1.4.0: tests/test-suite.log =========================================== # TOTAL: 22 # PASS: 18 # SKIP: 3 # XFAIL: 0 # FAIL: 1 # XPASS: 0 # ERROR: 0 .. contents:: :depth: 2 FAIL: test-isodetect ==================== /isodetect/android-x86: OK /isodetect/eos: OK /isodetect/pureos: OK /isodetect/windows: OK /isodetect/ubuntu: ISO ubuntu-18.04.1.0-live-server-amd64.iso.txt was not matched by OS ubuntu18.04 /isodetect/ubuntu: FAIL /isodetect/sles: OK /isodetect/sled: OK /isodetect/rhel: OK /isodetect/popos: OK /isodetect/opensuse: OK /isodetect/openbsd: OK /isodetect/netbsd: OK /isodetect/mageia: OK /isodetect/haiku: OK /isodetect/gnome: OK /isodetect/freedos: OK /isodetect/freebsd: OK /isodetect/fedora: OK /isodetect/dragonflybsd: OK /isodetect/debian: OK /isodetect/centos: OK /isodetect/asianux: OK /isodetect/altlinux: OK /isodetect/alpinelinux: OK FAIL test-isodetect (exit status: 1) SKIP: test-mediauris ==================== SKIP test-mediauris (exit status: 77) SKIP: test-treeuris =================== SKIP test-treeuris (exit status: 77) SKIP: test-imageuris ==================== SKIP test-imageuris (exit status: 77) + exit 1 Build step 'Execute shell' marked build as failure
1 1
0 0
[Libvirt-ci] Build failed in Jenkins: libosinfo-check » libvirt-centos-7 #93
by ci@centos.org 18 Feb '19

18 Feb '19
See <https://ci.centos.org/job/libosinfo-check/systems=libvirt-centos-7/93/displ…> ------------------------------------------ Started by upstream project "libosinfo-check" build number 93 originally caused by: Started by upstream project "libosinfo-syntax-check" build number 94 originally caused by: Started by upstream project "libosinfo-build" build number 97 originally caused by: Started by an SCM change [EnvInject] - Loading node environment variables. Building remotely on libvirt-centos-7 (libvirt) in workspace <https://ci.centos.org/job/libosinfo-check/systems=libvirt-centos-7/ws/> [libosinfo] $ /bin/sh -xe /tmp/jenkins4873098628155519848.sh + cd build + /usr/bin/gmake check GEN public-submodule-commit Making check in osinfo gmake[1]: Entering directory `<https://ci.centos.org/job/libosinfo-check/systems=libvirt-centos-7/ws/build…'> /usr/bin/gmake check-am gmake[2]: Entering directory `<https://ci.centos.org/job/libosinfo-check/systems=libvirt-centos-7/ws/build…'> /usr/bin/gmake check-local gmake[3]: Entering directory `<https://ci.centos.org/job/libosinfo-check/systems=libvirt-centos-7/ws/build…'> GEN check-symfile GEN check-symsorting gmake[3]: Leaving directory `<https://ci.centos.org/job/libosinfo-check/systems=libvirt-centos-7/ws/build…'> gmake[2]: Leaving directory `<https://ci.centos.org/job/libosinfo-check/systems=libvirt-centos-7/ws/build…'> gmake[1]: Leaving directory `<https://ci.centos.org/job/libosinfo-check/systems=libvirt-centos-7/ws/build…'> Making check in tools gmake[1]: Entering directory `<https://ci.centos.org/job/libosinfo-check/systems=libvirt-centos-7/ws/build…'> gmake[1]: Nothing to be done for `check'. gmake[1]: Leaving directory `<https://ci.centos.org/job/libosinfo-check/systems=libvirt-centos-7/ws/build…'> Making check in docs gmake[1]: Entering directory `<https://ci.centos.org/job/libosinfo-check/systems=libvirt-centos-7/ws/build…'> Making check in reference gmake[2]: Entering directory `<https://ci.centos.org/job/libosinfo-check/systems=libvirt-centos-7/ws/build…'> gmake[2]: Nothing to be done for `check'. gmake[2]: Leaving directory `<https://ci.centos.org/job/libosinfo-check/systems=libvirt-centos-7/ws/build…'> gmake[2]: Entering directory `<https://ci.centos.org/job/libosinfo-check/systems=libvirt-centos-7/ws/build…'> gmake[2]: Nothing to be done for `check-am'. gmake[2]: Leaving directory `<https://ci.centos.org/job/libosinfo-check/systems=libvirt-centos-7/ws/build…'> gmake[1]: Leaving directory `<https://ci.centos.org/job/libosinfo-check/systems=libvirt-centos-7/ws/build…'> Making check in po gmake[1]: Entering directory `<https://ci.centos.org/job/libosinfo-check/systems=libvirt-centos-7/ws/build…'> INTLTOOL_EXTRACT="/usr/bin/intltool-extract" XGETTEXT="/usr/bin/xgettext" srcdir=../../po /usr/bin/intltool-update --gettext-package libosinfo --pot rm -f missing notexist srcdir=../../po /usr/bin/intltool-update -m if [ -r missing -o -r notexist ]; then \ exit 1; \ fi gmake[1]: Leaving directory `<https://ci.centos.org/job/libosinfo-check/systems=libvirt-centos-7/ws/build…'> Making check in examples gmake[1]: Entering directory `<https://ci.centos.org/job/libosinfo-check/systems=libvirt-centos-7/ws/build…'> gmake[1]: Nothing to be done for `check'. gmake[1]: Leaving directory `<https://ci.centos.org/job/libosinfo-check/systems=libvirt-centos-7/ws/build…'> Making check in tests gmake[1]: Entering directory `<https://ci.centos.org/job/libosinfo-check/systems=libvirt-centos-7/ws/build…'> /usr/bin/gmake test-entity test-device test-list test-devicelist test-devicelinklist test-filter test-media test-product test-os test-oslist test-productfilter test-platform test-platformlist test-db test-loader test-isodetect test-install-script test-image test-imagelist test-mediauris test-treeuris test-imageuris gmake[2]: Entering directory `<https://ci.centos.org/job/libosinfo-check/systems=libvirt-centos-7/ws/build…'> CC test_entity-test-entity.o CC test_device-test-device.o CC test_list-test-list.o CC test_devicelist-test-devicelist.o CC test_devicelinklist-test-devicelinklist.o CC test_filter-test-filter.o CC test_media-test-media.o CC test_product-test-product.o CC test_os-test-os.o CC test_oslist-test-oslist.o CC test_productfilter-test-productfilter.o CC test_platform-test-platform.o CC test_platformlist-test-platformlist.o CC test_db-test-db.o CC test_loader-test-loader.o CC test_isodetect-test-isodetect.o CC test_install_script-test-install-script.o CC test_image-test-image.o CC test_imagelist-test-imagelist.o CC test_mediauris-test-mediauris.o CC test_treeuris-test-treeuris.o CC test_imageuris-test-imageuris.o CCLD test-entity CCLD test-device CCLD test-list CCLD test-devicelist CCLD test-devicelinklist CCLD test-filter CCLD test-media CCLD test-product CCLD test-os CCLD test-oslist CCLD test-productfilter CCLD test-platform CCLD test-platformlist CCLD test-db CCLD test-loader CCLD test-isodetect CCLD test-install-script CCLD test-image CCLD test-imagelist CCLD test-mediauris CCLD test-treeuris CCLD test-imageuris gmake[2]: Leaving directory `<https://ci.centos.org/job/libosinfo-check/systems=libvirt-centos-7/ws/build…'> /usr/bin/gmake check-TESTS gmake[2]: Entering directory `<https://ci.centos.org/job/libosinfo-check/systems=libvirt-centos-7/ws/build…'> gmake[3]: Entering directory `<https://ci.centos.org/job/libosinfo-check/systems=libvirt-centos-7/ws/build…'> PASS: test-entity PASS: test-device PASS: test-list PASS: test-devicelinklist PASS: test-devicelist PASS: test-filter PASS: test-product PASS: test-oslist PASS: test-media PASS: test-productfilter PASS: test-platform PASS: test-platformlist PASS: test-db PASS: test-loader PASS: test-install-script PASS: test-image PASS: test-imagelist SKIP: test-mediauris SKIP: test-treeuris SKIP: test-imageuris PASS: test-os FAIL: test-isodetect gmake[4]: Entering directory `<https://ci.centos.org/job/libosinfo-check/systems=libvirt-centos-7/ws/build…'> gmake[4]: Nothing to be done for `all'. gmake[4]: Leaving directory `<https://ci.centos.org/job/libosinfo-check/systems=libvirt-centos-7/ws/build…'> ============================================================================ Testsuite summary for libosinfo 1.4.0 ============================================================================ # TOTAL: 22 # PASS: 18 # SKIP: 3 # XFAIL: 0 # FAIL: 1 # XPASS: 0 # ERROR: 0 ============================================================================ See tests/test-suite.log Please report to libosinfo(a)redhat.com ============================================================================ gmake[3]: *** [test-suite.log] Error 1 gmake[3]: Leaving directory `<https://ci.centos.org/job/libosinfo-check/systems=libvirt-centos-7/ws/build…'> gmake[2]: *** [check-TESTS] Error 2 gmake[2]: Leaving directory `<https://ci.centos.org/job/libosinfo-check/systems=libvirt-centos-7/ws/build…'> gmake[1]: *** [check-am] Error 2 gmake[1]: Leaving directory `<https://ci.centos.org/job/libosinfo-check/systems=libvirt-centos-7/ws/build…'> gmake: *** [check-recursive] Error 1 + cat tests/test-suite.log =========================================== libosinfo 1.4.0: tests/test-suite.log =========================================== # TOTAL: 22 # PASS: 18 # SKIP: 3 # XFAIL: 0 # FAIL: 1 # XPASS: 0 # ERROR: 0 .. contents:: :depth: 2 FAIL: test-isodetect ==================== /isodetect/eos: OK /isodetect/android-x86: OK /isodetect/dragonflybsd: OK /isodetect/haiku: OK /isodetect/pureos: OK /isodetect/windows: OK /isodetect/ubuntu: ISO ubuntu-18.04.1.0-live-server-amd64.iso.txt was not matched by OS ubuntu18.04 /isodetect/ubuntu: FAIL /isodetect/sles: OK /isodetect/sled: OK /isodetect/rhel: OK /isodetect/popos: OK /isodetect/opensuse: OK /isodetect/openbsd: OK /isodetect/netbsd: OK /isodetect/mageia: OK /isodetect/gnome: OK /isodetect/freedos: OK /isodetect/freebsd: OK /isodetect/fedora: OK /isodetect/debian: OK /isodetect/centos: OK /isodetect/asianux: OK /isodetect/altlinux: OK /isodetect/alpinelinux: OK SKIP: test-mediauris ==================== SKIP: test-treeuris =================== SKIP: test-imageuris ==================== + exit 1 Build step 'Execute shell' marked build as failure
1 1
0 0
[Libvirt-ci] Build failed in Jenkins: libosinfo-check » libvirt-debian-8 #93
by ci@centos.org 18 Feb '19

18 Feb '19
See <https://ci.centos.org/job/libosinfo-check/systems=libvirt-debian-8/93/displ…> ------------------------------------------ Started by upstream project "libosinfo-check" build number 93 originally caused by: Started by upstream project "libosinfo-syntax-check" build number 94 originally caused by: Started by upstream project "libosinfo-build" build number 97 originally caused by: Started by an SCM change [EnvInject] - Loading node environment variables. Building remotely on libvirt-debian-8 (libvirt) in workspace <https://ci.centos.org/job/libosinfo-check/systems=libvirt-debian-8/ws/> [libosinfo] $ /bin/sh -xe /tmp/jenkins277178381261420920.sh + cd build + /usr/bin/make check Making check in osinfo GEN public-submodule-commit make[1]: Entering directory '<https://ci.centos.org/job/libosinfo-check/systems=libvirt-debian-8/ws/build…'> /usr/bin/make check-am make[2]: Entering directory '<https://ci.centos.org/job/libosinfo-check/systems=libvirt-debian-8/ws/build…'> /usr/bin/make check-local make[3]: Entering directory '<https://ci.centos.org/job/libosinfo-check/systems=libvirt-debian-8/ws/build…'> GEN check-symfile GEN check-symsorting make[3]: Leaving directory '<https://ci.centos.org/job/libosinfo-check/systems=libvirt-debian-8/ws/build…'> make[2]: Leaving directory '<https://ci.centos.org/job/libosinfo-check/systems=libvirt-debian-8/ws/build…'> make[1]: Leaving directory '<https://ci.centos.org/job/libosinfo-check/systems=libvirt-debian-8/ws/build…'> Making check in tools make[1]: Entering directory '<https://ci.centos.org/job/libosinfo-check/systems=libvirt-debian-8/ws/build…'> make[1]: Nothing to be done for 'check'. make[1]: Leaving directory '<https://ci.centos.org/job/libosinfo-check/systems=libvirt-debian-8/ws/build…'> Making check in docs make[1]: Entering directory '<https://ci.centos.org/job/libosinfo-check/systems=libvirt-debian-8/ws/build…'> Making check in reference make[2]: Entering directory '<https://ci.centos.org/job/libosinfo-check/systems=libvirt-debian-8/ws/build…'> make[2]: Nothing to be done for 'check'. make[2]: Leaving directory '<https://ci.centos.org/job/libosinfo-check/systems=libvirt-debian-8/ws/build…'> make[2]: Entering directory '<https://ci.centos.org/job/libosinfo-check/systems=libvirt-debian-8/ws/build…'> make[2]: Nothing to be done for 'check-am'. make[2]: Leaving directory '<https://ci.centos.org/job/libosinfo-check/systems=libvirt-debian-8/ws/build…'> make[1]: Leaving directory '<https://ci.centos.org/job/libosinfo-check/systems=libvirt-debian-8/ws/build…'> Making check in po make[1]: Entering directory '<https://ci.centos.org/job/libosinfo-check/systems=libvirt-debian-8/ws/build…'> INTLTOOL_EXTRACT="/usr/bin/intltool-extract" XGETTEXT="/usr/bin/xgettext" srcdir=../../po /usr/bin/intltool-update --gettext-package libosinfo --pot rm -f missing notexist srcdir=../../po /usr/bin/intltool-update -m if [ -r missing -o -r notexist ]; then \ exit 1; \ fi make[1]: Leaving directory '<https://ci.centos.org/job/libosinfo-check/systems=libvirt-debian-8/ws/build…'> Making check in examples make[1]: Entering directory '<https://ci.centos.org/job/libosinfo-check/systems=libvirt-debian-8/ws/build…'> make[1]: Nothing to be done for 'check'. make[1]: Leaving directory '<https://ci.centos.org/job/libosinfo-check/systems=libvirt-debian-8/ws/build…'> Making check in tests make[1]: Entering directory '<https://ci.centos.org/job/libosinfo-check/systems=libvirt-debian-8/ws/build…'> /usr/bin/make test-entity test-device test-list test-devicelist test-devicelinklist test-filter test-media test-product test-os test-oslist test-productfilter test-platform test-platformlist test-db test-loader test-isodetect test-install-script test-image test-imagelist test-mediauris test-treeuris test-imageuris make[2]: Entering directory '<https://ci.centos.org/job/libosinfo-check/systems=libvirt-debian-8/ws/build…'> CC test_entity-test-entity.o CC test_list-test-list.o CC test_device-test-device.o CC test_devicelist-test-devicelist.o CC test_devicelinklist-test-devicelinklist.o CC test_filter-test-filter.o CC test_media-test-media.o CC test_product-test-product.o CC test_os-test-os.o CC test_oslist-test-oslist.o CC test_productfilter-test-productfilter.o CC test_platformlist-test-platformlist.o CC test_platform-test-platform.o CC test_db-test-db.o CC test_loader-test-loader.o CC test_isodetect-test-isodetect.o CC test_install_script-test-install-script.o CC test_imagelist-test-imagelist.o CC test_image-test-image.o CC test_mediauris-test-mediauris.o CC test_treeuris-test-treeuris.o CC test_imageuris-test-imageuris.o CCLD test-entity CCLD test-list CCLD test-device CCLD test-devicelist CCLD test-devicelinklist CCLD test-filter CCLD test-media CCLD test-product CCLD test-os CCLD test-oslist CCLD test-productfilter CCLD test-platform CCLD test-platformlist CCLD test-db CCLD test-loader CCLD test-isodetect CCLD test-install-script CCLD test-image CCLD test-imagelist CCLD test-mediauris CCLD test-treeuris CCLD test-imageuris make[2]: Leaving directory '<https://ci.centos.org/job/libosinfo-check/systems=libvirt-debian-8/ws/build…'> /usr/bin/make check-TESTS make[2]: Entering directory '<https://ci.centos.org/job/libosinfo-check/systems=libvirt-debian-8/ws/build…'> make[3]: Entering directory '<https://ci.centos.org/job/libosinfo-check/systems=libvirt-debian-8/ws/build…'> PASS: test-entity PASS: test-list PASS: test-devicelinklist PASS: test-device PASS: test-devicelist PASS: test-filter PASS: test-product PASS: test-media PASS: test-oslist PASS: test-productfilter PASS: test-platform PASS: test-platformlist PASS: test-db PASS: test-loader PASS: test-install-script PASS: test-image PASS: test-imagelist SKIP: test-mediauris SKIP: test-treeuris SKIP: test-imageuris PASS: test-os FAIL: test-isodetect make[4]: Entering directory '<https://ci.centos.org/job/libosinfo-check/systems=libvirt-debian-8/ws/build…'> make[4]: Nothing to be done for 'all'. make[4]: Leaving directory '<https://ci.centos.org/job/libosinfo-check/systems=libvirt-debian-8/ws/build…'> ============================================================================ Testsuite summary for libosinfo 1.4.0 ============================================================================ # TOTAL: 22 # PASS: 18 # SKIP: 3 # XFAIL: 0 # FAIL: 1 # XPASS: 0 # ERROR: 0 ============================================================================ See tests/test-suite.log Please report to libosinfo(a)redhat.com ============================================================================ Makefile:1402: recipe for target 'test-suite.log' failed make[3]: *** [test-suite.log] Error 1 make[3]: Leaving directory '<https://ci.centos.org/job/libosinfo-check/systems=libvirt-debian-8/ws/build…'> Makefile:1508: recipe for target 'check-TESTS' failed make[2]: *** [check-TESTS] Error 2 make[2]: Leaving directory '<https://ci.centos.org/job/libosinfo-check/systems=libvirt-debian-8/ws/build…'> Makefile:1728: recipe for target 'check-am' failed make[1]: *** [check-am] Error 2 make[1]: Leaving directory '<https://ci.centos.org/job/libosinfo-check/systems=libvirt-debian-8/ws/build…'> Makefile:585: recipe for target 'check-recursive' failed make: *** [check-recursive] Error 1 + cat tests/test-suite.log =========================================== libosinfo 1.4.0: tests/test-suite.log =========================================== # TOTAL: 22 # PASS: 18 # SKIP: 3 # XFAIL: 0 # FAIL: 1 # XPASS: 0 # ERROR: 0 .. contents:: :depth: 2 FAIL: test-isodetect ==================== /isodetect/haiku: OK /isodetect/dragonflybsd: OK /isodetect/eos: OK /isodetect/android-x86: OK /isodetect/windows: OK /isodetect/ubuntu: ISO ubuntu-18.04.1.0-live-server-amd64.iso.txt was not matched by OS ubuntu18.04 /isodetect/ubuntu: FAIL /isodetect/sles: OK /isodetect/sled: OK /isodetect/rhel: OK /isodetect/popos: OK /isodetect/opensuse: OK /isodetect/openbsd: OK /isodetect/netbsd: OK /isodetect/mageia: OK /isodetect/gnome: OK /isodetect/freedos: OK /isodetect/freebsd: OK /isodetect/fedora: OK /isodetect/debian: OK /isodetect/centos: OK /isodetect/asianux: OK /isodetect/altlinux: OK /isodetect/alpinelinux: OK /isodetect/pureos: OK SKIP: test-mediauris ==================== SKIP: test-treeuris =================== SKIP: test-imageuris ==================== + exit 1 Build step 'Execute shell' marked build as failure
1 1
0 0
[Libvirt-ci] Build failed in Jenkins: libvirt-dbus-check » libvirt-fedora-rawhide #200
by ci@centos.org 14 Feb '19

14 Feb '19
See <https://ci.centos.org/job/libvirt-dbus-check/systems=libvirt-fedora-rawhide…> ------------------------------------------ [...truncated 24.27 KB...] message = <dbus.lowlevel.MethodCallMessage path: /org/libvirt/Test/domain/_6695eb01_f6a4_8304_79aa_97f2502e193f, iface: org.libvirt.Domain, member: Suspend dest: :1.2> def call_blocking(self, bus_name, object_path, dbus_interface, method, signature, args, timeout=-1.0, byte_arrays=False, **kwargs): """Call the given method, synchronously. :Since: 0.81.0 """ if object_path == LOCAL_PATH: raise DBusException('Methods may not be called on the reserved ' 'path %s' % LOCAL_PATH) if dbus_interface == LOCAL_IFACE: raise DBusException('Methods may not be called on the reserved ' 'interface %s' % LOCAL_IFACE) # no need to validate other args - MethodCallMessage ctor will do get_args_opts = dict(byte_arrays=byte_arrays) if is_py2: get_args_opts['utf8_strings'] = kwargs.get('utf8_strings', False) elif 'utf8_strings' in kwargs: raise TypeError("unexpected keyword argument 'utf8_strings'") message = MethodCallMessage(destination=bus_name, path=object_path, interface=dbus_interface, method=method) # Add the arguments to the function try: message.append(signature=signature, *args) except Exception as e: logging.basicConfig() _logger.error('Unable to set arguments %r according to ' 'signature %r: %s: %s', args, signature, e.__class__, e) raise # make a blocking call reply_message = self.send_message_with_reply_and_block( > message, timeout) E dbus.exceptions.DBusException: org.libvirt.Error: internal error: domain 'test' not running /usr/lib64/python3.7/site-packages/dbus/connection.py:651: DBusException --------------------------- Captured stderr teardown --------------------------- Disconnected from D-Bus. ___________________________ TestDomain.test_undefine ___________________________ self = <test_domain.TestDomain object at 0x7f329e1af358> def test_undefine(self): def domain_undefined(path, event, detail): if event != libvirttest.DomainEvent.UNDEFINED: return assert detail == libvirttest.DomainEventUndefinedDetailType.REMOVED assert isinstance(path, dbus.ObjectPath) self.loop.quit() self.connect.connect_to_signal('DomainEvent', domain_undefined) _, domain = self.get_test_domain() > domain.Shutdown(0) ../../tests/test_domain.py:143: _ _ _ _ _ _ _ _ _ _ _ _ _ _ _ _ _ _ _ _ _ _ _ _ _ _ _ _ _ _ _ _ _ _ _ _ _ _ _ _ /usr/lib64/python3.7/site-packages/dbus/proxies.py:70: in __call__ return self._proxy_method(*args, **keywords) /usr/lib64/python3.7/site-packages/dbus/proxies.py:145: in __call__ **keywords) _ _ _ _ _ _ _ _ _ _ _ _ _ _ _ _ _ _ _ _ _ _ _ _ _ _ _ _ _ _ _ _ _ _ _ _ _ _ _ _ self = <dbus._dbus.SessionBus (session) at 0x7f329e399468> bus_name = dbus.String(':1.2') object_path = dbus.ObjectPath('/org/libvirt/Test/domain/_6695eb01_f6a4_8304_79aa_97f2502e193f') dbus_interface = 'org.libvirt.Domain', method = 'Shutdown', signature = 'u' args = (0,), timeout = -1.0, byte_arrays = False, kwargs = {} get_args_opts = {'byte_arrays': False} message = <dbus.lowlevel.MethodCallMessage path: /org/libvirt/Test/domain/_6695eb01_f6a4_8304_79aa_97f2502e193f, iface: org.libvirt.Domain, member: Shutdown dest: :1.2> def call_blocking(self, bus_name, object_path, dbus_interface, method, signature, args, timeout=-1.0, byte_arrays=False, **kwargs): """Call the given method, synchronously. :Since: 0.81.0 """ if object_path == LOCAL_PATH: raise DBusException('Methods may not be called on the reserved ' 'path %s' % LOCAL_PATH) if dbus_interface == LOCAL_IFACE: raise DBusException('Methods may not be called on the reserved ' 'interface %s' % LOCAL_IFACE) # no need to validate other args - MethodCallMessage ctor will do get_args_opts = dict(byte_arrays=byte_arrays) if is_py2: get_args_opts['utf8_strings'] = kwargs.get('utf8_strings', False) elif 'utf8_strings' in kwargs: raise TypeError("unexpected keyword argument 'utf8_strings'") message = MethodCallMessage(destination=bus_name, path=object_path, interface=dbus_interface, method=method) # Add the arguments to the function try: message.append(signature=signature, *args) except Exception as e: logging.basicConfig() _logger.error('Unable to set arguments %r according to ' 'signature %r: %s: %s', args, signature, e.__class__, e) raise # make a blocking call reply_message = self.send_message_with_reply_and_block( > message, timeout) E dbus.exceptions.DBusException: org.libvirt.Error: internal error: domain 'test' not running /usr/lib64/python3.7/site-packages/dbus/connection.py:651: DBusException --------------------------- Captured stderr teardown --------------------------- Disconnected from D-Bus. =============================== warnings summary =============================== tests/test_domain.py::TestDomain::()::test_resume source:362: DeprecationWarning: invalid escape sequence \ source:399: DeprecationWarning: invalid escape sequence \ tests/test_domain.py::TestDomain::()::test_shutdown source:362: DeprecationWarning: invalid escape sequence \ source:399: DeprecationWarning: invalid escape sequence \ tests/test_domain.py::TestDomain::()::test_suspend source:362: DeprecationWarning: invalid escape sequence \ source:399: DeprecationWarning: invalid escape sequence \ tests/test_domain.py::TestDomain::()::test_undefine source:362: DeprecationWarning: invalid escape sequence \ source:399: DeprecationWarning: invalid escape sequence \ -- Docs: https://docs.pytest.org/en/latest/warnings.html =========== 4 failed, 5 passed, 8 warnings, 1 error in 13.85 seconds =========== FAIL test_domain.py (exit status: 1) FAIL: test_interface.py ======================= ============================= test session starts ============================== platform linux -- Python 3.7.2, pytest-3.9.3, py-1.7.0, pluggy-0.8.1 rootdir: <https://ci.centos.org/job/libvirt-dbus-check/systems=libvirt-fedora-rawhide…,> inifile: collected 5 items ../../tests/test_interface.py ...E. [100%] ==================================== ERRORS ==================================== ______ ERROR at setup of TestInterface.test_interface_get_xml_description ______ self = <test_interface.TestInterface object at 0x7f62db5aef98> request = <SubRequest 'libvirt_dbus_setup' for <Function 'test_interface_get_xml_description'>> @pytest.fixture(autouse=True) def libvirt_dbus_setup(self, request): """Start libvirt-dbus for each test function """ os.environ['LIBVIRT_DEBUG'] = '3' self.libvirt_dbus = subprocess.Popen([exe, '--session']) self.bus = dbus.SessionBus() for i in range(10): if self.bus.name_has_owner('org.libvirt'): break time.sleep(0.1) else: > raise TimeoutError('error starting libvirt-dbus') E TimeoutError: error starting libvirt-dbus ../../tests/libvirttest.py:44: TimeoutError ====================== 4 passed, 1 error in 8.41 seconds ======================= FAIL test_interface.py (exit status: 1) FAIL: test_network.py ===================== ============================= test session starts ============================== platform linux -- Python 3.7.2, pytest-3.9.3, py-1.7.0, pluggy-0.8.1 rootdir: <https://ci.centos.org/job/libvirt-dbus-check/systems=libvirt-fedora-rawhide…,> inifile: collected 7 items ../../tests/test_network.py E.....F [100%] ==================================== ERRORS ==================================== __________ ERROR at setup of TestNetwork.test_network_properties_type __________ self = <test_network.TestNetwork object at 0x7fc0780dcd30> request = <SubRequest 'libvirt_dbus_setup' for <Function 'test_network_properties_type'>> @pytest.fixture(autouse=True) def libvirt_dbus_setup(self, request): """Start libvirt-dbus for each test function """ os.environ['LIBVIRT_DEBUG'] = '3' self.libvirt_dbus = subprocess.Popen([exe, '--session']) self.bus = dbus.SessionBus() for i in range(10): if self.bus.name_has_owner('org.libvirt'): break time.sleep(0.1) else: > raise TimeoutError('error starting libvirt-dbus') E TimeoutError: error starting libvirt-dbus ../../tests/libvirttest.py:44: TimeoutError ---------------------------- Captured stderr setup ----------------------------- dbus-daemon[1093]: Cannot setup inotify for '/home/jenkins/.local/share/dbus-1/services'; error 'Permission denied' =================================== FAILURES =================================== TestNetwork.test_network_update[4-4-0-\n <host mac='00:16:3e:77:e2:ed' name='foo.example.com' ip='192.168.122.10'/>\n -0] self = <test_network.TestNetwork object at 0x7fc077f9af98>, command = '4' section = '4', parentIndex = 0 xml_str = "\n <host mac='00:16:3e:77:e2:ed' name='foo.example.com' ip='192.168.122.10'/>\n " flags = 0 @pytest.mark.parametrize("command, section, parentIndex, xml_str, flags", [ ('4', '4', 0, ip_dhcp_host_xml, 0), # add-first, ip-dhcp-host ]) def test_network_update(self, command, section, parentIndex, xml_str, flags): > _, test_network = self.get_test_network() ../../tests/test_network.py:91: _ _ _ _ _ _ _ _ _ _ _ _ _ _ _ _ _ _ _ _ _ _ _ _ _ _ _ _ _ _ _ _ _ _ _ _ _ _ _ _ self = <test_network.TestNetwork object at 0x7fc077f9af98> def get_test_network(self): """Fetch information for the test network from test driver Returns: (dbus.proxies.ProxyObject, dbus.proxies.ProxyObject): Test Network Object, Local proxy for the test Network Object. """ > path = self.connect.ListNetworks(0)[0] E IndexError: list index out of range ../../tests/libvirttest.py:138: IndexError --------------------------- Captured stderr teardown --------------------------- Disconnected from D-Bus. ================= 1 failed, 5 passed, 1 error in 5.81 seconds ================== FAIL test_network.py (exit status: 1) + exit 1 Build step 'Execute shell' marked build as failure
1 1
0 0
[Libvirt-ci] Fixed: libvirt/libvirt#2019 (master - fa5db00)
by Travis CI 14 Feb '19

14 Feb '19
Build Update for libvirt/libvirt ------------------------------------- Build: #2019 Status: Fixed Duration: 22 mins and 42 secs Commit: fa5db00 (master) Author: Michal Privoznik Message: virkmodtest: Don't fail if modprobe doesn't exist On some very basic installations (e.g. some container images) the modprobe binary might be missing. If that is the case, don't fail virkmodtest. Signed-off-by: Michal Privoznik <mprivozn(a)redhat.com> Reviewed-by: Daniel P. Berrangé <berrange(a)redhat.com> View the changeset: https://github.com/libvirt/libvirt/compare/d3e5c3605a66...fa5db009c98f View the full build log and details: https://travis-ci.org/libvirt/libvirt/builds/493346610?utm_medium=notificat… -- You can unsubscribe from build emails from the libvirt/libvirt repository going to https://travis-ci.org/account/preferences/unsubscribe?repository=4872032&ut…. Or unsubscribe from *all* email updating your settings at https://travis-ci.org/account/preferences/unsubscribe?utm_medium=notificati…. Or configure specific recipients for build notifications in your .travis.yml file. See https://docs.travis-ci.com/user/notifications.
1 0
0 0
[Libvirt-ci] Still Failing: libvirt/libvirt#2018 (master - d3e5c36)
by Travis CI 14 Feb '19

14 Feb '19
Build Update for libvirt/libvirt ------------------------------------- Build: #2018 Status: Still Failing Duration: 48 mins and 22 secs Commit: d3e5c36 (master) Author: Ján Tomko Message: virsh: fix snapshot list --parent The root snapshot does not have a parent. Use NULLSTR_EMPTY to pass an empty string instead of putting too few columns in the table. https://bugzilla.redhat.com/show_bug.cgi?id=1662849 Signed-off-by: Ján Tomko <jtomko(a)redhat.com> Reviewed-by: Eric Blake <eblake(a)redhat.com> View the changeset: https://github.com/libvirt/libvirt/compare/4b23f18d2c9e...d3e5c3605a66 View the full build log and details: https://travis-ci.org/libvirt/libvirt/builds/493303568?utm_medium=notificat… -- You can unsubscribe from build emails from the libvirt/libvirt repository going to https://travis-ci.org/account/preferences/unsubscribe?repository=4872032&ut…. Or unsubscribe from *all* email updating your settings at https://travis-ci.org/account/preferences/unsubscribe?utm_medium=notificati…. Or configure specific recipients for build notifications in your .travis.yml file. See https://docs.travis-ci.com/user/notifications.
1 0
0 0
[Libvirt-ci] Still Failing: libvirt/libvirt#2017 (master - 4b23f18)
by Travis CI 14 Feb '19

14 Feb '19
Build Update for libvirt/libvirt ------------------------------------- Build: #2017 Status: Still Failing Duration: 27 mins and 39 secs Commit: 4b23f18 (master) Author: Michal Privoznik Message: qemu_hotplug: Initialize @charAlias in qemuDomainRemoveChrDevice My change in 112f3a8d0f32 was too drastic. The @charAlias variable is initialized only if @monitor == true. However, it is used even outside of that condition, at which point it's just uninitialized pointer. Reported-by: John Ferlan <jferlan(a)redhat.com> Signed-off-by: Michal Privoznik <mprivozn(a)redhat.com> Reviewed-by: John Ferlan <jferlan(a)redhat.com> View the changeset: https://github.com/libvirt/libvirt/compare/4c4ff7a1a008...4b23f18d2c9e View the full build log and details: https://travis-ci.org/libvirt/libvirt/builds/493266739?utm_medium=notificat… -- You can unsubscribe from build emails from the libvirt/libvirt repository going to https://travis-ci.org/account/preferences/unsubscribe?repository=4872032&ut…. Or unsubscribe from *all* email updating your settings at https://travis-ci.org/account/preferences/unsubscribe?utm_medium=notificati…. Or configure specific recipients for build notifications in your .travis.yml file. See https://docs.travis-ci.com/user/notifications.
1 0
0 0
[Libvirt-ci] Still Failing: libvirt/libvirt#2016 (master - 4c4ff7a)
by Travis CI 14 Feb '19

14 Feb '19
Build Update for libvirt/libvirt ------------------------------------- Build: #2016 Status: Still Failing Duration: 25 mins and 36 secs Commit: 4c4ff7a (master) Author: Marc Hartmayer Message: udev: only report a warning if udev_enumerate_scan_devices fails Even if an error is reported by `udev_enumerate_scan_devices`, e.g. because a driver of a device has an bug, we can still enumerate all other devices. Additionally the documentation of udev_enumerate_scan_devices says that on success an integer >= 0 is returned (see man udev_enumerate_scan_devices(3)). Reviewed-by: Bjoern Walk <bwalk(a)linux.ibm.com> Signed-off-by: Marc Hartmayer <mhartmay(a)linux.ibm.com> Reviewed-by: John Ferlan <jferlan(a)redhat.com> View the changeset: https://github.com/libvirt/libvirt/compare/0f110d5ac869...4c4ff7a1a008 View the full build log and details: https://travis-ci.org/libvirt/libvirt/builds/493252810?utm_medium=notificat… -- You can unsubscribe from build emails from the libvirt/libvirt repository going to https://travis-ci.org/account/preferences/unsubscribe?repository=4872032&ut…. Or unsubscribe from *all* email updating your settings at https://travis-ci.org/account/preferences/unsubscribe?utm_medium=notificati…. Or configure specific recipients for build notifications in your .travis.yml file. See https://docs.travis-ci.com/user/notifications.
1 0
0 0
[Libvirt-ci] Broken: libvirt/libvirt#2015 (master - 0f110d5)
by Travis CI 14 Feb '19

14 Feb '19
Build Update for libvirt/libvirt ------------------------------------- Build: #2015 Status: Broken Duration: 42 mins and 24 secs Commit: 0f110d5 (master) Author: Ján Tomko Message: Use NULLSTR_EMPTY Instead of repetitive: s ? s : "" use NULLSTR_EMPTY. Signed-off-by: Ján Tomko <jtomko(a)redhat.com> Reviewed-by: Andrea Bolognani <abologna(a)redhat.com> View the changeset: https://github.com/libvirt/libvirt/compare/5657e22212c5...0f110d5ac869 View the full build log and details: https://travis-ci.org/libvirt/libvirt/builds/493232534?utm_medium=notificat… -- You can unsubscribe from build emails from the libvirt/libvirt repository going to https://travis-ci.org/account/preferences/unsubscribe?repository=4872032&ut…. Or unsubscribe from *all* email updating your settings at https://travis-ci.org/account/preferences/unsubscribe?utm_medium=notificati…. Or configure specific recipients for build notifications in your .travis.yml file. See https://docs.travis-ci.com/user/notifications.
1 0
0 0
  • ← Newer
  • 1
  • 2
  • 3
  • 4
  • 5
  • 6
  • 7
  • 8
  • 9
  • ...
  • 14
  • Older →

HyperKitty Powered by HyperKitty version 1.3.12.