libvirt List Archives
Sign In Sign Up
Manage this list Sign In Sign Up

Keyboard Shortcuts

Thread View

  • j: Next unread message
  • k: Previous unread message
  • j a: Jump to all threads
  • j l: Jump to MailingList overview

CI

Thread Start a new thread
Download
Threads by month
  • ----- 2025 -----
  • August
  • July
  • June
  • May
  • April
  • March
  • February
  • January
  • ----- 2024 -----
  • December
  • November
  • October
  • September
  • August
  • July
  • June
  • May
  • April
  • March
  • February
  • January
  • ----- 2023 -----
  • December
  • November
  • October
  • September
  • August
  • July
  • June
  • May
  • April
  • March
  • February
  • January
  • ----- 2022 -----
  • December
  • November
  • October
  • September
  • August
  • July
  • June
  • May
  • April
  • March
  • February
  • January
  • ----- 2021 -----
  • December
  • November
  • October
  • September
  • August
  • July
  • June
  • May
  • April
  • March
  • February
  • January
  • ----- 2020 -----
  • December
  • November
  • October
  • September
  • August
  • July
  • June
  • May
  • April
  • March
  • February
  • January
  • ----- 2019 -----
  • December
  • November
  • October
  • September
  • August
  • July
  • June
  • May
  • April
  • March
  • February
  • January
  • ----- 2018 -----
  • December
  • November
  • October
  • September
  • August
  • July
  • June
  • May
  • April
  • March
  • February
  • January
  • ----- 2017 -----
  • December
  • November
  • October
  • September
  • August
  • July
  • June
  • May
  • April
  • March
  • February
  • January
  • ----- 2016 -----
  • December
  • November
  • October
  • September
  • August
  • July
ci@lists.libvirt.org

February 2019

  • 2 participants
  • 132 discussions
[Libvirt-ci] Build failed in Jenkins: libosinfo-syntax-check » libvirt-freebsd-11 #96
by ci@centos.org 18 Feb '19

18 Feb '19
See <https://ci.centos.org/job/libosinfo-syntax-check/systems=libvirt-freebsd-11…> ------------------------------------------ Started by upstream project "libosinfo-syntax-check" build number 96 originally caused by: Started by upstream project "libosinfo-build" build number 99 originally caused by: Started by an SCM change [EnvInject] - Loading node environment variables. Building remotely on libvirt-freebsd-11 (libvirt) in workspace <https://ci.centos.org/job/libosinfo-syntax-check/systems=libvirt-freebsd-11…> [libosinfo] $ /bin/sh -xe /tmp/jenkins8749326905301146382.sh + cd build + /usr/local/bin/gmake syntax-check GFDL_version TAB_in_indentation Wundef_boolean avoid_attribute_unused_in_header avoid_if_before_free bindtextdomain bracket_spacing_check cast_of_argument_to_free cast_of_x_alloc_return_value changelog const_long_option copyright_check copyright_format error_message_period error_message_warn_fatal m4_quote_check makefile_TAB_only_indentation makefile_at_at_check makefile_path_separator_check obsolete_symbols po_check preprocessor_indentation prohibit_S_IS_definition prohibit_HAVE_MBRTOWC prohibit_always-defined_macros prohibit_argmatch_without_use prohibit_assert_without_use prohibit_atoi_atof prohibit_backup_files prohibit_c_ctype_without_use prohibit_canonicalize_without_use prohibit_cloexec_without_use prohibit_cvs_keyword prohibit_close_stream_without_use prohibit_defined_have_decl_tests prohibit_doubled_word prohibit_dirent_without_use prohibit_empty_lines_at_EOF prohibit_error_without_use prohibit_hash_pjw_without_use prohibit_hash_without_use prohibit_getopt_without_use prohibit_have_config_h prohibit_ignore_value_without_use prohibit_intprops_without_use prohibit_inttostr_without_use prohibit_long_options_without_use prohibit_magic_number_exit prohibit_openat_without_use prohibit_path_max_allocation prohibit_posixver_without_use prohibit_quote_without_use prohibit_quotearg_without_use prohibit_reversed_compare_failure prohibit_root_dev_ino_without_use prohibit_same_without_use prohibit_safe_read_without_use prohibit_signal_without_use prohibit_stat_st_blocks prohibit_stddef_without_use prohibit_stdio--_without_use prohibit_stdio-safer_without_use prohibit_strcmp prohibit_strings_without_use prohibit_strncpy prohibit_test_double_equal prohibit_test_minus_ao prohibit_undesirable_word_seq prohibit_verify_without_use prohibit_xalloc_without_use prohibit_xfreopen_without_use proper_name_utf8_requires_ICONV redundant_const require_config_h require_config_h_first require_test_exit_idiom space_tab texinfo_acronym tight_scope trailing_blank unmarked_diagnostics useless_cpp_parens vulnerable_makefile_CVE-2009-4029 vulnerable_makefile_CVE-2012-3386 GEN sc_bracket_spacing_check ../tests/test-uris-common.c maint.mk: empty line(s) or no newline at EOF gmake: *** [../maint.mk:926: sc_prohibit_empty_lines_at_EOF] Error 1 gmake: *** Waiting for unfinished jobs.... Build step 'Execute shell' marked build as failure
1 2
0 0
[Libvirt-ci] Build failed in Jenkins: libosinfo-syntax-check » libvirt-centos-7 #96
by ci@centos.org 18 Feb '19

18 Feb '19
See <https://ci.centos.org/job/libosinfo-syntax-check/systems=libvirt-centos-7/9…> ------------------------------------------ Started by upstream project "libosinfo-syntax-check" build number 96 originally caused by: Started by upstream project "libosinfo-build" build number 99 originally caused by: Started by an SCM change [EnvInject] - Loading node environment variables. Building remotely on libvirt-centos-7 (libvirt) in workspace <https://ci.centos.org/job/libosinfo-syntax-check/systems=libvirt-centos-7/w…> [libosinfo] $ /bin/sh -xe /tmp/jenkins431390190633187583.sh + cd build + /usr/bin/gmake syntax-check GFDL_version TAB_in_indentation Wundef_boolean avoid_attribute_unused_in_header avoid_if_before_free bindtextdomain bracket_spacing_check cast_of_argument_to_free cast_of_x_alloc_return_value changelog const_long_option copyright_check copyright_format error_message_period error_message_warn_fatal m4_quote_check makefile_TAB_only_indentation makefile_at_at_check makefile_path_separator_check obsolete_symbols po_check prohibit_HAVE_MBRTOWC prohibit_S_IS_definition prohibit_always-defined_macros preprocessor_indentation prohibit_argmatch_without_use prohibit_assert_without_use prohibit_atoi_atof prohibit_backup_files prohibit_c_ctype_without_use prohibit_canonicalize_without_use prohibit_cloexec_without_use prohibit_close_stream_without_use prohibit_cvs_keyword prohibit_dirent_without_use prohibit_defined_have_decl_tests prohibit_doubled_word prohibit_empty_lines_at_EOF prohibit_error_without_use prohibit_getopt_without_use prohibit_hash_pjw_without_use prohibit_hash_without_use prohibit_have_config_h prohibit_ignore_value_without_use prohibit_inttostr_without_use prohibit_long_options_without_use prohibit_intprops_without_use prohibit_magic_number_exit prohibit_openat_without_use prohibit_path_max_allocation prohibit_posixver_without_use prohibit_quote_without_use prohibit_quotearg_without_use prohibit_reversed_compare_failure prohibit_root_dev_ino_without_use prohibit_safe_read_without_use prohibit_same_without_use prohibit_signal_without_use prohibit_stat_st_blocks prohibit_stddef_without_use prohibit_stdio--_without_use prohibit_stdio-safer_without_use prohibit_strncpy prohibit_strings_without_use prohibit_strcmp prohibit_test_double_equal prohibit_test_minus_ao prohibit_undesirable_word_seq prohibit_verify_without_use prohibit_xalloc_without_use prohibit_xfreopen_without_use proper_name_utf8_requires_ICONV redundant_const require_config_h require_config_h_first require_test_exit_idiom space_tab texinfo_acronym tight_scope trailing_blank unmarked_diagnostics useless_cpp_parens vulnerable_makefile_CVE-2009-4029 vulnerable_makefile_CVE-2012-3386 GEN sc_bracket_spacing_check maint.mk: skipping test sc_preprocessor_indentation: cppi not installed ../tests/test-uris-common.c maint.mk: empty line(s) or no newline at EOF gmake: *** [sc_prohibit_empty_lines_at_EOF] Error 1 gmake: *** Waiting for unfinished jobs.... Build step 'Execute shell' marked build as failure
1 2
0 0
[Libvirt-ci] Build failed in Jenkins: libosinfo-syntax-check » libvirt-fedora-28 #96
by ci@centos.org 18 Feb '19

18 Feb '19
See <https://ci.centos.org/job/libosinfo-syntax-check/systems=libvirt-fedora-28/…> ------------------------------------------ Started by upstream project "libosinfo-syntax-check" build number 96 originally caused by: Started by upstream project "libosinfo-build" build number 99 originally caused by: Started by an SCM change [EnvInject] - Loading node environment variables. Building remotely on libvirt-fedora-28 (libvirt) in workspace <https://ci.centos.org/job/libosinfo-syntax-check/systems=libvirt-fedora-28/…> [libosinfo] $ /bin/sh -xe /tmp/jenkins2308330718169212890.sh + cd build + /usr/bin/gmake syntax-check GFDL_version TAB_in_indentation Wundef_boolean avoid_attribute_unused_in_header avoid_if_before_free bindtextdomain bracket_spacing_check cast_of_argument_to_free cast_of_x_alloc_return_value changelog const_long_option copyright_check copyright_format error_message_period error_message_warn_fatal m4_quote_check makefile_TAB_only_indentation makefile_at_at_check makefile_path_separator_check obsolete_symbols po_check preprocessor_indentation prohibit_HAVE_MBRTOWC prohibit_S_IS_definition prohibit_always-defined_macros prohibit_argmatch_without_use prohibit_assert_without_use prohibit_atoi_atof prohibit_backup_files prohibit_c_ctype_without_use prohibit_canonicalize_without_use prohibit_cloexec_without_use prohibit_close_stream_without_use prohibit_cvs_keyword prohibit_defined_have_decl_tests prohibit_dirent_without_use prohibit_doubled_word prohibit_empty_lines_at_EOF prohibit_error_without_use prohibit_getopt_without_use prohibit_hash_pjw_without_use prohibit_hash_without_use prohibit_have_config_h prohibit_ignore_value_without_use prohibit_intprops_without_use prohibit_inttostr_without_use prohibit_long_options_without_use prohibit_magic_number_exit prohibit_openat_without_use prohibit_path_max_allocation prohibit_posixver_without_use prohibit_quote_without_use prohibit_quotearg_without_use prohibit_reversed_compare_failure prohibit_root_dev_ino_without_use prohibit_safe_read_without_use prohibit_same_without_use prohibit_signal_without_use prohibit_stat_st_blocks prohibit_stddef_without_use prohibit_stdio--_without_use prohibit_stdio-safer_without_use prohibit_strcmp prohibit_strings_without_use prohibit_test_double_equal prohibit_strncpy prohibit_test_minus_ao prohibit_undesirable_word_seq prohibit_verify_without_use prohibit_xalloc_without_use prohibit_xfreopen_without_use proper_name_utf8_requires_ICONV redundant_const require_config_h require_config_h_first require_test_exit_idiom space_tab texinfo_acronym tight_scope trailing_blank unmarked_diagnostics useless_cpp_parens vulnerable_makefile_CVE-2009-4029 vulnerable_makefile_CVE-2012-3386 GEN sc_bracket_spacing_check ../tests/test-uris-common.c maint.mk: empty line(s) or no newline at EOF gmake: *** [../maint.mk:926: sc_prohibit_empty_lines_at_EOF] Error 1 gmake: *** Waiting for unfinished jobs.... Build step 'Execute shell' marked build as failure
1 2
0 0
[Libvirt-ci] Build failed in Jenkins: libosinfo-syntax-check » libvirt-fedora-29 #96
by ci@centos.org 18 Feb '19

18 Feb '19
See <https://ci.centos.org/job/libosinfo-syntax-check/systems=libvirt-fedora-29/…> ------------------------------------------ Started by upstream project "libosinfo-syntax-check" build number 96 originally caused by: Started by upstream project "libosinfo-build" build number 99 originally caused by: Started by an SCM change [EnvInject] - Loading node environment variables. Building remotely on libvirt-fedora-29 (libvirt) in workspace <https://ci.centos.org/job/libosinfo-syntax-check/systems=libvirt-fedora-29/…> [libosinfo] $ /bin/sh -xe /tmp/jenkins7265978817975161493.sh + cd build + /usr/bin/gmake syntax-check TAB_in_indentation GFDL_version Wundef_boolean avoid_attribute_unused_in_header avoid_if_before_free bindtextdomain bracket_spacing_check cast_of_argument_to_free cast_of_x_alloc_return_value changelog const_long_option copyright_check copyright_format error_message_period error_message_warn_fatal m4_quote_check makefile_TAB_only_indentation makefile_at_at_check makefile_path_separator_check obsolete_symbols po_check preprocessor_indentation prohibit_HAVE_MBRTOWC prohibit_S_IS_definition prohibit_always-defined_macros prohibit_argmatch_without_use prohibit_assert_without_use prohibit_atoi_atof prohibit_backup_files prohibit_c_ctype_without_use prohibit_canonicalize_without_use prohibit_cloexec_without_use prohibit_close_stream_without_use prohibit_cvs_keyword prohibit_defined_have_decl_tests prohibit_dirent_without_use prohibit_doubled_word prohibit_empty_lines_at_EOF prohibit_error_without_use prohibit_getopt_without_use prohibit_hash_pjw_without_use prohibit_hash_without_use prohibit_have_config_h prohibit_ignore_value_without_use prohibit_intprops_without_use prohibit_inttostr_without_use prohibit_long_options_without_use prohibit_magic_number_exit prohibit_openat_without_use prohibit_path_max_allocation prohibit_posixver_without_use prohibit_quote_without_use prohibit_quotearg_without_use prohibit_reversed_compare_failure prohibit_root_dev_ino_without_use prohibit_safe_read_without_use prohibit_same_without_use prohibit_signal_without_use prohibit_stat_st_blocks prohibit_stddef_without_use prohibit_stdio--_without_use prohibit_stdio-safer_without_use prohibit_strcmp prohibit_strings_without_use prohibit_strncpy prohibit_test_double_equal prohibit_test_minus_ao prohibit_undesirable_word_seq prohibit_verify_without_use prohibit_xalloc_without_use prohibit_xfreopen_without_use proper_name_utf8_requires_ICONV redundant_const require_config_h require_config_h_first require_test_exit_idiom space_tab texinfo_acronym tight_scope trailing_blank unmarked_diagnostics useless_cpp_parens vulnerable_makefile_CVE-2009-4029 vulnerable_makefile_CVE-2012-3386 GEN sc_bracket_spacing_check ../tests/test-uris-common.c maint.mk: empty line(s) or no newline at EOF gmake: *** [../maint.mk:926: sc_prohibit_empty_lines_at_EOF] Error 1 gmake: *** Waiting for unfinished jobs.... Build step 'Execute shell' marked build as failure
1 2
0 0
[Libvirt-ci] Build failed in Jenkins: libosinfo-syntax-check » libvirt-debian-9 #96
by ci@centos.org 18 Feb '19

18 Feb '19
See <https://ci.centos.org/job/libosinfo-syntax-check/systems=libvirt-debian-9/9…> ------------------------------------------ Started by upstream project "libosinfo-syntax-check" build number 96 originally caused by: Started by upstream project "libosinfo-build" build number 99 originally caused by: Started by an SCM change [EnvInject] - Loading node environment variables. Building remotely on libvirt-debian-9 (libvirt) in workspace <https://ci.centos.org/job/libosinfo-syntax-check/systems=libvirt-debian-9/w…> [libosinfo] $ /bin/sh -xe /tmp/jenkins1562676934238075581.sh + cd build + /usr/bin/make syntax-check GFDL_version TAB_in_indentation Wundef_boolean avoid_attribute_unused_in_header avoid_if_before_free bindtextdomain bracket_spacing_check cast_of_x_alloc_return_value cast_of_argument_to_free changelog const_long_option copyright_format copyright_check error_message_period error_message_warn_fatal m4_quote_check makefile_TAB_only_indentation makefile_at_at_check makefile_path_separator_check obsolete_symbols preprocessor_indentation po_check prohibit_HAVE_MBRTOWC prohibit_S_IS_definition prohibit_always-defined_macros prohibit_argmatch_without_use prohibit_assert_without_use prohibit_atoi_atof prohibit_backup_files prohibit_c_ctype_without_use prohibit_canonicalize_without_use prohibit_cloexec_without_use prohibit_close_stream_without_use prohibit_cvs_keyword prohibit_dirent_without_use prohibit_defined_have_decl_tests prohibit_doubled_word prohibit_error_without_use prohibit_empty_lines_at_EOF prohibit_hash_pjw_without_use prohibit_getopt_without_use prohibit_hash_without_use prohibit_have_config_h prohibit_ignore_value_without_use prohibit_intprops_without_use prohibit_inttostr_without_use prohibit_long_options_without_use prohibit_magic_number_exit prohibit_openat_without_use prohibit_path_max_allocation prohibit_posixver_without_use prohibit_quote_without_use prohibit_quotearg_without_use prohibit_reversed_compare_failure prohibit_safe_read_without_use prohibit_root_dev_ino_without_use prohibit_same_without_use prohibit_stat_st_blocks prohibit_stddef_without_use prohibit_signal_without_use prohibit_stdio-safer_without_use prohibit_stdio--_without_use prohibit_strcmp prohibit_strings_without_use prohibit_test_double_equal prohibit_strncpy prohibit_test_minus_ao prohibit_undesirable_word_seq prohibit_verify_without_use prohibit_xalloc_without_use prohibit_xfreopen_without_use redundant_const proper_name_utf8_requires_ICONV require_config_h require_config_h_first space_tab require_test_exit_idiom texinfo_acronym tight_scope trailing_blank unmarked_diagnostics useless_cpp_parens vulnerable_makefile_CVE-2009-4029 vulnerable_makefile_CVE-2012-3386 GEN sc_bracket_spacing_check maint.mk: skipping test sc_preprocessor_indentation: cppi not installed ../tests/test-uris-common.c maint.mk: empty line(s) or no newline at EOF ../maint.mk:926: recipe for target 'sc_prohibit_empty_lines_at_EOF' failed make: *** [sc_prohibit_empty_lines_at_EOF] Error 1 make: *** Waiting for unfinished jobs.... Build step 'Execute shell' marked build as failure
1 2
0 0
[Libvirt-ci] Build failed in Jenkins: libosinfo-syntax-check » libvirt-debian-8 #96
by ci@centos.org 18 Feb '19

18 Feb '19
See <https://ci.centos.org/job/libosinfo-syntax-check/systems=libvirt-debian-8/9…> ------------------------------------------ Started by upstream project "libosinfo-syntax-check" build number 96 originally caused by: Started by upstream project "libosinfo-build" build number 99 originally caused by: Started by an SCM change [EnvInject] - Loading node environment variables. Building remotely on libvirt-debian-8 (libvirt) in workspace <https://ci.centos.org/job/libosinfo-syntax-check/systems=libvirt-debian-8/w…> [libosinfo] $ /bin/sh -xe /tmp/jenkins5440080298647442646.sh + cd build + /usr/bin/make syntax-check GFDL_version TAB_in_indentation Wundef_boolean avoid_attribute_unused_in_header avoid_if_before_free bindtextdomain bracket_spacing_check cast_of_argument_to_free cast_of_x_alloc_return_value changelog const_long_option copyright_check copyright_format error_message_period error_message_warn_fatal m4_quote_check makefile_TAB_only_indentation makefile_at_at_check makefile_path_separator_check obsolete_symbols po_check preprocessor_indentation prohibit_HAVE_MBRTOWC prohibit_S_IS_definition prohibit_always-defined_macros prohibit_argmatch_without_use prohibit_assert_without_use prohibit_backup_files prohibit_atoi_atof prohibit_c_ctype_without_use prohibit_canonicalize_without_use prohibit_cloexec_without_use prohibit_close_stream_without_use prohibit_cvs_keyword prohibit_dirent_without_use prohibit_defined_have_decl_tests prohibit_doubled_word prohibit_empty_lines_at_EOF prohibit_error_without_use prohibit_getopt_without_use prohibit_hash_pjw_without_use prohibit_hash_without_use prohibit_have_config_h prohibit_ignore_value_without_use prohibit_intprops_without_use prohibit_inttostr_without_use prohibit_long_options_without_use prohibit_magic_number_exit prohibit_openat_without_use prohibit_path_max_allocation prohibit_posixver_without_use prohibit_quote_without_use prohibit_quotearg_without_use prohibit_reversed_compare_failure prohibit_safe_read_without_use prohibit_root_dev_ino_without_use prohibit_same_without_use prohibit_signal_without_use prohibit_stat_st_blocks prohibit_stddef_without_use prohibit_stdio--_without_use prohibit_stdio-safer_without_use prohibit_strings_without_use prohibit_strcmp prohibit_strncpy prohibit_test_double_equal prohibit_test_minus_ao prohibit_undesirable_word_seq prohibit_verify_without_use prohibit_xalloc_without_use prohibit_xfreopen_without_use proper_name_utf8_requires_ICONV redundant_const require_config_h require_config_h_first require_test_exit_idiom space_tab tight_scope texinfo_acronym trailing_blank unmarked_diagnostics vulnerable_makefile_CVE-2009-4029 useless_cpp_parens vulnerable_makefile_CVE-2012-3386 GEN sc_bracket_spacing_check maint.mk: skipping test sc_preprocessor_indentation: cppi not installed ../tests/test-uris-common.c maint.mk: empty line(s) or no newline at EOF ../maint.mk:926: recipe for target 'sc_prohibit_empty_lines_at_EOF' failed make: *** [sc_prohibit_empty_lines_at_EOF] Error 1 make: *** Waiting for unfinished jobs.... Build step 'Execute shell' marked build as failure
1 2
0 0
[Libvirt-ci] Build failed in Jenkins: libosinfo-check » libvirt-fedora-rawhide #93
by ci@centos.org 18 Feb '19

18 Feb '19
See <https://ci.centos.org/job/libosinfo-check/systems=libvirt-fedora-rawhide/93…> ------------------------------------------ Started by upstream project "libosinfo-check" build number 93 originally caused by: Started by upstream project "libosinfo-syntax-check" build number 94 originally caused by: Started by upstream project "libosinfo-build" build number 97 originally caused by: Started by an SCM change [EnvInject] - Loading node environment variables. Building remotely on libvirt-fedora-rawhide (libvirt) in workspace <https://ci.centos.org/job/libosinfo-check/systems=libvirt-fedora-rawhide/ws/> [libosinfo] $ /bin/sh -xe /tmp/jenkins6012909466857481289.sh + cd build + /usr/bin/gmake check GEN public-submodule-commit Making check in osinfo gmake[1]: Entering directory '<https://ci.centos.org/job/libosinfo-check/systems=libvirt-fedora-rawhide/ws…'> /usr/bin/gmake check-am gmake[2]: Entering directory '<https://ci.centos.org/job/libosinfo-check/systems=libvirt-fedora-rawhide/ws…'> /usr/bin/gmake check-local gmake[3]: Entering directory '<https://ci.centos.org/job/libosinfo-check/systems=libvirt-fedora-rawhide/ws…'> GEN check-symfile GEN check-symsorting gmake[3]: Leaving directory '<https://ci.centos.org/job/libosinfo-check/systems=libvirt-fedora-rawhide/ws…'> gmake[2]: Leaving directory '<https://ci.centos.org/job/libosinfo-check/systems=libvirt-fedora-rawhide/ws…'> gmake[1]: Leaving directory '<https://ci.centos.org/job/libosinfo-check/systems=libvirt-fedora-rawhide/ws…'> Making check in tools gmake[1]: Entering directory '<https://ci.centos.org/job/libosinfo-check/systems=libvirt-fedora-rawhide/ws…'> gmake[1]: Nothing to be done for 'check'. gmake[1]: Leaving directory '<https://ci.centos.org/job/libosinfo-check/systems=libvirt-fedora-rawhide/ws…'> Making check in docs gmake[1]: Entering directory '<https://ci.centos.org/job/libosinfo-check/systems=libvirt-fedora-rawhide/ws…'> Making check in reference gmake[2]: Entering directory '<https://ci.centos.org/job/libosinfo-check/systems=libvirt-fedora-rawhide/ws…'> gmake[2]: Nothing to be done for 'check'. gmake[2]: Leaving directory '<https://ci.centos.org/job/libosinfo-check/systems=libvirt-fedora-rawhide/ws…'> gmake[2]: Entering directory '<https://ci.centos.org/job/libosinfo-check/systems=libvirt-fedora-rawhide/ws…'> gmake[2]: Nothing to be done for 'check-am'. gmake[2]: Leaving directory '<https://ci.centos.org/job/libosinfo-check/systems=libvirt-fedora-rawhide/ws…'> gmake[1]: Leaving directory '<https://ci.centos.org/job/libosinfo-check/systems=libvirt-fedora-rawhide/ws…'> Making check in po gmake[1]: Entering directory '<https://ci.centos.org/job/libosinfo-check/systems=libvirt-fedora-rawhide/ws…'> INTLTOOL_EXTRACT="/usr/bin/intltool-extract" XGETTEXT="/usr/bin/xgettext" srcdir=../../po /usr/bin/intltool-update --gettext-package libosinfo --pot rm -f missing notexist srcdir=../../po /usr/bin/intltool-update -m if [ -r missing -o -r notexist ]; then \ exit 1; \ fi gmake[1]: Leaving directory '<https://ci.centos.org/job/libosinfo-check/systems=libvirt-fedora-rawhide/ws…'> Making check in examples gmake[1]: Entering directory '<https://ci.centos.org/job/libosinfo-check/systems=libvirt-fedora-rawhide/ws…'> gmake[1]: Nothing to be done for 'check'. gmake[1]: Leaving directory '<https://ci.centos.org/job/libosinfo-check/systems=libvirt-fedora-rawhide/ws…'> Making check in tests gmake[1]: Entering directory '<https://ci.centos.org/job/libosinfo-check/systems=libvirt-fedora-rawhide/ws…'> /usr/bin/gmake test-entity test-device test-list test-devicelist test-devicelinklist test-filter test-media test-product test-os test-oslist test-productfilter test-platform test-platformlist test-db test-loader test-isodetect test-install-script test-image test-imagelist test-mediauris test-treeuris test-imageuris gmake[2]: Entering directory '<https://ci.centos.org/job/libosinfo-check/systems=libvirt-fedora-rawhide/ws…'> CC test_list-test-list.o CC test_entity-test-entity.o CC test_device-test-device.o CC test_devicelist-test-devicelist.o CC test_devicelinklist-test-devicelinklist.o CC test_filter-test-filter.o CC test_media-test-media.o CC test_product-test-product.o CC test_os-test-os.o CC test_oslist-test-oslist.o CC test_productfilter-test-productfilter.o CC test_platform-test-platform.o CC test_platformlist-test-platformlist.o CC test_db-test-db.o CC test_loader-test-loader.o CC test_isodetect-test-isodetect.o CC test_install_script-test-install-script.o CC test_image-test-image.o CC test_imagelist-test-imagelist.o CC test_mediauris-test-mediauris.o CC test_treeuris-test-treeuris.o CC test_imageuris-test-imageuris.o CCLD test-entity CCLD test-device CCLD test-list CCLD test-devicelist CCLD test-devicelinklist CCLD test-filter CCLD test-media CCLD test-product CCLD test-os CCLD test-oslist CCLD test-productfilter CCLD test-platform CCLD test-platformlist CCLD test-db CCLD test-loader CCLD test-isodetect CCLD test-install-script CCLD test-image CCLD test-imagelist CCLD test-mediauris CCLD test-treeuris CCLD test-imageuris gmake[2]: Leaving directory '<https://ci.centos.org/job/libosinfo-check/systems=libvirt-fedora-rawhide/ws…'> /usr/bin/gmake check-TESTS gmake[2]: Entering directory '<https://ci.centos.org/job/libosinfo-check/systems=libvirt-fedora-rawhide/ws…'> gmake[3]: Entering directory '<https://ci.centos.org/job/libosinfo-check/systems=libvirt-fedora-rawhide/ws…'> PASS: test-list PASS: test-device PASS: test-entity PASS: test-devicelist PASS: test-devicelinklist PASS: test-filter PASS: test-product PASS: test-oslist PASS: test-media PASS: test-productfilter PASS: test-platform PASS: test-platformlist PASS: test-db PASS: test-loader PASS: test-install-script PASS: test-image PASS: test-imagelist SKIP: test-mediauris SKIP: test-treeuris SKIP: test-imageuris PASS: test-os FAIL: test-isodetect ============================================================================ Testsuite summary for libosinfo 1.4.0 ============================================================================ # TOTAL: 22 # PASS: 18 # SKIP: 3 # XFAIL: 0 # FAIL: 1 # XPASS: 0 # ERROR: 0 ============================================================================ See tests/test-suite.log Please report to libosinfo(a)redhat.com ============================================================================ gmake[3]: *** [Makefile:1440: test-suite.log] Error 1 gmake[3]: Leaving directory '<https://ci.centos.org/job/libosinfo-check/systems=libvirt-fedora-rawhide/ws…'> gmake[2]: *** [Makefile:1548: check-TESTS] Error 2 gmake[2]: Leaving directory '<https://ci.centos.org/job/libosinfo-check/systems=libvirt-fedora-rawhide/ws…'> gmake[1]: *** [Makefile:1769: check-am] Error 2 gmake[1]: Leaving directory '<https://ci.centos.org/job/libosinfo-check/systems=libvirt-fedora-rawhide/ws…'> gmake: *** [Makefile:594: check-recursive] Error 1 + cat tests/test-suite.log =========================================== libosinfo 1.4.0: tests/test-suite.log =========================================== # TOTAL: 22 # PASS: 18 # SKIP: 3 # XFAIL: 0 # FAIL: 1 # XPASS: 0 # ERROR: 0 .. contents:: :depth: 2 FAIL: test-isodetect ==================== /isodetect/pureos: OK /isodetect/eos: OK /isodetect/windows: OK /isodetect/ubuntu: ISO ubuntu-18.04.1.0-live-server-amd64.iso.txt was not matched by OS ubuntu18.04 /isodetect/ubuntu: FAIL /isodetect/sles: OK /isodetect/sled: OK /isodetect/rhel: OK /isodetect/popos: OK /isodetect/opensuse: OK /isodetect/openbsd: OK /isodetect/netbsd: OK /isodetect/mageia: OK /isodetect/haiku: OK /isodetect/gnome: OK /isodetect/freedos: OK /isodetect/freebsd: OK /isodetect/fedora: OK /isodetect/dragonflybsd: OK /isodetect/debian: OK /isodetect/centos: OK /isodetect/asianux: OK /isodetect/android-x86: OK /isodetect/altlinux: OK /isodetect/alpinelinux: OK FAIL test-isodetect (exit status: 1) SKIP: test-mediauris ==================== SKIP test-mediauris (exit status: 77) SKIP: test-treeuris =================== SKIP test-treeuris (exit status: 77) SKIP: test-imageuris ==================== SKIP test-imageuris (exit status: 77) + exit 1 Build step 'Execute shell' marked build as failure
1 1
0 0
[Libvirt-ci] Build failed in Jenkins: libosinfo-check » libvirt-freebsd-12 #93
by ci@centos.org 18 Feb '19

18 Feb '19
See <https://ci.centos.org/job/libosinfo-check/systems=libvirt-freebsd-12/93/dis…> ------------------------------------------ Started by upstream project "libosinfo-check" build number 93 originally caused by: Started by upstream project "libosinfo-syntax-check" build number 94 originally caused by: Started by upstream project "libosinfo-build" build number 97 originally caused by: Started by an SCM change [EnvInject] - Loading node environment variables. Building remotely on libvirt-freebsd-12 (libvirt) in workspace <https://ci.centos.org/job/libosinfo-check/systems=libvirt-freebsd-12/ws/> [libosinfo] $ /bin/sh -xe /tmp/jenkins5414381805141037675.sh + cd build + /usr/local/bin/gmake check Making check in osinfo GEN public-submodule-commit gmake[1]: Entering directory '/usr<https://ci.centos.org/job/libosinfo-check/systems=libvirt-freebsd-12/ws/bui…'> /usr/local/bin/gmake check-am gmake[2]: Entering directory '/usr<https://ci.centos.org/job/libosinfo-check/systems=libvirt-freebsd-12/ws/bui…'> /usr/local/bin/gmake check-local gmake[3]: Entering directory '/usr<https://ci.centos.org/job/libosinfo-check/systems=libvirt-freebsd-12/ws/bui…'> GEN check-symsorting gmake[3]: Leaving directory '/usr<https://ci.centos.org/job/libosinfo-check/systems=libvirt-freebsd-12/ws/bui…'> gmake[2]: Leaving directory '/usr<https://ci.centos.org/job/libosinfo-check/systems=libvirt-freebsd-12/ws/bui…'> gmake[1]: Leaving directory '/usr<https://ci.centos.org/job/libosinfo-check/systems=libvirt-freebsd-12/ws/bui…'> Making check in tools gmake[1]: Entering directory '/usr<https://ci.centos.org/job/libosinfo-check/systems=libvirt-freebsd-12/ws/bui…'> gmake[1]: Nothing to be done for 'check'. gmake[1]: Leaving directory '/usr<https://ci.centos.org/job/libosinfo-check/systems=libvirt-freebsd-12/ws/bui…'> Making check in docs gmake[1]: Entering directory '/usr<https://ci.centos.org/job/libosinfo-check/systems=libvirt-freebsd-12/ws/bui…'> Making check in reference gmake[2]: Entering directory '/usr<https://ci.centos.org/job/libosinfo-check/systems=libvirt-freebsd-12/ws/bui…'> gmake[2]: Nothing to be done for 'check'. gmake[2]: Leaving directory '/usr<https://ci.centos.org/job/libosinfo-check/systems=libvirt-freebsd-12/ws/bui…'> gmake[2]: Entering directory '/usr<https://ci.centos.org/job/libosinfo-check/systems=libvirt-freebsd-12/ws/bui…'> gmake[2]: Nothing to be done for 'check-am'. gmake[2]: Leaving directory '/usr<https://ci.centos.org/job/libosinfo-check/systems=libvirt-freebsd-12/ws/bui…'> gmake[1]: Leaving directory '/usr<https://ci.centos.org/job/libosinfo-check/systems=libvirt-freebsd-12/ws/bui…'> Making check in po gmake[1]: Entering directory '/usr<https://ci.centos.org/job/libosinfo-check/systems=libvirt-freebsd-12/ws/bui…'> INTLTOOL_EXTRACT="/usr/local/bin/intltool-extract" XGETTEXT="/usr/local/bin/xgettext" srcdir=../../po /usr/local/bin/intltool-update --gettext-package libosinfo --pot rm -f missing notexist srcdir=../../po /usr/local/bin/intltool-update -m if [ -r missing -o -r notexist ]; then \ exit 1; \ fi gmake[1]: Leaving directory '/usr<https://ci.centos.org/job/libosinfo-check/systems=libvirt-freebsd-12/ws/bui…'> Making check in examples gmake[1]: Entering directory '/usr<https://ci.centos.org/job/libosinfo-check/systems=libvirt-freebsd-12/ws/bui…'> gmake[1]: Nothing to be done for 'check'. gmake[1]: Leaving directory '/usr<https://ci.centos.org/job/libosinfo-check/systems=libvirt-freebsd-12/ws/bui…'> Making check in tests gmake[1]: Entering directory '/usr<https://ci.centos.org/job/libosinfo-check/systems=libvirt-freebsd-12/ws/bui…'> /usr/local/bin/gmake test-entity test-device test-list test-devicelist test-devicelinklist test-filter test-media test-product test-os test-oslist test-productfilter test-platform test-platformlist test-db test-loader test-isodetect test-install-script test-image test-imagelist test-mediauris test-treeuris test-imageuris gmake[2]: Entering directory '/usr<https://ci.centos.org/job/libosinfo-check/systems=libvirt-freebsd-12/ws/bui…'> CC test_entity-test-entity.o CC test_device-test-device.o CC test_list-test-list.o CC test_devicelist-test-devicelist.o CC test_devicelinklist-test-devicelinklist.o CC test_filter-test-filter.o CC test_media-test-media.o CC test_product-test-product.o CC test_os-test-os.o CC test_oslist-test-oslist.o CC test_productfilter-test-productfilter.o CC test_platform-test-platform.o CC test_platformlist-test-platformlist.o CC test_db-test-db.o CC test_loader-test-loader.o CC test_isodetect-test-isodetect.o CC test_install_script-test-install-script.o CC test_image-test-image.o CC test_imagelist-test-imagelist.o CC test_mediauris-test-mediauris.o CC test_treeuris-test-treeuris.o CC test_imageuris-test-imageuris.o CCLD test-entity CCLD test-device CCLD test-list CCLD test-devicelist CCLD test-devicelinklist CCLD test-filter CCLD test-media CCLD test-product CCLD test-os CCLD test-oslist CCLD test-productfilter CCLD test-platform CCLD test-platformlist CCLD test-db CCLD test-loader CCLD test-isodetect CCLD test-install-script CCLD test-image CCLD test-imagelist CCLD test-mediauris CCLD test-treeuris CCLD test-imageuris gmake[2]: Leaving directory '/usr<https://ci.centos.org/job/libosinfo-check/systems=libvirt-freebsd-12/ws/bui…'> /usr/local/bin/gmake check-TESTS gmake[2]: Entering directory '/usr<https://ci.centos.org/job/libosinfo-check/systems=libvirt-freebsd-12/ws/bui…'> gmake[3]: Entering directory '/usr<https://ci.centos.org/job/libosinfo-check/systems=libvirt-freebsd-12/ws/bui…'> PASS: test-entity PASS: test-list PASS: test-devicelinklist PASS: test-device PASS: test-devicelist PASS: test-filter PASS: test-product PASS: test-oslist PASS: test-productfilter PASS: test-media PASS: test-platform PASS: test-db PASS: test-platformlist PASS: test-loader PASS: test-install-script PASS: test-image PASS: test-imagelist SKIP: test-mediauris SKIP: test-treeuris SKIP: test-imageuris PASS: test-os FAIL: test-isodetect ============================================================================ Testsuite summary for libosinfo 1.4.0 ============================================================================ # TOTAL: 22 # PASS: 18 # SKIP: 3 # XFAIL: 0 # FAIL: 1 # XPASS: 0 # ERROR: 0 ============================================================================ See tests/test-suite.log Please report to libosinfo(a)redhat.com ============================================================================ gmake[3]: *** [Makefile:1440: test-suite.log] Error 1 gmake[3]: Leaving directory '/usr<https://ci.centos.org/job/libosinfo-check/systems=libvirt-freebsd-12/ws/bui…'> gmake[2]: *** [Makefile:1548: check-TESTS] Error 2 gmake[2]: Leaving directory '/usr<https://ci.centos.org/job/libosinfo-check/systems=libvirt-freebsd-12/ws/bui…'> gmake[1]: *** [Makefile:1769: check-am] Error 2 gmake[1]: Leaving directory '/usr<https://ci.centos.org/job/libosinfo-check/systems=libvirt-freebsd-12/ws/bui…'> gmake: *** [Makefile:594: check-recursive] Error 1 + cat tests/test-suite.log =========================================== libosinfo 1.4.0: tests/test-suite.log =========================================== # TOTAL: 22 # PASS: 18 # SKIP: 3 # XFAIL: 0 # FAIL: 1 # XPASS: 0 # ERROR: 0 .. contents:: :depth: 2 FAIL: test-isodetect ==================== /isodetect/pureos: OK /isodetect/eos: OK /isodetect/windows: OK /isodetect/ubuntu: ISO ubuntu-18.04.1.0-live-server-amd64.iso.txt was not matched by OS ubuntu18.04 /isodetect/ubuntu: FAIL /isodetect/sles: OK /isodetect/sled: OK /isodetect/rhel: OK /isodetect/popos: OK /isodetect/opensuse: OK /isodetect/openbsd: OK /isodetect/netbsd: OK /isodetect/mageia: OK /isodetect/haiku: OK /isodetect/gnome: OK /isodetect/freedos: OK /isodetect/freebsd: OK /isodetect/fedora: OK /isodetect/dragonflybsd: OK /isodetect/debian: OK /isodetect/centos: OK /isodetect/asianux: OK /isodetect/android-x86: OK /isodetect/altlinux: OK /isodetect/alpinelinux: OK FAIL test-isodetect (exit status: 1) SKIP: test-mediauris ==================== SKIP test-mediauris (exit status: 77) SKIP: test-treeuris =================== SKIP test-treeuris (exit status: 77) SKIP: test-imageuris ==================== SKIP test-imageuris (exit status: 77) + exit 1 Build step 'Execute shell' marked build as failure
1 1
0 0
[Libvirt-ci] Build failed in Jenkins: libosinfo-check » libvirt-freebsd-11 #93
by ci@centos.org 18 Feb '19

18 Feb '19
See <https://ci.centos.org/job/libosinfo-check/systems=libvirt-freebsd-11/93/dis…> ------------------------------------------ Started by upstream project "libosinfo-check" build number 93 originally caused by: Started by upstream project "libosinfo-syntax-check" build number 94 originally caused by: Started by upstream project "libosinfo-build" build number 97 originally caused by: Started by an SCM change [EnvInject] - Loading node environment variables. Building remotely on libvirt-freebsd-11 (libvirt) in workspace <https://ci.centos.org/job/libosinfo-check/systems=libvirt-freebsd-11/ws/> [libosinfo] $ /bin/sh -xe /tmp/jenkins8810259437469373807.sh + cd build + /usr/local/bin/gmake check Making check in osinfo GEN public-submodule-commit gmake[1]: Entering directory '/usr<https://ci.centos.org/job/libosinfo-check/systems=libvirt-freebsd-11/ws/bui…'> /usr/local/bin/gmake check-am gmake[2]: Entering directory '/usr<https://ci.centos.org/job/libosinfo-check/systems=libvirt-freebsd-11/ws/bui…'> /usr/local/bin/gmake check-local gmake[3]: Entering directory '/usr<https://ci.centos.org/job/libosinfo-check/systems=libvirt-freebsd-11/ws/bui…'> GEN check-symsorting gmake[3]: Leaving directory '/usr<https://ci.centos.org/job/libosinfo-check/systems=libvirt-freebsd-11/ws/bui…'> gmake[2]: Leaving directory '/usr<https://ci.centos.org/job/libosinfo-check/systems=libvirt-freebsd-11/ws/bui…'> gmake[1]: Leaving directory '/usr<https://ci.centos.org/job/libosinfo-check/systems=libvirt-freebsd-11/ws/bui…'> Making check in tools gmake[1]: Entering directory '/usr<https://ci.centos.org/job/libosinfo-check/systems=libvirt-freebsd-11/ws/bui…'> gmake[1]: Nothing to be done for 'check'. gmake[1]: Leaving directory '/usr<https://ci.centos.org/job/libosinfo-check/systems=libvirt-freebsd-11/ws/bui…'> Making check in docs gmake[1]: Entering directory '/usr<https://ci.centos.org/job/libosinfo-check/systems=libvirt-freebsd-11/ws/bui…'> Making check in reference gmake[2]: Entering directory '/usr<https://ci.centos.org/job/libosinfo-check/systems=libvirt-freebsd-11/ws/bui…'> gmake[2]: Nothing to be done for 'check'. gmake[2]: Leaving directory '/usr<https://ci.centos.org/job/libosinfo-check/systems=libvirt-freebsd-11/ws/bui…'> gmake[2]: Entering directory '/usr<https://ci.centos.org/job/libosinfo-check/systems=libvirt-freebsd-11/ws/bui…'> gmake[2]: Nothing to be done for 'check-am'. gmake[2]: Leaving directory '/usr<https://ci.centos.org/job/libosinfo-check/systems=libvirt-freebsd-11/ws/bui…'> gmake[1]: Leaving directory '/usr<https://ci.centos.org/job/libosinfo-check/systems=libvirt-freebsd-11/ws/bui…'> Making check in po gmake[1]: Entering directory '/usr<https://ci.centos.org/job/libosinfo-check/systems=libvirt-freebsd-11/ws/bui…'> INTLTOOL_EXTRACT="/usr/local/bin/intltool-extract" XGETTEXT="/usr/local/bin/xgettext" srcdir=../../po /usr/local/bin/intltool-update --gettext-package libosinfo --pot rm -f missing notexist srcdir=../../po /usr/local/bin/intltool-update -m if [ -r missing -o -r notexist ]; then \ exit 1; \ fi gmake[1]: Leaving directory '/usr<https://ci.centos.org/job/libosinfo-check/systems=libvirt-freebsd-11/ws/bui…'> Making check in examples gmake[1]: Entering directory '/usr<https://ci.centos.org/job/libosinfo-check/systems=libvirt-freebsd-11/ws/bui…'> gmake[1]: Nothing to be done for 'check'. gmake[1]: Leaving directory '/usr<https://ci.centos.org/job/libosinfo-check/systems=libvirt-freebsd-11/ws/bui…'> Making check in tests gmake[1]: Entering directory '/usr<https://ci.centos.org/job/libosinfo-check/systems=libvirt-freebsd-11/ws/bui…'> /usr/local/bin/gmake test-entity test-device test-list test-devicelist test-devicelinklist test-filter test-media test-product test-os test-oslist test-productfilter test-platform test-platformlist test-db test-loader test-isodetect test-install-script test-image test-imagelist test-mediauris test-treeuris test-imageuris gmake[2]: Entering directory '/usr<https://ci.centos.org/job/libosinfo-check/systems=libvirt-freebsd-11/ws/bui…'> CC test_entity-test-entity.o CC test_device-test-device.o CC test_list-test-list.o CC test_devicelist-test-devicelist.o CC test_devicelinklist-test-devicelinklist.o CC test_filter-test-filter.o CC test_media-test-media.o CC test_product-test-product.o CC test_os-test-os.o CC test_oslist-test-oslist.o CC test_productfilter-test-productfilter.o CC test_platform-test-platform.o CC test_platformlist-test-platformlist.o CC test_db-test-db.o CC test_loader-test-loader.o CC test_isodetect-test-isodetect.o CC test_install_script-test-install-script.o CC test_image-test-image.o CC test_imagelist-test-imagelist.o CC test_mediauris-test-mediauris.o CC test_treeuris-test-treeuris.o CC test_imageuris-test-imageuris.o CCLD test-entity CCLD test-device CCLD test-list CCLD test-devicelist CCLD test-devicelinklist CCLD test-filter CCLD test-media CCLD test-product CCLD test-os CCLD test-oslist CCLD test-productfilter CCLD test-platform CCLD test-platformlist CCLD test-db CCLD test-loader CCLD test-isodetect CCLD test-install-script CCLD test-image CCLD test-imagelist CCLD test-mediauris CCLD test-treeuris CCLD test-imageuris gmake[2]: Leaving directory '/usr<https://ci.centos.org/job/libosinfo-check/systems=libvirt-freebsd-11/ws/bui…'> /usr/local/bin/gmake check-TESTS gmake[2]: Entering directory '/usr<https://ci.centos.org/job/libosinfo-check/systems=libvirt-freebsd-11/ws/bui…'> gmake[3]: Entering directory '/usr<https://ci.centos.org/job/libosinfo-check/systems=libvirt-freebsd-11/ws/bui…'> PASS: test-entity PASS: test-list PASS: test-device PASS: test-devicelinklist PASS: test-devicelist PASS: test-filter PASS: test-product PASS: test-media PASS: test-productfilter PASS: test-oslist PASS: test-platformlist PASS: test-platform PASS: test-db PASS: test-loader PASS: test-install-script PASS: test-image PASS: test-imagelist SKIP: test-mediauris SKIP: test-treeuris SKIP: test-imageuris PASS: test-os FAIL: test-isodetect ============================================================================ Testsuite summary for libosinfo 1.4.0 ============================================================================ # TOTAL: 22 # PASS: 18 # SKIP: 3 # XFAIL: 0 # FAIL: 1 # XPASS: 0 # ERROR: 0 ============================================================================ See tests/test-suite.log Please report to libosinfo(a)redhat.com ============================================================================ gmake[3]: *** [Makefile:1440: test-suite.log] Error 1 gmake[3]: Leaving directory '/usr<https://ci.centos.org/job/libosinfo-check/systems=libvirt-freebsd-11/ws/bui…'> gmake[2]: *** [Makefile:1548: check-TESTS] Error 2 gmake[2]: Leaving directory '/usr<https://ci.centos.org/job/libosinfo-check/systems=libvirt-freebsd-11/ws/bui…'> gmake[1]: *** [Makefile:1769: check-am] Error 2 gmake[1]: Leaving directory '/usr<https://ci.centos.org/job/libosinfo-check/systems=libvirt-freebsd-11/ws/bui…'> gmake: *** [Makefile:594: check-recursive] Error 1 + cat tests/test-suite.log =========================================== libosinfo 1.4.0: tests/test-suite.log =========================================== # TOTAL: 22 # PASS: 18 # SKIP: 3 # XFAIL: 0 # FAIL: 1 # XPASS: 0 # ERROR: 0 .. contents:: :depth: 2 FAIL: test-isodetect ==================== /isodetect/pureos: OK /isodetect/eos: OK /isodetect/android-x86: OK /isodetect/windows: OK /isodetect/ubuntu: ISO ubuntu-18.04.1.0-live-server-amd64.iso.txt was not matched by OS ubuntu18.04 /isodetect/ubuntu: FAIL /isodetect/sles: OK /isodetect/sled: OK /isodetect/rhel: OK /isodetect/popos: OK /isodetect/opensuse: OK /isodetect/openbsd: OK /isodetect/netbsd: OK /isodetect/mageia: OK /isodetect/haiku: OK /isodetect/gnome: OK /isodetect/freedos: OK /isodetect/freebsd: OK /isodetect/fedora: OK /isodetect/dragonflybsd: OK /isodetect/debian: OK /isodetect/centos: OK /isodetect/asianux: OK /isodetect/altlinux: OK /isodetect/alpinelinux: OK FAIL test-isodetect (exit status: 1) SKIP: test-mediauris ==================== SKIP test-mediauris (exit status: 77) SKIP: test-treeuris =================== SKIP test-treeuris (exit status: 77) SKIP: test-imageuris ==================== SKIP test-imageuris (exit status: 77) + exit 1 Build step 'Execute shell' marked build as failure
1 1
0 0
[Libvirt-ci] Build failed in Jenkins: libosinfo-check » libvirt-fedora-28 #93
by ci@centos.org 18 Feb '19

18 Feb '19
See <https://ci.centos.org/job/libosinfo-check/systems=libvirt-fedora-28/93/disp…> ------------------------------------------ Started by upstream project "libosinfo-check" build number 93 originally caused by: Started by upstream project "libosinfo-syntax-check" build number 94 originally caused by: Started by upstream project "libosinfo-build" build number 97 originally caused by: Started by an SCM change [EnvInject] - Loading node environment variables. Building remotely on libvirt-fedora-28 (libvirt) in workspace <https://ci.centos.org/job/libosinfo-check/systems=libvirt-fedora-28/ws/> [libosinfo] $ /bin/sh -xe /tmp/jenkins2653946735051716873.sh + cd build + /usr/bin/gmake check Making check in osinfo GEN public-submodule-commit gmake[1]: Entering directory '<https://ci.centos.org/job/libosinfo-check/systems=libvirt-fedora-28/ws/buil…'> /usr/bin/gmake check-am gmake[2]: Entering directory '<https://ci.centos.org/job/libosinfo-check/systems=libvirt-fedora-28/ws/buil…'> /usr/bin/gmake check-local gmake[3]: Entering directory '<https://ci.centos.org/job/libosinfo-check/systems=libvirt-fedora-28/ws/buil…'> GEN check-symfile GEN check-symsorting gmake[3]: Leaving directory '<https://ci.centos.org/job/libosinfo-check/systems=libvirt-fedora-28/ws/buil…'> gmake[2]: Leaving directory '<https://ci.centos.org/job/libosinfo-check/systems=libvirt-fedora-28/ws/buil…'> gmake[1]: Leaving directory '<https://ci.centos.org/job/libosinfo-check/systems=libvirt-fedora-28/ws/buil…'> Making check in tools gmake[1]: Entering directory '<https://ci.centos.org/job/libosinfo-check/systems=libvirt-fedora-28/ws/buil…'> gmake[1]: Nothing to be done for 'check'. gmake[1]: Leaving directory '<https://ci.centos.org/job/libosinfo-check/systems=libvirt-fedora-28/ws/buil…'> Making check in docs gmake[1]: Entering directory '<https://ci.centos.org/job/libosinfo-check/systems=libvirt-fedora-28/ws/buil…'> Making check in reference gmake[2]: Entering directory '<https://ci.centos.org/job/libosinfo-check/systems=libvirt-fedora-28/ws/buil…'> gmake[2]: Nothing to be done for 'check'. gmake[2]: Leaving directory '<https://ci.centos.org/job/libosinfo-check/systems=libvirt-fedora-28/ws/buil…'> gmake[2]: Entering directory '<https://ci.centos.org/job/libosinfo-check/systems=libvirt-fedora-28/ws/buil…'> gmake[2]: Nothing to be done for 'check-am'. gmake[2]: Leaving directory '<https://ci.centos.org/job/libosinfo-check/systems=libvirt-fedora-28/ws/buil…'> gmake[1]: Leaving directory '<https://ci.centos.org/job/libosinfo-check/systems=libvirt-fedora-28/ws/buil…'> Making check in po gmake[1]: Entering directory '<https://ci.centos.org/job/libosinfo-check/systems=libvirt-fedora-28/ws/buil…'> INTLTOOL_EXTRACT="/usr/bin/intltool-extract" XGETTEXT="/usr/bin/xgettext" srcdir=../../po /usr/bin/intltool-update --gettext-package libosinfo --pot rm -f missing notexist srcdir=../../po /usr/bin/intltool-update -m if [ -r missing -o -r notexist ]; then \ exit 1; \ fi gmake[1]: Leaving directory '<https://ci.centos.org/job/libosinfo-check/systems=libvirt-fedora-28/ws/buil…'> Making check in examples gmake[1]: Entering directory '<https://ci.centos.org/job/libosinfo-check/systems=libvirt-fedora-28/ws/buil…'> gmake[1]: Nothing to be done for 'check'. gmake[1]: Leaving directory '<https://ci.centos.org/job/libosinfo-check/systems=libvirt-fedora-28/ws/buil…'> Making check in tests gmake[1]: Entering directory '<https://ci.centos.org/job/libosinfo-check/systems=libvirt-fedora-28/ws/buil…'> /usr/bin/gmake test-entity test-device test-list test-devicelist test-devicelinklist test-filter test-media test-product test-os test-oslist test-productfilter test-platform test-platformlist test-db test-loader test-isodetect test-install-script test-image test-imagelist test-mediauris test-treeuris test-imageuris gmake[2]: Entering directory '<https://ci.centos.org/job/libosinfo-check/systems=libvirt-fedora-28/ws/buil…'> CC test_entity-test-entity.o CC test_list-test-list.o CC test_device-test-device.o CC test_devicelist-test-devicelist.o CC test_devicelinklist-test-devicelinklist.o CC test_filter-test-filter.o CC test_media-test-media.o CC test_product-test-product.o CC test_os-test-os.o CC test_oslist-test-oslist.o CC test_productfilter-test-productfilter.o CC test_platform-test-platform.o CC test_platformlist-test-platformlist.o CC test_db-test-db.o CC test_loader-test-loader.o CC test_isodetect-test-isodetect.o CC test_install_script-test-install-script.o CC test_image-test-image.o CC test_imagelist-test-imagelist.o CC test_mediauris-test-mediauris.o CC test_treeuris-test-treeuris.o CC test_imageuris-test-imageuris.o CCLD test-entity CCLD test-device CCLD test-list CCLD test-devicelist CCLD test-devicelinklist CCLD test-filter CCLD test-media CCLD test-product CCLD test-os CCLD test-oslist CCLD test-productfilter CCLD test-platform CCLD test-platformlist CCLD test-db CCLD test-loader CCLD test-isodetect CCLD test-install-script CCLD test-image CCLD test-imagelist CCLD test-mediauris CCLD test-treeuris CCLD test-imageuris gmake[2]: Leaving directory '<https://ci.centos.org/job/libosinfo-check/systems=libvirt-fedora-28/ws/buil…'> /usr/bin/gmake check-TESTS gmake[2]: Entering directory '<https://ci.centos.org/job/libosinfo-check/systems=libvirt-fedora-28/ws/buil…'> gmake[3]: Entering directory '<https://ci.centos.org/job/libosinfo-check/systems=libvirt-fedora-28/ws/buil…'> PASS: test-list PASS: test-entity PASS: test-device PASS: test-devicelinklist PASS: test-filter PASS: test-devicelist PASS: test-product PASS: test-media PASS: test-oslist PASS: test-productfilter PASS: test-platformlist PASS: test-platform PASS: test-db PASS: test-loader PASS: test-install-script PASS: test-image PASS: test-imagelist SKIP: test-mediauris SKIP: test-treeuris SKIP: test-imageuris PASS: test-os FAIL: test-isodetect ============================================================================ Testsuite summary for libosinfo 1.4.0 ============================================================================ # TOTAL: 22 # PASS: 18 # SKIP: 3 # XFAIL: 0 # FAIL: 1 # XPASS: 0 # ERROR: 0 ============================================================================ See tests/test-suite.log Please report to libosinfo(a)redhat.com ============================================================================ gmake[3]: *** [Makefile:1412: test-suite.log] Error 1 gmake[3]: Leaving directory '<https://ci.centos.org/job/libosinfo-check/systems=libvirt-fedora-28/ws/buil…'> gmake[2]: *** [Makefile:1520: check-TESTS] Error 2 gmake[2]: Leaving directory '<https://ci.centos.org/job/libosinfo-check/systems=libvirt-fedora-28/ws/buil…'> gmake[1]: *** [Makefile:1738: check-am] Error 2 gmake[1]: Leaving directory '<https://ci.centos.org/job/libosinfo-check/systems=libvirt-fedora-28/ws/buil…'> gmake: *** [Makefile:594: check-recursive] Error 1 + cat tests/test-suite.log =========================================== libosinfo 1.4.0: tests/test-suite.log =========================================== # TOTAL: 22 # PASS: 18 # SKIP: 3 # XFAIL: 0 # FAIL: 1 # XPASS: 0 # ERROR: 0 .. contents:: :depth: 2 FAIL: test-isodetect ==================== /isodetect/pureos: OK /isodetect/windows: OK /isodetect/ubuntu: ISO ubuntu-18.04.1.0-live-server-amd64.iso.txt was not matched by OS ubuntu18.04 /isodetect/ubuntu: FAIL /isodetect/sles: OK /isodetect/sled: OK /isodetect/rhel: OK /isodetect/popos: OK /isodetect/opensuse: OK /isodetect/openbsd: OK /isodetect/netbsd: OK /isodetect/mageia: OK /isodetect/gnome: OK /isodetect/freedos: OK /isodetect/freebsd: OK /isodetect/eos: OK /isodetect/dragonflybsd: OK /isodetect/haiku: OK /isodetect/fedora: OK /isodetect/debian: OK /isodetect/centos: OK /isodetect/asianux: OK /isodetect/altlinux: OK /isodetect/alpinelinux: OK /isodetect/android-x86: OK FAIL test-isodetect (exit status: 1) SKIP: test-mediauris ==================== SKIP test-mediauris (exit status: 77) SKIP: test-treeuris =================== SKIP test-treeuris (exit status: 77) SKIP: test-imageuris ==================== SKIP test-imageuris (exit status: 77) + exit 1 Build step 'Execute shell' marked build as failure
1 1
0 0
  • ← Newer
  • 1
  • 2
  • 3
  • 4
  • 5
  • 6
  • 7
  • 8
  • ...
  • 14
  • Older →

HyperKitty Powered by HyperKitty version 1.3.12.