libvirt List Archives
Sign In Sign Up
Manage this list Sign In Sign Up

Keyboard Shortcuts

Thread View

  • j: Next unread message
  • k: Previous unread message
  • j a: Jump to all threads
  • j l: Jump to MailingList overview

CI

Thread Start a new thread
Download
Threads by month
  • ----- 2025 -----
  • August
  • July
  • June
  • May
  • April
  • March
  • February
  • January
  • ----- 2024 -----
  • December
  • November
  • October
  • September
  • August
  • July
  • June
  • May
  • April
  • March
  • February
  • January
  • ----- 2023 -----
  • December
  • November
  • October
  • September
  • August
  • July
  • June
  • May
  • April
  • March
  • February
  • January
  • ----- 2022 -----
  • December
  • November
  • October
  • September
  • August
  • July
  • June
  • May
  • April
  • March
  • February
  • January
  • ----- 2021 -----
  • December
  • November
  • October
  • September
  • August
  • July
  • June
  • May
  • April
  • March
  • February
  • January
  • ----- 2020 -----
  • December
  • November
  • October
  • September
  • August
  • July
  • June
  • May
  • April
  • March
  • February
  • January
  • ----- 2019 -----
  • December
  • November
  • October
  • September
  • August
  • July
  • June
  • May
  • April
  • March
  • February
  • January
  • ----- 2018 -----
  • December
  • November
  • October
  • September
  • August
  • July
  • June
  • May
  • April
  • March
  • February
  • January
  • ----- 2017 -----
  • December
  • November
  • October
  • September
  • August
  • July
  • June
  • May
  • April
  • March
  • February
  • January
  • ----- 2016 -----
  • December
  • November
  • October
  • September
  • August
  • July
ci@lists.libvirt.org

February 2019

  • 2 participants
  • 132 discussions
[Libvirt-ci] Build failed in Jenkins: libosinfo-check » libvirt-fedora-rawhide #95
by ci@centos.org 18 Feb '19

18 Feb '19
See <https://ci.centos.org/job/libosinfo-check/systems=libvirt-fedora-rawhide/95…> ------------------------------------------ Started by upstream project "libosinfo-check" build number 95 originally caused by: Started by upstream project "libosinfo-syntax-check" build number 98 originally caused by: Started by upstream project "libosinfo-build" build number 101 originally caused by: Started by an SCM change [EnvInject] - Loading node environment variables. Building remotely on libvirt-fedora-rawhide (libvirt) in workspace <https://ci.centos.org/job/libosinfo-check/systems=libvirt-fedora-rawhide/ws/> [libosinfo] $ /bin/sh -xe /tmp/jenkins4029540259833677135.sh + cd build + /usr/bin/gmake check Making check in osinfo GEN public-submodule-commit gmake[1]: Entering directory '<https://ci.centos.org/job/libosinfo-check/systems=libvirt-fedora-rawhide/ws…'> /usr/bin/gmake check-am gmake[2]: Entering directory '<https://ci.centos.org/job/libosinfo-check/systems=libvirt-fedora-rawhide/ws…'> /usr/bin/gmake check-local gmake[3]: Entering directory '<https://ci.centos.org/job/libosinfo-check/systems=libvirt-fedora-rawhide/ws…'> GEN check-symfile GEN check-symsorting gmake[3]: Leaving directory '<https://ci.centos.org/job/libosinfo-check/systems=libvirt-fedora-rawhide/ws…'> gmake[2]: Leaving directory '<https://ci.centos.org/job/libosinfo-check/systems=libvirt-fedora-rawhide/ws…'> gmake[1]: Leaving directory '<https://ci.centos.org/job/libosinfo-check/systems=libvirt-fedora-rawhide/ws…'> Making check in tools gmake[1]: Entering directory '<https://ci.centos.org/job/libosinfo-check/systems=libvirt-fedora-rawhide/ws…'> gmake[1]: Nothing to be done for 'check'. gmake[1]: Leaving directory '<https://ci.centos.org/job/libosinfo-check/systems=libvirt-fedora-rawhide/ws…'> Making check in docs gmake[1]: Entering directory '<https://ci.centos.org/job/libosinfo-check/systems=libvirt-fedora-rawhide/ws…'> Making check in reference gmake[2]: Entering directory '<https://ci.centos.org/job/libosinfo-check/systems=libvirt-fedora-rawhide/ws…'> gmake[2]: Nothing to be done for 'check'. gmake[2]: Leaving directory '<https://ci.centos.org/job/libosinfo-check/systems=libvirt-fedora-rawhide/ws…'> gmake[2]: Entering directory '<https://ci.centos.org/job/libosinfo-check/systems=libvirt-fedora-rawhide/ws…'> gmake[2]: Nothing to be done for 'check-am'. gmake[2]: Leaving directory '<https://ci.centos.org/job/libosinfo-check/systems=libvirt-fedora-rawhide/ws…'> gmake[1]: Leaving directory '<https://ci.centos.org/job/libosinfo-check/systems=libvirt-fedora-rawhide/ws…'> Making check in po gmake[1]: Entering directory '<https://ci.centos.org/job/libosinfo-check/systems=libvirt-fedora-rawhide/ws…'> INTLTOOL_EXTRACT="/usr/bin/intltool-extract" XGETTEXT="/usr/bin/xgettext" srcdir=../../po /usr/bin/intltool-update --gettext-package libosinfo --pot rm -f missing notexist srcdir=../../po /usr/bin/intltool-update -m if [ -r missing -o -r notexist ]; then \ exit 1; \ fi gmake[1]: Leaving directory '<https://ci.centos.org/job/libosinfo-check/systems=libvirt-fedora-rawhide/ws…'> Making check in examples gmake[1]: Entering directory '<https://ci.centos.org/job/libosinfo-check/systems=libvirt-fedora-rawhide/ws…'> gmake[1]: Nothing to be done for 'check'. gmake[1]: Leaving directory '<https://ci.centos.org/job/libosinfo-check/systems=libvirt-fedora-rawhide/ws…'> Making check in tests gmake[1]: Entering directory '<https://ci.centos.org/job/libosinfo-check/systems=libvirt-fedora-rawhide/ws…'> /usr/bin/gmake test-entity test-device test-list test-devicelist test-devicelinklist test-filter test-media test-product test-os test-oslist test-productfilter test-platform test-platformlist test-db test-loader test-isodetect test-install-script test-image test-imagelist test-mediauris test-treeuris test-imageuris gmake[2]: Entering directory '<https://ci.centos.org/job/libosinfo-check/systems=libvirt-fedora-rawhide/ws…'> CC test_device-test-device.o CC test_entity-test-entity.o CC test_list-test-list.o CC test_devicelist-test-devicelist.o CC test_devicelinklist-test-devicelinklist.o CC test_filter-test-filter.o CC test_media-test-media.o CC test_product-test-product.o CC test_os-test-os.o CC test_oslist-test-oslist.o CC test_productfilter-test-productfilter.o CC test_platform-test-platform.o CC test_platformlist-test-platformlist.o CC test_db-test-db.o CC test_loader-test-loader.o CC test_isodetect-test-isodetect.o CC test_install_script-test-install-script.o CC test_image-test-image.o CC test_imagelist-test-imagelist.o CC test_mediauris-test-mediauris.o CC test_mediauris-test-uris-common.o CC test_treeuris-test-treeuris.o CC test_treeuris-test-uris-common.o CC test_imageuris-test-imageuris.o CC test_imageuris-test-uris-common.o CCLD test-entity CCLD test-device CCLD test-list CCLD test-devicelist CCLD test-devicelinklist CCLD test-filter CCLD test-media CCLD test-product CCLD test-os CCLD test-oslist CCLD test-productfilter CCLD test-platform CCLD test-platformlist CCLD test-db CCLD test-loader CCLD test-isodetect CCLD test-install-script CCLD test-image CCLD test-imagelist CCLD test-mediauris CCLD test-treeuris CCLD test-imageuris gmake[2]: Leaving directory '<https://ci.centos.org/job/libosinfo-check/systems=libvirt-fedora-rawhide/ws…'> /usr/bin/gmake check-TESTS gmake[2]: Entering directory '<https://ci.centos.org/job/libosinfo-check/systems=libvirt-fedora-rawhide/ws…'> gmake[3]: Entering directory '<https://ci.centos.org/job/libosinfo-check/systems=libvirt-fedora-rawhide/ws…'> PASS: test-entity PASS: test-list PASS: test-device PASS: test-devicelinklist PASS: test-devicelist PASS: test-filter PASS: test-product PASS: test-oslist PASS: test-media PASS: test-productfilter PASS: test-platform PASS: test-platformlist PASS: test-db PASS: test-loader PASS: test-install-script PASS: test-image PASS: test-imagelist SKIP: test-mediauris SKIP: test-treeuris SKIP: test-imageuris PASS: test-os FAIL: test-isodetect ============================================================================ Testsuite summary for libosinfo 1.4.0 ============================================================================ # TOTAL: 22 # PASS: 18 # SKIP: 3 # XFAIL: 0 # FAIL: 1 # XPASS: 0 # ERROR: 0 ============================================================================ See tests/test-suite.log Please report to libosinfo(a)redhat.com ============================================================================ gmake[3]: *** [Makefile:1491: test-suite.log] Error 1 gmake[3]: Leaving directory '<https://ci.centos.org/job/libosinfo-check/systems=libvirt-fedora-rawhide/ws…'> gmake[2]: *** [Makefile:1599: check-TESTS] Error 2 gmake[2]: Leaving directory '<https://ci.centos.org/job/libosinfo-check/systems=libvirt-fedora-rawhide/ws…'> gmake[1]: *** [Makefile:1820: check-am] Error 2 gmake[1]: Leaving directory '<https://ci.centos.org/job/libosinfo-check/systems=libvirt-fedora-rawhide/ws…'> gmake: *** [Makefile:594: check-recursive] Error 1 + cat tests/test-suite.log =========================================== libosinfo 1.4.0: tests/test-suite.log =========================================== # TOTAL: 22 # PASS: 18 # SKIP: 3 # XFAIL: 0 # FAIL: 1 # XPASS: 0 # ERROR: 0 .. contents:: :depth: 2 FAIL: test-isodetect ==================== /isodetect/pureos: OK /isodetect/voidlinux: ISO void-live-i686-20181111.iso.txt was not matched by OS voidlinux /isodetect/voidlinux: ISO void-live-x86_64-20181111.iso.txt was not matched by OS voidlinux /isodetect/voidlinux: FAIL /isodetect/gentoo: ISO install-amd64-minimal-20190212T214502Z.iso.txt was not matched by OS gentoo /isodetect/gentoo: ISO install-x86-minimal-20190214T185527Z.iso.txt was not matched by OS gentoo /isodetect/gentoo: FAIL /isodetect/archlinux: ISO archlinux-2019.02.01-x86_64.iso.txt was not matched by OS archlinux /isodetect/archlinux: FAIL /isodetect/eos: OK /isodetect/windows: OK /isodetect/ubuntu: OK /isodetect/sles: OK /isodetect/sled: OK /isodetect/rhel: OK /isodetect/popos: OK /isodetect/opensuse: OK /isodetect/openbsd: OK /isodetect/netbsd: OK /isodetect/mageia: OK /isodetect/haiku: OK /isodetect/gnome: OK /isodetect/freedos: OK /isodetect/freebsd: OK /isodetect/fedora: OK /isodetect/dragonflybsd: OK /isodetect/debian: OK /isodetect/centos: OK /isodetect/asianux: OK /isodetect/android-x86: OK /isodetect/altlinux: OK /isodetect/alpinelinux: OK FAIL test-isodetect (exit status: 1) SKIP: test-mediauris ==================== SKIP test-mediauris (exit status: 77) SKIP: test-treeuris =================== SKIP test-treeuris (exit status: 77) SKIP: test-imageuris ==================== SKIP test-imageuris (exit status: 77) + exit 1 Build step 'Execute shell' marked build as failure
1 1
0 0
[Libvirt-ci] Build failed in Jenkins: libosinfo-check » libvirt-freebsd-12 #95
by ci@centos.org 18 Feb '19

18 Feb '19
See <https://ci.centos.org/job/libosinfo-check/systems=libvirt-freebsd-12/95/dis…> ------------------------------------------ Started by upstream project "libosinfo-check" build number 95 originally caused by: Started by upstream project "libosinfo-syntax-check" build number 98 originally caused by: Started by upstream project "libosinfo-build" build number 101 originally caused by: Started by an SCM change [EnvInject] - Loading node environment variables. Building remotely on libvirt-freebsd-12 (libvirt) in workspace <https://ci.centos.org/job/libosinfo-check/systems=libvirt-freebsd-12/ws/> [libosinfo] $ /bin/sh -xe /tmp/jenkins360704687170697543.sh + cd build + /usr/local/bin/gmake check Making check in osinfo GEN public-submodule-commit gmake[1]: Entering directory '/usr<https://ci.centos.org/job/libosinfo-check/systems=libvirt-freebsd-12/ws/bui…'> /usr/local/bin/gmake check-am gmake[2]: Entering directory '/usr<https://ci.centos.org/job/libosinfo-check/systems=libvirt-freebsd-12/ws/bui…'> /usr/local/bin/gmake check-local gmake[3]: Entering directory '/usr<https://ci.centos.org/job/libosinfo-check/systems=libvirt-freebsd-12/ws/bui…'> GEN check-symsorting gmake[3]: Leaving directory '/usr<https://ci.centos.org/job/libosinfo-check/systems=libvirt-freebsd-12/ws/bui…'> gmake[2]: Leaving directory '/usr<https://ci.centos.org/job/libosinfo-check/systems=libvirt-freebsd-12/ws/bui…'> gmake[1]: Leaving directory '/usr<https://ci.centos.org/job/libosinfo-check/systems=libvirt-freebsd-12/ws/bui…'> Making check in tools gmake[1]: Entering directory '/usr<https://ci.centos.org/job/libosinfo-check/systems=libvirt-freebsd-12/ws/bui…'> gmake[1]: Nothing to be done for 'check'. gmake[1]: Leaving directory '/usr<https://ci.centos.org/job/libosinfo-check/systems=libvirt-freebsd-12/ws/bui…'> Making check in docs gmake[1]: Entering directory '/usr<https://ci.centos.org/job/libosinfo-check/systems=libvirt-freebsd-12/ws/bui…'> Making check in reference gmake[2]: Entering directory '/usr<https://ci.centos.org/job/libosinfo-check/systems=libvirt-freebsd-12/ws/bui…'> gmake[2]: Nothing to be done for 'check'. gmake[2]: Leaving directory '/usr<https://ci.centos.org/job/libosinfo-check/systems=libvirt-freebsd-12/ws/bui…'> gmake[2]: Entering directory '/usr<https://ci.centos.org/job/libosinfo-check/systems=libvirt-freebsd-12/ws/bui…'> gmake[2]: Nothing to be done for 'check-am'. gmake[2]: Leaving directory '/usr<https://ci.centos.org/job/libosinfo-check/systems=libvirt-freebsd-12/ws/bui…'> gmake[1]: Leaving directory '/usr<https://ci.centos.org/job/libosinfo-check/systems=libvirt-freebsd-12/ws/bui…'> Making check in po gmake[1]: Entering directory '/usr<https://ci.centos.org/job/libosinfo-check/systems=libvirt-freebsd-12/ws/bui…'> INTLTOOL_EXTRACT="/usr/local/bin/intltool-extract" XGETTEXT="/usr/local/bin/xgettext" srcdir=../../po /usr/local/bin/intltool-update --gettext-package libosinfo --pot rm -f missing notexist srcdir=../../po /usr/local/bin/intltool-update -m if [ -r missing -o -r notexist ]; then \ exit 1; \ fi gmake[1]: Leaving directory '/usr<https://ci.centos.org/job/libosinfo-check/systems=libvirt-freebsd-12/ws/bui…'> Making check in examples gmake[1]: Entering directory '/usr<https://ci.centos.org/job/libosinfo-check/systems=libvirt-freebsd-12/ws/bui…'> gmake[1]: Nothing to be done for 'check'. gmake[1]: Leaving directory '/usr<https://ci.centos.org/job/libosinfo-check/systems=libvirt-freebsd-12/ws/bui…'> Making check in tests gmake[1]: Entering directory '/usr<https://ci.centos.org/job/libosinfo-check/systems=libvirt-freebsd-12/ws/bui…'> /usr/local/bin/gmake test-entity test-device test-list test-devicelist test-devicelinklist test-filter test-media test-product test-os test-oslist test-productfilter test-platform test-platformlist test-db test-loader test-isodetect test-install-script test-image test-imagelist test-mediauris test-treeuris test-imageuris gmake[2]: Entering directory '/usr<https://ci.centos.org/job/libosinfo-check/systems=libvirt-freebsd-12/ws/bui…'> CC test_entity-test-entity.o CC test_device-test-device.o CC test_list-test-list.o CC test_devicelist-test-devicelist.o CC test_devicelinklist-test-devicelinklist.o CC test_filter-test-filter.o CC test_media-test-media.o CC test_product-test-product.o CC test_os-test-os.o CC test_oslist-test-oslist.o CC test_productfilter-test-productfilter.o CC test_platform-test-platform.o CC test_platformlist-test-platformlist.o CC test_db-test-db.o CC test_loader-test-loader.o CC test_isodetect-test-isodetect.o CC test_install_script-test-install-script.o CC test_image-test-image.o CC test_imagelist-test-imagelist.o CC test_mediauris-test-mediauris.o CC test_mediauris-test-uris-common.o CC test_treeuris-test-treeuris.o CC test_treeuris-test-uris-common.o CC test_imageuris-test-imageuris.o CC test_imageuris-test-uris-common.o CCLD test-entity CCLD test-device CCLD test-list CCLD test-devicelist CCLD test-devicelinklist CCLD test-filter CCLD test-media CCLD test-product CCLD test-os CCLD test-oslist CCLD test-productfilter CCLD test-platform CCLD test-platformlist CCLD test-db CCLD test-loader CCLD test-isodetect CCLD test-install-script CCLD test-image CCLD test-imagelist CCLD test-mediauris CCLD test-treeuris CCLD test-imageuris gmake[2]: Leaving directory '/usr<https://ci.centos.org/job/libosinfo-check/systems=libvirt-freebsd-12/ws/bui…'> /usr/local/bin/gmake check-TESTS gmake[2]: Entering directory '/usr<https://ci.centos.org/job/libosinfo-check/systems=libvirt-freebsd-12/ws/bui…'> gmake[3]: Entering directory '/usr<https://ci.centos.org/job/libosinfo-check/systems=libvirt-freebsd-12/ws/bui…'> PASS: test-entity PASS: test-device PASS: test-list PASS: test-devicelist PASS: test-filter PASS: test-devicelinklist PASS: test-product PASS: test-oslist PASS: test-media PASS: test-platform PASS: test-productfilter PASS: test-platformlist PASS: test-db PASS: test-loader PASS: test-install-script PASS: test-image PASS: test-imagelist SKIP: test-mediauris SKIP: test-treeuris SKIP: test-imageuris PASS: test-os FAIL: test-isodetect ============================================================================ Testsuite summary for libosinfo 1.4.0 ============================================================================ # TOTAL: 22 # PASS: 18 # SKIP: 3 # XFAIL: 0 # FAIL: 1 # XPASS: 0 # ERROR: 0 ============================================================================ See tests/test-suite.log Please report to libosinfo(a)redhat.com ============================================================================ gmake[3]: *** [Makefile:1491: test-suite.log] Error 1 gmake[3]: Leaving directory '/usr<https://ci.centos.org/job/libosinfo-check/systems=libvirt-freebsd-12/ws/bui…'> gmake[2]: *** [Makefile:1599: check-TESTS] Error 2 gmake[2]: Leaving directory '/usr<https://ci.centos.org/job/libosinfo-check/systems=libvirt-freebsd-12/ws/bui…'> gmake[1]: *** [Makefile:1820: check-am] Error 2 gmake[1]: Leaving directory '/usr<https://ci.centos.org/job/libosinfo-check/systems=libvirt-freebsd-12/ws/bui…'> gmake: *** [Makefile:594: check-recursive] Error 1 + cat tests/test-suite.log =========================================== libosinfo 1.4.0: tests/test-suite.log =========================================== # TOTAL: 22 # PASS: 18 # SKIP: 3 # XFAIL: 0 # FAIL: 1 # XPASS: 0 # ERROR: 0 .. contents:: :depth: 2 FAIL: test-isodetect ==================== /isodetect/voidlinux: ISO void-live-i686-20181111.iso.txt was not matched by OS voidlinux /isodetect/voidlinux: ISO void-live-x86_64-20181111.iso.txt was not matched by OS voidlinux /isodetect/voidlinux: FAIL /isodetect/gentoo: ISO install-amd64-minimal-20190212T214502Z.iso.txt was not matched by OS gentoo /isodetect/gentoo: ISO install-x86-minimal-20190214T185527Z.iso.txt was not matched by OS gentoo /isodetect/gentoo: FAIL /isodetect/archlinux: ISO archlinux-2019.02.01-x86_64.iso.txt was not matched by OS archlinux /isodetect/archlinux: FAIL /isodetect/pureos: OK /isodetect/eos: OK /isodetect/windows: OK /isodetect/ubuntu: OK /isodetect/sles: OK /isodetect/sled: OK /isodetect/rhel: OK /isodetect/popos: OK /isodetect/opensuse: OK /isodetect/openbsd: OK /isodetect/netbsd: OK /isodetect/mageia: OK /isodetect/haiku: OK /isodetect/gnome: OK /isodetect/freedos: OK /isodetect/freebsd: OK /isodetect/fedora: OK /isodetect/dragonflybsd: OK /isodetect/debian: OK /isodetect/centos: OK /isodetect/asianux: OK /isodetect/android-x86: OK /isodetect/altlinux: OK /isodetect/alpinelinux: OK FAIL test-isodetect (exit status: 1) SKIP: test-mediauris ==================== SKIP test-mediauris (exit status: 77) SKIP: test-treeuris =================== SKIP test-treeuris (exit status: 77) SKIP: test-imageuris ==================== SKIP test-imageuris (exit status: 77) + exit 1 Build step 'Execute shell' marked build as failure
1 1
0 0
[Libvirt-ci] Build failed in Jenkins: libosinfo-check » libvirt-freebsd-11 #95
by ci@centos.org 18 Feb '19

18 Feb '19
See <https://ci.centos.org/job/libosinfo-check/systems=libvirt-freebsd-11/95/dis…> ------------------------------------------ Started by upstream project "libosinfo-check" build number 95 originally caused by: Started by upstream project "libosinfo-syntax-check" build number 98 originally caused by: Started by upstream project "libosinfo-build" build number 101 originally caused by: Started by an SCM change [EnvInject] - Loading node environment variables. Building remotely on libvirt-freebsd-11 (libvirt) in workspace <https://ci.centos.org/job/libosinfo-check/systems=libvirt-freebsd-11/ws/> [libosinfo] $ /bin/sh -xe /tmp/jenkins4274233351855047146.sh + cd build + /usr/local/bin/gmake check GEN public-submodule-commit Making check in osinfo gmake[1]: Entering directory '/usr<https://ci.centos.org/job/libosinfo-check/systems=libvirt-freebsd-11/ws/bui…'> /usr/local/bin/gmake check-am gmake[2]: Entering directory '/usr<https://ci.centos.org/job/libosinfo-check/systems=libvirt-freebsd-11/ws/bui…'> /usr/local/bin/gmake check-local gmake[3]: Entering directory '/usr<https://ci.centos.org/job/libosinfo-check/systems=libvirt-freebsd-11/ws/bui…'> GEN check-symsorting gmake[3]: Leaving directory '/usr<https://ci.centos.org/job/libosinfo-check/systems=libvirt-freebsd-11/ws/bui…'> gmake[2]: Leaving directory '/usr<https://ci.centos.org/job/libosinfo-check/systems=libvirt-freebsd-11/ws/bui…'> gmake[1]: Leaving directory '/usr<https://ci.centos.org/job/libosinfo-check/systems=libvirt-freebsd-11/ws/bui…'> Making check in tools gmake[1]: Entering directory '/usr<https://ci.centos.org/job/libosinfo-check/systems=libvirt-freebsd-11/ws/bui…'> gmake[1]: Nothing to be done for 'check'. gmake[1]: Leaving directory '/usr<https://ci.centos.org/job/libosinfo-check/systems=libvirt-freebsd-11/ws/bui…'> Making check in docs gmake[1]: Entering directory '/usr<https://ci.centos.org/job/libosinfo-check/systems=libvirt-freebsd-11/ws/bui…'> Making check in reference gmake[2]: Entering directory '/usr<https://ci.centos.org/job/libosinfo-check/systems=libvirt-freebsd-11/ws/bui…'> gmake[2]: Nothing to be done for 'check'. gmake[2]: Leaving directory '/usr<https://ci.centos.org/job/libosinfo-check/systems=libvirt-freebsd-11/ws/bui…'> gmake[2]: Entering directory '/usr<https://ci.centos.org/job/libosinfo-check/systems=libvirt-freebsd-11/ws/bui…'> gmake[2]: Nothing to be done for 'check-am'. gmake[2]: Leaving directory '/usr<https://ci.centos.org/job/libosinfo-check/systems=libvirt-freebsd-11/ws/bui…'> gmake[1]: Leaving directory '/usr<https://ci.centos.org/job/libosinfo-check/systems=libvirt-freebsd-11/ws/bui…'> Making check in po gmake[1]: Entering directory '/usr<https://ci.centos.org/job/libosinfo-check/systems=libvirt-freebsd-11/ws/bui…'> INTLTOOL_EXTRACT="/usr/local/bin/intltool-extract" XGETTEXT="/usr/local/bin/xgettext" srcdir=../../po /usr/local/bin/intltool-update --gettext-package libosinfo --pot rm -f missing notexist srcdir=../../po /usr/local/bin/intltool-update -m if [ -r missing -o -r notexist ]; then \ exit 1; \ fi gmake[1]: Leaving directory '/usr<https://ci.centos.org/job/libosinfo-check/systems=libvirt-freebsd-11/ws/bui…'> Making check in examples gmake[1]: Entering directory '/usr<https://ci.centos.org/job/libosinfo-check/systems=libvirt-freebsd-11/ws/bui…'> gmake[1]: Nothing to be done for 'check'. gmake[1]: Leaving directory '/usr<https://ci.centos.org/job/libosinfo-check/systems=libvirt-freebsd-11/ws/bui…'> Making check in tests gmake[1]: Entering directory '/usr<https://ci.centos.org/job/libosinfo-check/systems=libvirt-freebsd-11/ws/bui…'> /usr/local/bin/gmake test-entity test-device test-list test-devicelist test-devicelinklist test-filter test-media test-product test-os test-oslist test-productfilter test-platform test-platformlist test-db test-loader test-isodetect test-install-script test-image test-imagelist test-mediauris test-treeuris test-imageuris gmake[2]: Entering directory '/usr<https://ci.centos.org/job/libosinfo-check/systems=libvirt-freebsd-11/ws/bui…'> CC test_entity-test-entity.o CC test_device-test-device.o CC test_list-test-list.o CC test_devicelist-test-devicelist.o CC test_devicelinklist-test-devicelinklist.o CC test_filter-test-filter.o CC test_media-test-media.o CC test_product-test-product.o CC test_os-test-os.o CC test_oslist-test-oslist.o CC test_productfilter-test-productfilter.o CC test_platform-test-platform.o CC test_platformlist-test-platformlist.o CC test_db-test-db.o CC test_loader-test-loader.o CC test_isodetect-test-isodetect.o CC test_install_script-test-install-script.o CC test_image-test-image.o CC test_imagelist-test-imagelist.o CC test_mediauris-test-mediauris.o CC test_mediauris-test-uris-common.o CC test_treeuris-test-treeuris.o CC test_treeuris-test-uris-common.o CC test_imageuris-test-imageuris.o CC test_imageuris-test-uris-common.o CCLD test-entity CCLD test-device CCLD test-list CCLD test-devicelist CCLD test-devicelinklist CCLD test-filter CCLD test-media CCLD test-product CCLD test-os CCLD test-oslist CCLD test-productfilter CCLD test-platform CCLD test-platformlist CCLD test-db CCLD test-loader CCLD test-isodetect CCLD test-install-script CCLD test-image CCLD test-imagelist CCLD test-mediauris CCLD test-treeuris CCLD test-imageuris gmake[2]: Leaving directory '/usr<https://ci.centos.org/job/libosinfo-check/systems=libvirt-freebsd-11/ws/bui…'> /usr/local/bin/gmake check-TESTS gmake[2]: Entering directory '/usr<https://ci.centos.org/job/libosinfo-check/systems=libvirt-freebsd-11/ws/bui…'> gmake[3]: Entering directory '/usr<https://ci.centos.org/job/libosinfo-check/systems=libvirt-freebsd-11/ws/bui…'> PASS: test-device PASS: test-entity PASS: test-list PASS: test-devicelist PASS: test-devicelinklist PASS: test-filter PASS: test-product PASS: test-oslist PASS: test-media PASS: test-productfilter PASS: test-platform PASS: test-platformlist PASS: test-db PASS: test-loader PASS: test-install-script PASS: test-image PASS: test-imagelist SKIP: test-mediauris SKIP: test-treeuris SKIP: test-imageuris PASS: test-os FAIL: test-isodetect ============================================================================ Testsuite summary for libosinfo 1.4.0 ============================================================================ # TOTAL: 22 # PASS: 18 # SKIP: 3 # XFAIL: 0 # FAIL: 1 # XPASS: 0 # ERROR: 0 ============================================================================ See tests/test-suite.log Please report to libosinfo(a)redhat.com ============================================================================ gmake[3]: *** [Makefile:1491: test-suite.log] Error 1 gmake[3]: Leaving directory '/usr<https://ci.centos.org/job/libosinfo-check/systems=libvirt-freebsd-11/ws/bui…'> gmake[2]: *** [Makefile:1599: check-TESTS] Error 2 gmake[2]: Leaving directory '/usr<https://ci.centos.org/job/libosinfo-check/systems=libvirt-freebsd-11/ws/bui…'> gmake[1]: *** [Makefile:1820: check-am] Error 2 gmake[1]: Leaving directory '/usr<https://ci.centos.org/job/libosinfo-check/systems=libvirt-freebsd-11/ws/bui…'> gmake: *** [Makefile:594: check-recursive] Error 1 + cat tests/test-suite.log =========================================== libosinfo 1.4.0: tests/test-suite.log =========================================== # TOTAL: 22 # PASS: 18 # SKIP: 3 # XFAIL: 0 # FAIL: 1 # XPASS: 0 # ERROR: 0 .. contents:: :depth: 2 FAIL: test-isodetect ==================== /isodetect/pureos: OK /isodetect/eos: OK /isodetect/voidlinux: ISO void-live-i686-20181111.iso.txt was not matched by OS voidlinux /isodetect/voidlinux: ISO void-live-x86_64-20181111.iso.txt was not matched by OS voidlinux /isodetect/voidlinux: FAIL /isodetect/gentoo: ISO install-amd64-minimal-20190212T214502Z.iso.txt was not matched by OS gentoo /isodetect/gentoo: ISO install-x86-minimal-20190214T185527Z.iso.txt was not matched by OS gentoo /isodetect/gentoo: FAIL /isodetect/archlinux: ISO archlinux-2019.02.01-x86_64.iso.txt was not matched by OS archlinux /isodetect/archlinux: FAIL /isodetect/android-x86: OK /isodetect/windows: OK /isodetect/ubuntu: OK /isodetect/sles: OK /isodetect/sled: OK /isodetect/rhel: OK /isodetect/popos: OK /isodetect/opensuse: OK /isodetect/openbsd: OK /isodetect/netbsd: OK /isodetect/mageia: OK /isodetect/haiku: OK /isodetect/gnome: OK /isodetect/freedos: OK /isodetect/freebsd: OK /isodetect/fedora: OK /isodetect/dragonflybsd: OK /isodetect/debian: OK /isodetect/centos: OK /isodetect/asianux: OK /isodetect/altlinux: OK /isodetect/alpinelinux: OK FAIL test-isodetect (exit status: 1) SKIP: test-mediauris ==================== SKIP test-mediauris (exit status: 77) SKIP: test-treeuris =================== SKIP test-treeuris (exit status: 77) SKIP: test-imageuris ==================== SKIP test-imageuris (exit status: 77) + exit 1 Build step 'Execute shell' marked build as failure
1 1
0 0
[Libvirt-ci] Build failed in Jenkins: libosinfo-check » libvirt-fedora-29 #95
by ci@centos.org 18 Feb '19

18 Feb '19
See <https://ci.centos.org/job/libosinfo-check/systems=libvirt-fedora-29/95/disp…> ------------------------------------------ Started by upstream project "libosinfo-check" build number 95 originally caused by: Started by upstream project "libosinfo-syntax-check" build number 98 originally caused by: Started by upstream project "libosinfo-build" build number 101 originally caused by: Started by an SCM change [EnvInject] - Loading node environment variables. Building remotely on libvirt-fedora-29 (libvirt) in workspace <https://ci.centos.org/job/libosinfo-check/systems=libvirt-fedora-29/ws/> [libosinfo] $ /bin/sh -xe /tmp/jenkins932421939631396198.sh + cd build + /usr/bin/gmake check GEN public-submodule-commit Making check in osinfo gmake[1]: Entering directory '<https://ci.centos.org/job/libosinfo-check/systems=libvirt-fedora-29/ws/buil…'> /usr/bin/gmake check-am gmake[2]: Entering directory '<https://ci.centos.org/job/libosinfo-check/systems=libvirt-fedora-29/ws/buil…'> /usr/bin/gmake check-local gmake[3]: Entering directory '<https://ci.centos.org/job/libosinfo-check/systems=libvirt-fedora-29/ws/buil…'> GEN check-symfile GEN check-symsorting gmake[3]: Leaving directory '<https://ci.centos.org/job/libosinfo-check/systems=libvirt-fedora-29/ws/buil…'> gmake[2]: Leaving directory '<https://ci.centos.org/job/libosinfo-check/systems=libvirt-fedora-29/ws/buil…'> gmake[1]: Leaving directory '<https://ci.centos.org/job/libosinfo-check/systems=libvirt-fedora-29/ws/buil…'> Making check in tools gmake[1]: Entering directory '<https://ci.centos.org/job/libosinfo-check/systems=libvirt-fedora-29/ws/buil…'> gmake[1]: Nothing to be done for 'check'. gmake[1]: Leaving directory '<https://ci.centos.org/job/libosinfo-check/systems=libvirt-fedora-29/ws/buil…'> Making check in docs gmake[1]: Entering directory '<https://ci.centos.org/job/libosinfo-check/systems=libvirt-fedora-29/ws/buil…'> Making check in reference gmake[2]: Entering directory '<https://ci.centos.org/job/libosinfo-check/systems=libvirt-fedora-29/ws/buil…'> gmake[2]: Nothing to be done for 'check'. gmake[2]: Leaving directory '<https://ci.centos.org/job/libosinfo-check/systems=libvirt-fedora-29/ws/buil…'> gmake[2]: Entering directory '<https://ci.centos.org/job/libosinfo-check/systems=libvirt-fedora-29/ws/buil…'> gmake[2]: Nothing to be done for 'check-am'. gmake[2]: Leaving directory '<https://ci.centos.org/job/libosinfo-check/systems=libvirt-fedora-29/ws/buil…'> gmake[1]: Leaving directory '<https://ci.centos.org/job/libosinfo-check/systems=libvirt-fedora-29/ws/buil…'> Making check in po gmake[1]: Entering directory '<https://ci.centos.org/job/libosinfo-check/systems=libvirt-fedora-29/ws/buil…'> INTLTOOL_EXTRACT="/usr/bin/intltool-extract" XGETTEXT="/usr/bin/xgettext" srcdir=../../po /usr/bin/intltool-update --gettext-package libosinfo --pot rm -f missing notexist srcdir=../../po /usr/bin/intltool-update -m if [ -r missing -o -r notexist ]; then \ exit 1; \ fi gmake[1]: Leaving directory '<https://ci.centos.org/job/libosinfo-check/systems=libvirt-fedora-29/ws/buil…'> Making check in examples gmake[1]: Entering directory '<https://ci.centos.org/job/libosinfo-check/systems=libvirt-fedora-29/ws/buil…'> gmake[1]: Nothing to be done for 'check'. gmake[1]: Leaving directory '<https://ci.centos.org/job/libosinfo-check/systems=libvirt-fedora-29/ws/buil…'> Making check in tests gmake[1]: Entering directory '<https://ci.centos.org/job/libosinfo-check/systems=libvirt-fedora-29/ws/buil…'> /usr/bin/gmake test-entity test-device test-list test-devicelist test-devicelinklist test-filter test-media test-product test-os test-oslist test-productfilter test-platform test-platformlist test-db test-loader test-isodetect test-install-script test-image test-imagelist test-mediauris test-treeuris test-imageuris gmake[2]: Entering directory '<https://ci.centos.org/job/libosinfo-check/systems=libvirt-fedora-29/ws/buil…'> CC test_entity-test-entity.o CC test_device-test-device.o CC test_list-test-list.o CC test_devicelist-test-devicelist.o CC test_devicelinklist-test-devicelinklist.o CC test_filter-test-filter.o CC test_media-test-media.o CC test_product-test-product.o CC test_os-test-os.o CC test_oslist-test-oslist.o CC test_productfilter-test-productfilter.o CC test_platform-test-platform.o CC test_platformlist-test-platformlist.o CC test_db-test-db.o CC test_loader-test-loader.o CC test_isodetect-test-isodetect.o CC test_install_script-test-install-script.o CC test_image-test-image.o CC test_imagelist-test-imagelist.o CC test_mediauris-test-mediauris.o CC test_mediauris-test-uris-common.o CC test_treeuris-test-treeuris.o CC test_treeuris-test-uris-common.o CC test_imageuris-test-imageuris.o CC test_imageuris-test-uris-common.o CCLD test-entity CCLD test-device CCLD test-list CCLD test-devicelist CCLD test-devicelinklist CCLD test-filter CCLD test-media CCLD test-product CCLD test-os CCLD test-oslist CCLD test-productfilter CCLD test-platform CCLD test-platformlist CCLD test-db CCLD test-loader CCLD test-isodetect CCLD test-install-script CCLD test-image CCLD test-imagelist CCLD test-mediauris CCLD test-treeuris CCLD test-imageuris gmake[2]: Leaving directory '<https://ci.centos.org/job/libosinfo-check/systems=libvirt-fedora-29/ws/buil…'> /usr/bin/gmake check-TESTS gmake[2]: Entering directory '<https://ci.centos.org/job/libosinfo-check/systems=libvirt-fedora-29/ws/buil…'> gmake[3]: Entering directory '<https://ci.centos.org/job/libosinfo-check/systems=libvirt-fedora-29/ws/buil…'> PASS: test-entity PASS: test-device PASS: test-devicelist PASS: test-list PASS: test-devicelinklist PASS: test-filter PASS: test-product PASS: test-media PASS: test-oslist PASS: test-productfilter PASS: test-platform PASS: test-platformlist PASS: test-db PASS: test-loader PASS: test-install-script PASS: test-image PASS: test-imagelist SKIP: test-mediauris SKIP: test-treeuris SKIP: test-imageuris PASS: test-os FAIL: test-isodetect ============================================================================ Testsuite summary for libosinfo 1.4.0 ============================================================================ # TOTAL: 22 # PASS: 18 # SKIP: 3 # XFAIL: 0 # FAIL: 1 # XPASS: 0 # ERROR: 0 ============================================================================ See tests/test-suite.log Please report to libosinfo(a)redhat.com ============================================================================ gmake[3]: *** [Makefile:1491: test-suite.log] Error 1 gmake[3]: Leaving directory '<https://ci.centos.org/job/libosinfo-check/systems=libvirt-fedora-29/ws/buil…'> gmake[2]: *** [Makefile:1599: check-TESTS] Error 2 gmake[2]: Leaving directory '<https://ci.centos.org/job/libosinfo-check/systems=libvirt-fedora-29/ws/buil…'> gmake[1]: *** [Makefile:1820: check-am] Error 2 gmake[1]: Leaving directory '<https://ci.centos.org/job/libosinfo-check/systems=libvirt-fedora-29/ws/buil…'> gmake: *** [Makefile:594: check-recursive] Error 1 + cat tests/test-suite.log =========================================== libosinfo 1.4.0: tests/test-suite.log =========================================== # TOTAL: 22 # PASS: 18 # SKIP: 3 # XFAIL: 0 # FAIL: 1 # XPASS: 0 # ERROR: 0 .. contents:: :depth: 2 FAIL: test-isodetect ==================== /isodetect/android-x86: OK /isodetect/eos: OK /isodetect/pureos: OK /isodetect/voidlinux: ISO void-live-i686-20181111.iso.txt was not matched by OS voidlinux /isodetect/voidlinux: ISO void-live-x86_64-20181111.iso.txt was not matched by OS voidlinux /isodetect/voidlinux: FAIL /isodetect/gentoo: ISO install-amd64-minimal-20190212T214502Z.iso.txt was not matched by OS gentoo /isodetect/gentoo: ISO install-x86-minimal-20190214T185527Z.iso.txt was not matched by OS gentoo /isodetect/gentoo: FAIL /isodetect/archlinux: ISO archlinux-2019.02.01-x86_64.iso.txt was not matched by OS archlinux /isodetect/archlinux: FAIL /isodetect/windows: OK /isodetect/ubuntu: OK /isodetect/sles: OK /isodetect/sled: OK /isodetect/rhel: OK /isodetect/popos: OK /isodetect/opensuse: OK /isodetect/openbsd: OK /isodetect/netbsd: OK /isodetect/mageia: OK /isodetect/haiku: OK /isodetect/gnome: OK /isodetect/freedos: OK /isodetect/freebsd: OK /isodetect/fedora: OK /isodetect/dragonflybsd: OK /isodetect/debian: OK /isodetect/centos: OK /isodetect/asianux: OK /isodetect/altlinux: OK /isodetect/alpinelinux: OK FAIL test-isodetect (exit status: 1) SKIP: test-mediauris ==================== SKIP test-mediauris (exit status: 77) SKIP: test-treeuris =================== SKIP test-treeuris (exit status: 77) SKIP: test-imageuris ==================== SKIP test-imageuris (exit status: 77) + exit 1 Build step 'Execute shell' marked build as failure
1 1
0 0
[Libvirt-ci] Build failed in Jenkins: libosinfo-check » libvirt-debian-9 #95
by ci@centos.org 18 Feb '19

18 Feb '19
See <https://ci.centos.org/job/libosinfo-check/systems=libvirt-debian-9/95/displ…> ------------------------------------------ Started by upstream project "libosinfo-check" build number 95 originally caused by: Started by upstream project "libosinfo-syntax-check" build number 98 originally caused by: Started by upstream project "libosinfo-build" build number 101 originally caused by: Started by an SCM change [EnvInject] - Loading node environment variables. Building remotely on libvirt-debian-9 (libvirt) in workspace <https://ci.centos.org/job/libosinfo-check/systems=libvirt-debian-9/ws/> [libosinfo] $ /bin/sh -xe /tmp/jenkins6563254785403274381.sh + cd build + /usr/bin/make check GEN public-submodule-commit Making check in osinfo make[1]: Entering directory '<https://ci.centos.org/job/libosinfo-check/systems=libvirt-debian-9/ws/build…'> /usr/bin/make check-am make[2]: Entering directory '<https://ci.centos.org/job/libosinfo-check/systems=libvirt-debian-9/ws/build…'> /usr/bin/make check-local make[3]: Entering directory '<https://ci.centos.org/job/libosinfo-check/systems=libvirt-debian-9/ws/build…'> GEN check-symsorting GEN check-symfile make[3]: Leaving directory '<https://ci.centos.org/job/libosinfo-check/systems=libvirt-debian-9/ws/build…'> make[2]: Leaving directory '<https://ci.centos.org/job/libosinfo-check/systems=libvirt-debian-9/ws/build…'> make[1]: Leaving directory '<https://ci.centos.org/job/libosinfo-check/systems=libvirt-debian-9/ws/build…'> Making check in tools make[1]: Entering directory '<https://ci.centos.org/job/libosinfo-check/systems=libvirt-debian-9/ws/build…'> make[1]: Nothing to be done for 'check'. make[1]: Leaving directory '<https://ci.centos.org/job/libosinfo-check/systems=libvirt-debian-9/ws/build…'> Making check in docs make[1]: Entering directory '<https://ci.centos.org/job/libosinfo-check/systems=libvirt-debian-9/ws/build…'> Making check in reference make[2]: Entering directory '<https://ci.centos.org/job/libosinfo-check/systems=libvirt-debian-9/ws/build…'> make[2]: Nothing to be done for 'check'. make[2]: Leaving directory '<https://ci.centos.org/job/libosinfo-check/systems=libvirt-debian-9/ws/build…'> make[2]: Entering directory '<https://ci.centos.org/job/libosinfo-check/systems=libvirt-debian-9/ws/build…'> make[2]: Nothing to be done for 'check-am'. make[2]: Leaving directory '<https://ci.centos.org/job/libosinfo-check/systems=libvirt-debian-9/ws/build…'> make[1]: Leaving directory '<https://ci.centos.org/job/libosinfo-check/systems=libvirt-debian-9/ws/build…'> Making check in po make[1]: Entering directory '<https://ci.centos.org/job/libosinfo-check/systems=libvirt-debian-9/ws/build…'> INTLTOOL_EXTRACT="/usr/bin/intltool-extract" XGETTEXT="/usr/bin/xgettext" srcdir=../../po /usr/bin/intltool-update --gettext-package libosinfo --pot rm -f missing notexist srcdir=../../po /usr/bin/intltool-update -m Unescaped left brace in regex is deprecated, passed through in regex; marked by <-- HERE in m/\${ <-- HERE ?PACKAGE_NAME}?/ at /usr/bin/intltool-update line 1071, <CONF> line 295. if [ -r missing -o -r notexist ]; then \ exit 1; \ fi make[1]: Leaving directory '<https://ci.centos.org/job/libosinfo-check/systems=libvirt-debian-9/ws/build…'> Making check in examples make[1]: Entering directory '<https://ci.centos.org/job/libosinfo-check/systems=libvirt-debian-9/ws/build…'> make[1]: Nothing to be done for 'check'. make[1]: Leaving directory '<https://ci.centos.org/job/libosinfo-check/systems=libvirt-debian-9/ws/build…'> Making check in tests make[1]: Entering directory '<https://ci.centos.org/job/libosinfo-check/systems=libvirt-debian-9/ws/build…'> /usr/bin/make test-entity test-device test-list test-devicelist test-devicelinklist test-filter test-media test-product test-os test-oslist test-productfilter test-platform test-platformlist test-db test-loader test-isodetect test-install-script test-image test-imagelist test-mediauris test-treeuris test-imageuris make[2]: Entering directory '<https://ci.centos.org/job/libosinfo-check/systems=libvirt-debian-9/ws/build…'> CC test_list-test-list.o CC test_device-test-device.o CC test_entity-test-entity.o CC test_devicelist-test-devicelist.o CC test_devicelinklist-test-devicelinklist.o CC test_filter-test-filter.o CC test_media-test-media.o CC test_product-test-product.o CC test_os-test-os.o CC test_oslist-test-oslist.o CC test_productfilter-test-productfilter.o CC test_platform-test-platform.o CC test_platformlist-test-platformlist.o CC test_db-test-db.o CC test_loader-test-loader.o CC test_isodetect-test-isodetect.o CC test_install_script-test-install-script.o CC test_image-test-image.o CC test_imagelist-test-imagelist.o CC test_mediauris-test-mediauris.o CC test_mediauris-test-uris-common.o CC test_treeuris-test-treeuris.o CC test_treeuris-test-uris-common.o CC test_imageuris-test-imageuris.o CC test_imageuris-test-uris-common.o CCLD test-entity CCLD test-device CCLD test-list CCLD test-devicelist CCLD test-devicelinklist CCLD test-filter CCLD test-media CCLD test-product CCLD test-os CCLD test-oslist CCLD test-productfilter CCLD test-platform CCLD test-platformlist CCLD test-db CCLD test-loader CCLD test-isodetect CCLD test-install-script CCLD test-image CCLD test-imagelist CCLD test-mediauris CCLD test-treeuris CCLD test-imageuris make[2]: Leaving directory '<https://ci.centos.org/job/libosinfo-check/systems=libvirt-debian-9/ws/build…'> /usr/bin/make check-TESTS make[2]: Entering directory '<https://ci.centos.org/job/libosinfo-check/systems=libvirt-debian-9/ws/build…'> make[3]: Entering directory '<https://ci.centos.org/job/libosinfo-check/systems=libvirt-debian-9/ws/build…'> PASS: test-device PASS: test-entity PASS: test-list PASS: test-devicelist PASS: test-devicelinklist PASS: test-filter PASS: test-product PASS: test-media PASS: test-oslist PASS: test-productfilter PASS: test-platformlist PASS: test-platform PASS: test-db PASS: test-loader PASS: test-install-script PASS: test-image PASS: test-imagelist SKIP: test-mediauris SKIP: test-treeuris SKIP: test-imageuris PASS: test-os FAIL: test-isodetect ============================================================================ Testsuite summary for libosinfo 1.4.0 ============================================================================ # TOTAL: 22 # PASS: 18 # SKIP: 3 # XFAIL: 0 # FAIL: 1 # XPASS: 0 # ERROR: 0 ============================================================================ See tests/test-suite.log Please report to libosinfo(a)redhat.com ============================================================================ Makefile:1460: recipe for target 'test-suite.log' failed make[3]: *** [test-suite.log] Error 1 make[3]: Leaving directory '<https://ci.centos.org/job/libosinfo-check/systems=libvirt-debian-9/ws/build…'> Makefile:1566: recipe for target 'check-TESTS' failed make[2]: *** [check-TESTS] Error 2 make[2]: Leaving directory '<https://ci.centos.org/job/libosinfo-check/systems=libvirt-debian-9/ws/build…'> Makefile:1786: recipe for target 'check-am' failed make[1]: *** [check-am] Error 2 make[1]: Leaving directory '<https://ci.centos.org/job/libosinfo-check/systems=libvirt-debian-9/ws/build…'> Makefile:595: recipe for target 'check-recursive' failed make: *** [check-recursive] Error 1 + cat tests/test-suite.log =========================================== libosinfo 1.4.0: tests/test-suite.log =========================================== # TOTAL: 22 # PASS: 18 # SKIP: 3 # XFAIL: 0 # FAIL: 1 # XPASS: 0 # ERROR: 0 .. contents:: :depth: 2 FAIL: test-isodetect ==================== /isodetect/haiku: OK /isodetect/android-x86: OK /isodetect/eos: OK /isodetect/voidlinux: ISO void-live-i686-20181111.iso.txt was not matched by OS voidlinux /isodetect/voidlinux: ISO void-live-x86_64-20181111.iso.txt was not matched by OS voidlinux /isodetect/voidlinux: FAIL /isodetect/gentoo: ISO install-amd64-minimal-20190212T214502Z.iso.txt was not matched by OS gentoo /isodetect/gentoo: ISO install-x86-minimal-20190214T185527Z.iso.txt was not matched by OS gentoo /isodetect/gentoo: FAIL /isodetect/archlinux: ISO archlinux-2019.02.01-x86_64.iso.txt was not matched by OS archlinux /isodetect/archlinux: FAIL /isodetect/pureos: OK /isodetect/windows: OK /isodetect/ubuntu: OK /isodetect/sles: OK /isodetect/sled: OK /isodetect/rhel: OK /isodetect/popos: OK /isodetect/opensuse: OK /isodetect/openbsd: OK /isodetect/netbsd: OK /isodetect/mageia: OK /isodetect/gnome: OK /isodetect/freedos: OK /isodetect/freebsd: OK /isodetect/fedora: OK /isodetect/debian: OK /isodetect/centos: OK /isodetect/asianux: OK /isodetect/altlinux: OK /isodetect/alpinelinux: OK /isodetect/dragonflybsd: OK FAIL test-isodetect (exit status: 1) SKIP: test-mediauris ==================== SKIP test-mediauris (exit status: 77) SKIP: test-treeuris =================== SKIP test-treeuris (exit status: 77) SKIP: test-imageuris ==================== SKIP test-imageuris (exit status: 77) + exit 1 Build step 'Execute shell' marked build as failure
1 1
0 0
[Libvirt-ci] Build failed in Jenkins: libosinfo-check » libvirt-fedora-28 #95
by ci@centos.org 18 Feb '19

18 Feb '19
See <https://ci.centos.org/job/libosinfo-check/systems=libvirt-fedora-28/95/disp…> ------------------------------------------ Started by upstream project "libosinfo-check" build number 95 originally caused by: Started by upstream project "libosinfo-syntax-check" build number 98 originally caused by: Started by upstream project "libosinfo-build" build number 101 originally caused by: Started by an SCM change [EnvInject] - Loading node environment variables. Building remotely on libvirt-fedora-28 (libvirt) in workspace <https://ci.centos.org/job/libosinfo-check/systems=libvirt-fedora-28/ws/> [libosinfo] $ /bin/sh -xe /tmp/jenkins8946044062473729800.sh + cd build + /usr/bin/gmake check GEN public-submodule-commit Making check in osinfo gmake[1]: Entering directory '<https://ci.centos.org/job/libosinfo-check/systems=libvirt-fedora-28/ws/buil…'> /usr/bin/gmake check-am gmake[2]: Entering directory '<https://ci.centos.org/job/libosinfo-check/systems=libvirt-fedora-28/ws/buil…'> /usr/bin/gmake check-local gmake[3]: Entering directory '<https://ci.centos.org/job/libosinfo-check/systems=libvirt-fedora-28/ws/buil…'> GEN check-symsorting GEN check-symfile gmake[3]: Leaving directory '<https://ci.centos.org/job/libosinfo-check/systems=libvirt-fedora-28/ws/buil…'> gmake[2]: Leaving directory '<https://ci.centos.org/job/libosinfo-check/systems=libvirt-fedora-28/ws/buil…'> gmake[1]: Leaving directory '<https://ci.centos.org/job/libosinfo-check/systems=libvirt-fedora-28/ws/buil…'> Making check in tools gmake[1]: Entering directory '<https://ci.centos.org/job/libosinfo-check/systems=libvirt-fedora-28/ws/buil…'> gmake[1]: Nothing to be done for 'check'. gmake[1]: Leaving directory '<https://ci.centos.org/job/libosinfo-check/systems=libvirt-fedora-28/ws/buil…'> Making check in docs gmake[1]: Entering directory '<https://ci.centos.org/job/libosinfo-check/systems=libvirt-fedora-28/ws/buil…'> Making check in reference gmake[2]: Entering directory '<https://ci.centos.org/job/libosinfo-check/systems=libvirt-fedora-28/ws/buil…'> gmake[2]: Nothing to be done for 'check'. gmake[2]: Leaving directory '<https://ci.centos.org/job/libosinfo-check/systems=libvirt-fedora-28/ws/buil…'> gmake[2]: Entering directory '<https://ci.centos.org/job/libosinfo-check/systems=libvirt-fedora-28/ws/buil…'> gmake[2]: Nothing to be done for 'check-am'. gmake[2]: Leaving directory '<https://ci.centos.org/job/libosinfo-check/systems=libvirt-fedora-28/ws/buil…'> gmake[1]: Leaving directory '<https://ci.centos.org/job/libosinfo-check/systems=libvirt-fedora-28/ws/buil…'> Making check in po gmake[1]: Entering directory '<https://ci.centos.org/job/libosinfo-check/systems=libvirt-fedora-28/ws/buil…'> INTLTOOL_EXTRACT="/usr/bin/intltool-extract" XGETTEXT="/usr/bin/xgettext" srcdir=../../po /usr/bin/intltool-update --gettext-package libosinfo --pot rm -f missing notexist srcdir=../../po /usr/bin/intltool-update -m if [ -r missing -o -r notexist ]; then \ exit 1; \ fi gmake[1]: Leaving directory '<https://ci.centos.org/job/libosinfo-check/systems=libvirt-fedora-28/ws/buil…'> Making check in examples gmake[1]: Entering directory '<https://ci.centos.org/job/libosinfo-check/systems=libvirt-fedora-28/ws/buil…'> gmake[1]: Nothing to be done for 'check'. gmake[1]: Leaving directory '<https://ci.centos.org/job/libosinfo-check/systems=libvirt-fedora-28/ws/buil…'> Making check in tests gmake[1]: Entering directory '<https://ci.centos.org/job/libosinfo-check/systems=libvirt-fedora-28/ws/buil…'> /usr/bin/gmake test-entity test-device test-list test-devicelist test-devicelinklist test-filter test-media test-product test-os test-oslist test-productfilter test-platform test-platformlist test-db test-loader test-isodetect test-install-script test-image test-imagelist test-mediauris test-treeuris test-imageuris gmake[2]: Entering directory '<https://ci.centos.org/job/libosinfo-check/systems=libvirt-fedora-28/ws/buil…'> CC test_entity-test-entity.o CC test_device-test-device.o CC test_list-test-list.o CC test_devicelist-test-devicelist.o CC test_devicelinklist-test-devicelinklist.o CC test_filter-test-filter.o CC test_media-test-media.o CC test_product-test-product.o CC test_os-test-os.o CC test_oslist-test-oslist.o CC test_productfilter-test-productfilter.o CC test_platform-test-platform.o CC test_platformlist-test-platformlist.o CC test_db-test-db.o CC test_loader-test-loader.o CC test_isodetect-test-isodetect.o CC test_install_script-test-install-script.o CC test_image-test-image.o CC test_imagelist-test-imagelist.o CC test_mediauris-test-mediauris.o CC test_mediauris-test-uris-common.o CC test_treeuris-test-treeuris.o CC test_treeuris-test-uris-common.o CC test_imageuris-test-imageuris.o CC test_imageuris-test-uris-common.o CCLD test-entity CCLD test-device CCLD test-list CCLD test-devicelist CCLD test-devicelinklist CCLD test-filter CCLD test-media CCLD test-product CCLD test-os CCLD test-oslist CCLD test-productfilter CCLD test-platform CCLD test-platformlist CCLD test-db CCLD test-loader CCLD test-isodetect CCLD test-install-script CCLD test-image CCLD test-imagelist CCLD test-mediauris CCLD test-treeuris CCLD test-imageuris gmake[2]: Leaving directory '<https://ci.centos.org/job/libosinfo-check/systems=libvirt-fedora-28/ws/buil…'> /usr/bin/gmake check-TESTS gmake[2]: Entering directory '<https://ci.centos.org/job/libosinfo-check/systems=libvirt-fedora-28/ws/buil…'> gmake[3]: Entering directory '<https://ci.centos.org/job/libosinfo-check/systems=libvirt-fedora-28/ws/buil…'> PASS: test-entity PASS: test-list PASS: test-device PASS: test-filter PASS: test-devicelinklist PASS: test-devicelist PASS: test-product PASS: test-oslist PASS: test-media PASS: test-productfilter PASS: test-platform PASS: test-db PASS: test-platformlist PASS: test-loader PASS: test-install-script PASS: test-image PASS: test-imagelist SKIP: test-mediauris SKIP: test-treeuris SKIP: test-imageuris PASS: test-os FAIL: test-isodetect ============================================================================ Testsuite summary for libosinfo 1.4.0 ============================================================================ # TOTAL: 22 # PASS: 18 # SKIP: 3 # XFAIL: 0 # FAIL: 1 # XPASS: 0 # ERROR: 0 ============================================================================ See tests/test-suite.log Please report to libosinfo(a)redhat.com ============================================================================ gmake[3]: *** [Makefile:1460: test-suite.log] Error 1 gmake[3]: Leaving directory '<https://ci.centos.org/job/libosinfo-check/systems=libvirt-fedora-28/ws/buil…'> gmake[2]: *** [Makefile:1568: check-TESTS] Error 2 gmake[2]: Leaving directory '<https://ci.centos.org/job/libosinfo-check/systems=libvirt-fedora-28/ws/buil…'> gmake[1]: *** [Makefile:1786: check-am] Error 2 gmake[1]: Leaving directory '<https://ci.centos.org/job/libosinfo-check/systems=libvirt-fedora-28/ws/buil…'> gmake: *** [Makefile:594: check-recursive] Error 1 + cat tests/test-suite.log =========================================== libosinfo 1.4.0: tests/test-suite.log =========================================== # TOTAL: 22 # PASS: 18 # SKIP: 3 # XFAIL: 0 # FAIL: 1 # XPASS: 0 # ERROR: 0 .. contents:: :depth: 2 FAIL: test-isodetect ==================== /isodetect/pureos: OK /isodetect/voidlinux: ISO void-live-i686-20181111.iso.txt was not matched by OS voidlinux /isodetect/voidlinux: ISO void-live-x86_64-20181111.iso.txt was not matched by OS voidlinux /isodetect/voidlinux: FAIL /isodetect/windows: OK /isodetect/ubuntu: OK /isodetect/sles: OK /isodetect/sled: OK /isodetect/rhel: OK /isodetect/popos: OK /isodetect/opensuse: OK /isodetect/openbsd: OK /isodetect/netbsd: OK /isodetect/mageia: OK /isodetect/gnome: OK /isodetect/freedos: OK /isodetect/freebsd: OK /isodetect/gentoo: ISO install-amd64-minimal-20190212T214502Z.iso.txt was not matched by OS gentoo /isodetect/gentoo: ISO install-x86-minimal-20190214T185527Z.iso.txt was not matched by OS gentoo /isodetect/gentoo: FAIL /isodetect/eos: OK /isodetect/dragonflybsd: OK /isodetect/haiku: OK /isodetect/fedora: OK /isodetect/debian: OK /isodetect/centos: OK /isodetect/asianux: OK /isodetect/altlinux: OK /isodetect/alpinelinux: OK /isodetect/archlinux: ISO archlinux-2019.02.01-x86_64.iso.txt was not matched by OS archlinux /isodetect/archlinux: FAIL /isodetect/android-x86: OK FAIL test-isodetect (exit status: 1) SKIP: test-mediauris ==================== SKIP test-mediauris (exit status: 77) SKIP: test-treeuris =================== SKIP test-treeuris (exit status: 77) SKIP: test-imageuris ==================== SKIP test-imageuris (exit status: 77) + exit 1 Build step 'Execute shell' marked build as failure
1 1
0 0
[Libvirt-ci] Build failed in Jenkins: libosinfo-check » libvirt-centos-7 #95
by ci@centos.org 18 Feb '19

18 Feb '19
See <https://ci.centos.org/job/libosinfo-check/systems=libvirt-centos-7/95/displ…> ------------------------------------------ Started by upstream project "libosinfo-check" build number 95 originally caused by: Started by upstream project "libosinfo-syntax-check" build number 98 originally caused by: Started by upstream project "libosinfo-build" build number 101 originally caused by: Started by an SCM change [EnvInject] - Loading node environment variables. Building remotely on libvirt-centos-7 (libvirt) in workspace <https://ci.centos.org/job/libosinfo-check/systems=libvirt-centos-7/ws/> [libosinfo] $ /bin/sh -xe /tmp/jenkins7697236304086731016.sh + cd build + /usr/bin/gmake check GEN public-submodule-commit Making check in osinfo gmake[1]: Entering directory `<https://ci.centos.org/job/libosinfo-check/systems=libvirt-centos-7/ws/build…'> /usr/bin/gmake check-am gmake[2]: Entering directory `<https://ci.centos.org/job/libosinfo-check/systems=libvirt-centos-7/ws/build…'> /usr/bin/gmake check-local gmake[3]: Entering directory `<https://ci.centos.org/job/libosinfo-check/systems=libvirt-centos-7/ws/build…'> GEN check-symfile GEN check-symsorting gmake[3]: Leaving directory `<https://ci.centos.org/job/libosinfo-check/systems=libvirt-centos-7/ws/build…'> gmake[2]: Leaving directory `<https://ci.centos.org/job/libosinfo-check/systems=libvirt-centos-7/ws/build…'> gmake[1]: Leaving directory `<https://ci.centos.org/job/libosinfo-check/systems=libvirt-centos-7/ws/build…'> Making check in tools gmake[1]: Entering directory `<https://ci.centos.org/job/libosinfo-check/systems=libvirt-centos-7/ws/build…'> gmake[1]: Nothing to be done for `check'. gmake[1]: Leaving directory `<https://ci.centos.org/job/libosinfo-check/systems=libvirt-centos-7/ws/build…'> Making check in docs gmake[1]: Entering directory `<https://ci.centos.org/job/libosinfo-check/systems=libvirt-centos-7/ws/build…'> Making check in reference gmake[2]: Entering directory `<https://ci.centos.org/job/libosinfo-check/systems=libvirt-centos-7/ws/build…'> gmake[2]: Nothing to be done for `check'. gmake[2]: Leaving directory `<https://ci.centos.org/job/libosinfo-check/systems=libvirt-centos-7/ws/build…'> gmake[2]: Entering directory `<https://ci.centos.org/job/libosinfo-check/systems=libvirt-centos-7/ws/build…'> gmake[2]: Nothing to be done for `check-am'. gmake[2]: Leaving directory `<https://ci.centos.org/job/libosinfo-check/systems=libvirt-centos-7/ws/build…'> gmake[1]: Leaving directory `<https://ci.centos.org/job/libosinfo-check/systems=libvirt-centos-7/ws/build…'> Making check in po gmake[1]: Entering directory `<https://ci.centos.org/job/libosinfo-check/systems=libvirt-centos-7/ws/build…'> INTLTOOL_EXTRACT="/usr/bin/intltool-extract" XGETTEXT="/usr/bin/xgettext" srcdir=../../po /usr/bin/intltool-update --gettext-package libosinfo --pot rm -f missing notexist srcdir=../../po /usr/bin/intltool-update -m if [ -r missing -o -r notexist ]; then \ exit 1; \ fi gmake[1]: Leaving directory `<https://ci.centos.org/job/libosinfo-check/systems=libvirt-centos-7/ws/build…'> Making check in examples gmake[1]: Entering directory `<https://ci.centos.org/job/libosinfo-check/systems=libvirt-centos-7/ws/build…'> gmake[1]: Nothing to be done for `check'. gmake[1]: Leaving directory `<https://ci.centos.org/job/libosinfo-check/systems=libvirt-centos-7/ws/build…'> Making check in tests gmake[1]: Entering directory `<https://ci.centos.org/job/libosinfo-check/systems=libvirt-centos-7/ws/build…'> /usr/bin/gmake test-entity test-device test-list test-devicelist test-devicelinklist test-filter test-media test-product test-os test-oslist test-productfilter test-platform test-platformlist test-db test-loader test-isodetect test-install-script test-image test-imagelist test-mediauris test-treeuris test-imageuris gmake[2]: Entering directory `<https://ci.centos.org/job/libosinfo-check/systems=libvirt-centos-7/ws/build…'> CC test_entity-test-entity.o CC test_device-test-device.o CC test_list-test-list.o CC test_devicelist-test-devicelist.o CC test_devicelinklist-test-devicelinklist.o CC test_filter-test-filter.o CC test_media-test-media.o CC test_product-test-product.o CC test_os-test-os.o CC test_oslist-test-oslist.o CC test_productfilter-test-productfilter.o CC test_platform-test-platform.o CC test_platformlist-test-platformlist.o CC test_db-test-db.o CC test_loader-test-loader.o CC test_isodetect-test-isodetect.o CC test_install_script-test-install-script.o CC test_image-test-image.o CC test_imagelist-test-imagelist.o CC test_mediauris-test-mediauris.o CC test_mediauris-test-uris-common.o CC test_treeuris-test-treeuris.o CC test_treeuris-test-uris-common.o CC test_imageuris-test-imageuris.o CC test_imageuris-test-uris-common.o CCLD test-entity CCLD test-device CCLD test-list CCLD test-devicelist CCLD test-devicelinklist CCLD test-filter CCLD test-media CCLD test-product CCLD test-os CCLD test-oslist CCLD test-productfilter CCLD test-platform CCLD test-platformlist CCLD test-db CCLD test-loader CCLD test-isodetect CCLD test-install-script CCLD test-image CCLD test-imagelist CCLD test-mediauris CCLD test-treeuris CCLD test-imageuris gmake[2]: Leaving directory `<https://ci.centos.org/job/libosinfo-check/systems=libvirt-centos-7/ws/build…'> /usr/bin/gmake check-TESTS gmake[2]: Entering directory `<https://ci.centos.org/job/libosinfo-check/systems=libvirt-centos-7/ws/build…'> gmake[3]: Entering directory `<https://ci.centos.org/job/libosinfo-check/systems=libvirt-centos-7/ws/build…'> PASS: test-device PASS: test-list PASS: test-entity PASS: test-devicelist PASS: test-devicelinklist PASS: test-media PASS: test-filter PASS: test-oslist PASS: test-product PASS: test-platform PASS: test-platformlist PASS: test-productfilter PASS: test-db PASS: test-loader PASS: test-install-script PASS: test-image PASS: test-imagelist SKIP: test-mediauris SKIP: test-treeuris SKIP: test-imageuris PASS: test-os FAIL: test-isodetect gmake[4]: Entering directory `<https://ci.centos.org/job/libosinfo-check/systems=libvirt-centos-7/ws/build…'> gmake[4]: Nothing to be done for `all'. gmake[4]: Leaving directory `<https://ci.centos.org/job/libosinfo-check/systems=libvirt-centos-7/ws/build…'> ============================================================================ Testsuite summary for libosinfo 1.4.0 ============================================================================ # TOTAL: 22 # PASS: 18 # SKIP: 3 # XFAIL: 0 # FAIL: 1 # XPASS: 0 # ERROR: 0 ============================================================================ See tests/test-suite.log Please report to libosinfo(a)redhat.com ============================================================================ gmake[3]: *** [test-suite.log] Error 1 gmake[3]: Leaving directory `<https://ci.centos.org/job/libosinfo-check/systems=libvirt-centos-7/ws/build…'> gmake[2]: *** [check-TESTS] Error 2 gmake[2]: Leaving directory `<https://ci.centos.org/job/libosinfo-check/systems=libvirt-centos-7/ws/build…'> gmake[1]: *** [check-am] Error 2 gmake[1]: Leaving directory `<https://ci.centos.org/job/libosinfo-check/systems=libvirt-centos-7/ws/build…'> gmake: *** [check-recursive] Error 1 + cat tests/test-suite.log =========================================== libosinfo 1.4.0: tests/test-suite.log =========================================== # TOTAL: 22 # PASS: 18 # SKIP: 3 # XFAIL: 0 # FAIL: 1 # XPASS: 0 # ERROR: 0 .. contents:: :depth: 2 FAIL: test-isodetect ==================== /isodetect/voidlinux: ISO void-live-i686-20181111.iso.txt was not matched by OS voidlinux /isodetect/voidlinux: ISO void-live-x86_64-20181111.iso.txt was not matched by OS voidlinux /isodetect/voidlinux: FAIL /isodetect/gentoo: ISO install-amd64-minimal-20190212T214502Z.iso.txt was not matched by OS gentoo /isodetect/gentoo: ISO install-x86-minimal-20190214T185527Z.iso.txt was not matched by OS gentoo /isodetect/gentoo: FAIL /isodetect/eos: OK /isodetect/android-x86: OK /isodetect/dragonflybsd: OK /isodetect/haiku: OK /isodetect/pureos: OK /isodetect/archlinux: ISO archlinux-2019.02.01-x86_64.iso.txt was not matched by OS archlinux /isodetect/archlinux: FAIL /isodetect/windows: OK /isodetect/ubuntu: OK /isodetect/sles: OK /isodetect/sled: OK /isodetect/rhel: OK /isodetect/popos: OK /isodetect/opensuse: OK /isodetect/openbsd: OK /isodetect/netbsd: OK /isodetect/mageia: OK /isodetect/gnome: OK /isodetect/freedos: OK /isodetect/freebsd: OK /isodetect/fedora: OK /isodetect/debian: OK /isodetect/centos: OK /isodetect/asianux: OK /isodetect/altlinux: OK /isodetect/alpinelinux: OK SKIP: test-mediauris ==================== SKIP: test-treeuris =================== SKIP: test-imageuris ==================== + exit 1 Build step 'Execute shell' marked build as failure
1 1
0 0
[Libvirt-ci] Build failed in Jenkins: libosinfo-check » libvirt-debian-8 #95
by ci@centos.org 18 Feb '19

18 Feb '19
See <https://ci.centos.org/job/libosinfo-check/systems=libvirt-debian-8/95/displ…> ------------------------------------------ Started by upstream project "libosinfo-check" build number 95 originally caused by: Started by upstream project "libosinfo-syntax-check" build number 98 originally caused by: Started by upstream project "libosinfo-build" build number 101 originally caused by: Started by an SCM change [EnvInject] - Loading node environment variables. Building remotely on libvirt-debian-8 (libvirt) in workspace <https://ci.centos.org/job/libosinfo-check/systems=libvirt-debian-8/ws/> [libosinfo] $ /bin/sh -xe /tmp/jenkins5219751430104423085.sh + cd build + /usr/bin/make check GEN public-submodule-commit Making check in osinfo make[1]: Entering directory '<https://ci.centos.org/job/libosinfo-check/systems=libvirt-debian-8/ws/build…'> /usr/bin/make check-am make[2]: Entering directory '<https://ci.centos.org/job/libosinfo-check/systems=libvirt-debian-8/ws/build…'> /usr/bin/make check-local make[3]: Entering directory '<https://ci.centos.org/job/libosinfo-check/systems=libvirt-debian-8/ws/build…'> GEN check-symsorting GEN check-symfile make[3]: Leaving directory '<https://ci.centos.org/job/libosinfo-check/systems=libvirt-debian-8/ws/build…'> make[2]: Leaving directory '<https://ci.centos.org/job/libosinfo-check/systems=libvirt-debian-8/ws/build…'> make[1]: Leaving directory '<https://ci.centos.org/job/libosinfo-check/systems=libvirt-debian-8/ws/build…'> Making check in tools make[1]: Entering directory '<https://ci.centos.org/job/libosinfo-check/systems=libvirt-debian-8/ws/build…'> make[1]: Nothing to be done for 'check'. make[1]: Leaving directory '<https://ci.centos.org/job/libosinfo-check/systems=libvirt-debian-8/ws/build…'> Making check in docs make[1]: Entering directory '<https://ci.centos.org/job/libosinfo-check/systems=libvirt-debian-8/ws/build…'> Making check in reference make[2]: Entering directory '<https://ci.centos.org/job/libosinfo-check/systems=libvirt-debian-8/ws/build…'> make[2]: Nothing to be done for 'check'. make[2]: Leaving directory '<https://ci.centos.org/job/libosinfo-check/systems=libvirt-debian-8/ws/build…'> make[2]: Entering directory '<https://ci.centos.org/job/libosinfo-check/systems=libvirt-debian-8/ws/build…'> make[2]: Nothing to be done for 'check-am'. make[2]: Leaving directory '<https://ci.centos.org/job/libosinfo-check/systems=libvirt-debian-8/ws/build…'> make[1]: Leaving directory '<https://ci.centos.org/job/libosinfo-check/systems=libvirt-debian-8/ws/build…'> Making check in po make[1]: Entering directory '<https://ci.centos.org/job/libosinfo-check/systems=libvirt-debian-8/ws/build…'> INTLTOOL_EXTRACT="/usr/bin/intltool-extract" XGETTEXT="/usr/bin/xgettext" srcdir=../../po /usr/bin/intltool-update --gettext-package libosinfo --pot rm -f missing notexist srcdir=../../po /usr/bin/intltool-update -m if [ -r missing -o -r notexist ]; then \ exit 1; \ fi make[1]: Leaving directory '<https://ci.centos.org/job/libosinfo-check/systems=libvirt-debian-8/ws/build…'> Making check in examples make[1]: Entering directory '<https://ci.centos.org/job/libosinfo-check/systems=libvirt-debian-8/ws/build…'> make[1]: Nothing to be done for 'check'. make[1]: Leaving directory '<https://ci.centos.org/job/libosinfo-check/systems=libvirt-debian-8/ws/build…'> Making check in tests make[1]: Entering directory '<https://ci.centos.org/job/libosinfo-check/systems=libvirt-debian-8/ws/build…'> /usr/bin/make test-entity test-device test-list test-devicelist test-devicelinklist test-filter test-media test-product test-os test-oslist test-productfilter test-platform test-platformlist test-db test-loader test-isodetect test-install-script test-image test-imagelist test-mediauris test-treeuris test-imageuris make[2]: Entering directory '<https://ci.centos.org/job/libosinfo-check/systems=libvirt-debian-8/ws/build…'> CC test_entity-test-entity.o CC test_device-test-device.o CC test_list-test-list.o CC test_devicelist-test-devicelist.o CC test_devicelinklist-test-devicelinklist.o CC test_filter-test-filter.o CC test_media-test-media.o CC test_product-test-product.o CC test_os-test-os.o CC test_oslist-test-oslist.o CC test_productfilter-test-productfilter.o CC test_platform-test-platform.o CC test_platformlist-test-platformlist.o CC test_db-test-db.o CC test_loader-test-loader.o CC test_install_script-test-install-script.o CC test_isodetect-test-isodetect.o CC test_image-test-image.o CC test_imagelist-test-imagelist.o CC test_mediauris-test-mediauris.o CC test_mediauris-test-uris-common.o CC test_treeuris-test-treeuris.o CC test_treeuris-test-uris-common.o CC test_imageuris-test-imageuris.o CC test_imageuris-test-uris-common.o CCLD test-entity CCLD test-device CCLD test-list CCLD test-devicelist CCLD test-devicelinklist CCLD test-filter CCLD test-media CCLD test-product CCLD test-os CCLD test-oslist CCLD test-productfilter CCLD test-platform CCLD test-platformlist CCLD test-db CCLD test-loader CCLD test-isodetect CCLD test-install-script CCLD test-image CCLD test-imagelist CCLD test-mediauris CCLD test-treeuris CCLD test-imageuris make[2]: Leaving directory '<https://ci.centos.org/job/libosinfo-check/systems=libvirt-debian-8/ws/build…'> /usr/bin/make check-TESTS make[2]: Entering directory '<https://ci.centos.org/job/libosinfo-check/systems=libvirt-debian-8/ws/build…'> make[3]: Entering directory '<https://ci.centos.org/job/libosinfo-check/systems=libvirt-debian-8/ws/build…'> PASS: test-device PASS: test-list PASS: test-entity PASS: test-devicelinklist PASS: test-filter PASS: test-devicelist PASS: test-product PASS: test-oslist PASS: test-productfilter PASS: test-media PASS: test-platform PASS: test-platformlist PASS: test-db PASS: test-loader PASS: test-install-script PASS: test-image PASS: test-imagelist SKIP: test-mediauris SKIP: test-treeuris SKIP: test-imageuris PASS: test-os FAIL: test-isodetect make[4]: Entering directory '<https://ci.centos.org/job/libosinfo-check/systems=libvirt-debian-8/ws/build…'> make[4]: Nothing to be done for 'all'. make[4]: Leaving directory '<https://ci.centos.org/job/libosinfo-check/systems=libvirt-debian-8/ws/build…'> ============================================================================ Testsuite summary for libosinfo 1.4.0 ============================================================================ # TOTAL: 22 # PASS: 18 # SKIP: 3 # XFAIL: 0 # FAIL: 1 # XPASS: 0 # ERROR: 0 ============================================================================ See tests/test-suite.log Please report to libosinfo(a)redhat.com ============================================================================ Makefile:1450: recipe for target 'test-suite.log' failed make[3]: *** [test-suite.log] Error 1 make[3]: Leaving directory '<https://ci.centos.org/job/libosinfo-check/systems=libvirt-debian-8/ws/build…'> Makefile:1556: recipe for target 'check-TESTS' failed make[2]: *** [check-TESTS] Error 2 make[2]: Leaving directory '<https://ci.centos.org/job/libosinfo-check/systems=libvirt-debian-8/ws/build…'> Makefile:1776: recipe for target 'check-am' failed make[1]: *** [check-am] Error 2 make[1]: Leaving directory '<https://ci.centos.org/job/libosinfo-check/systems=libvirt-debian-8/ws/build…'> Makefile:585: recipe for target 'check-recursive' failed make: *** [check-recursive] Error 1 + cat tests/test-suite.log =========================================== libosinfo 1.4.0: tests/test-suite.log =========================================== # TOTAL: 22 # PASS: 18 # SKIP: 3 # XFAIL: 0 # FAIL: 1 # XPASS: 0 # ERROR: 0 .. contents:: :depth: 2 FAIL: test-isodetect ==================== /isodetect/haiku: OK /isodetect/dragonflybsd: OK /isodetect/eos: OK /isodetect/android-x86: OK /isodetect/windows: OK /isodetect/ubuntu: OK /isodetect/sles: OK /isodetect/sled: OK /isodetect/rhel: OK /isodetect/popos: OK /isodetect/opensuse: OK /isodetect/openbsd: OK /isodetect/netbsd: OK /isodetect/mageia: OK /isodetect/gnome: OK /isodetect/freedos: OK /isodetect/freebsd: OK /isodetect/fedora: OK /isodetect/debian: OK /isodetect/centos: OK /isodetect/asianux: OK /isodetect/altlinux: OK /isodetect/alpinelinux: OK /isodetect/voidlinux: ISO void-live-i686-20181111.iso.txt was not matched by OS voidlinux /isodetect/voidlinux: ISO void-live-x86_64-20181111.iso.txt was not matched by OS voidlinux /isodetect/voidlinux: FAIL /isodetect/gentoo: ISO install-amd64-minimal-20190212T214502Z.iso.txt was not matched by OS gentoo /isodetect/gentoo: ISO install-x86-minimal-20190214T185527Z.iso.txt was not matched by OS gentoo /isodetect/gentoo: FAIL /isodetect/archlinux: ISO archlinux-2019.02.01-x86_64.iso.txt was not matched by OS archlinux /isodetect/archlinux: FAIL /isodetect/pureos: OK SKIP: test-mediauris ==================== SKIP: test-treeuris =================== SKIP: test-imageuris ==================== + exit 1 Build step 'Execute shell' marked build as failure
1 1
0 0
[Libvirt-ci] Build failed in Jenkins: libosinfo-syntax-check » libvirt-fedora-rawhide #96
by ci@centos.org 18 Feb '19

18 Feb '19
See <https://ci.centos.org/job/libosinfo-syntax-check/systems=libvirt-fedora-raw…> ------------------------------------------ Started by upstream project "libosinfo-syntax-check" build number 96 originally caused by: Started by upstream project "libosinfo-build" build number 99 originally caused by: Started by an SCM change [EnvInject] - Loading node environment variables. Building remotely on libvirt-fedora-rawhide (libvirt) in workspace <https://ci.centos.org/job/libosinfo-syntax-check/systems=libvirt-fedora-raw…> [libosinfo] $ /bin/sh -xe /tmp/jenkins4384216978792221687.sh + cd build + /usr/bin/gmake syntax-check GFDL_version TAB_in_indentation Wundef_boolean avoid_attribute_unused_in_header bindtextdomain avoid_if_before_free bracket_spacing_check cast_of_argument_to_free changelog cast_of_x_alloc_return_value copyright_check const_long_option copyright_format error_message_period error_message_warn_fatal m4_quote_check makefile_TAB_only_indentation makefile_at_at_check makefile_path_separator_check obsolete_symbols po_check preprocessor_indentation prohibit_HAVE_MBRTOWC prohibit_S_IS_definition prohibit_always-defined_macros prohibit_argmatch_without_use prohibit_assert_without_use prohibit_atoi_atof prohibit_backup_files prohibit_c_ctype_without_use prohibit_canonicalize_without_use prohibit_cloexec_without_use prohibit_close_stream_without_use prohibit_cvs_keyword prohibit_defined_have_decl_tests prohibit_dirent_without_use prohibit_doubled_word prohibit_empty_lines_at_EOF prohibit_error_without_use prohibit_getopt_without_use prohibit_hash_pjw_without_use prohibit_hash_without_use prohibit_have_config_h prohibit_ignore_value_without_use prohibit_intprops_without_use prohibit_inttostr_without_use prohibit_long_options_without_use prohibit_magic_number_exit prohibit_openat_without_use prohibit_path_max_allocation prohibit_posixver_without_use prohibit_quote_without_use prohibit_quotearg_without_use prohibit_reversed_compare_failure prohibit_root_dev_ino_without_use prohibit_safe_read_without_use prohibit_same_without_use prohibit_signal_without_use prohibit_stat_st_blocks prohibit_stddef_without_use prohibit_stdio--_without_use prohibit_stdio-safer_without_use prohibit_strcmp prohibit_strings_without_use prohibit_strncpy prohibit_test_double_equal prohibit_test_minus_ao prohibit_undesirable_word_seq prohibit_verify_without_use prohibit_xalloc_without_use prohibit_xfreopen_without_use proper_name_utf8_requires_ICONV redundant_const require_config_h require_config_h_first require_test_exit_idiom space_tab texinfo_acronym tight_scope trailing_blank unmarked_diagnostics useless_cpp_parens vulnerable_makefile_CVE-2009-4029 vulnerable_makefile_CVE-2012-3386 GEN sc_bracket_spacing_check ../tests/test-uris-common.c maint.mk: empty line(s) or no newline at EOF gmake: *** [../maint.mk:926: sc_prohibit_empty_lines_at_EOF] Error 1 gmake: *** Waiting for unfinished jobs.... Build step 'Execute shell' marked build as failure
1 2
0 0
[Libvirt-ci] Build failed in Jenkins: libosinfo-syntax-check » libvirt-freebsd-12 #96
by ci@centos.org 18 Feb '19

18 Feb '19
See <https://ci.centos.org/job/libosinfo-syntax-check/systems=libvirt-freebsd-12…> ------------------------------------------ Started by upstream project "libosinfo-syntax-check" build number 96 originally caused by: Started by upstream project "libosinfo-build" build number 99 originally caused by: Started by an SCM change [EnvInject] - Loading node environment variables. Building remotely on libvirt-freebsd-12 (libvirt) in workspace <https://ci.centos.org/job/libosinfo-syntax-check/systems=libvirt-freebsd-12…> [libosinfo] $ /bin/sh -xe /tmp/jenkins4251744045871081114.sh + cd build + /usr/local/bin/gmake syntax-check GFDL_version TAB_in_indentation Wundef_boolean avoid_if_before_free bindtextdomain avoid_attribute_unused_in_header bracket_spacing_check cast_of_argument_to_free changelog cast_of_x_alloc_return_value const_long_option copyright_check copyright_format error_message_period error_message_warn_fatal m4_quote_check makefile_TAB_only_indentation makefile_at_at_check makefile_path_separator_check obsolete_symbols po_check preprocessor_indentation prohibit_HAVE_MBRTOWC prohibit_S_IS_definition prohibit_always-defined_macros prohibit_assert_without_use prohibit_argmatch_without_use prohibit_atoi_atof prohibit_backup_files prohibit_c_ctype_without_use prohibit_canonicalize_without_use prohibit_cloexec_without_use prohibit_close_stream_without_use prohibit_cvs_keyword prohibit_defined_have_decl_tests prohibit_dirent_without_use prohibit_error_without_use prohibit_doubled_word prohibit_empty_lines_at_EOF prohibit_hash_pjw_without_use prohibit_hash_without_use prohibit_getopt_without_use prohibit_have_config_h prohibit_ignore_value_without_use prohibit_intprops_without_use prohibit_inttostr_without_use prohibit_long_options_without_use prohibit_magic_number_exit prohibit_openat_without_use prohibit_path_max_allocation prohibit_posixver_without_use prohibit_quote_without_use prohibit_reversed_compare_failure prohibit_quotearg_without_use prohibit_root_dev_ino_without_use prohibit_safe_read_without_use prohibit_same_without_use prohibit_signal_without_use prohibit_stat_st_blocks prohibit_stddef_without_use prohibit_stdio--_without_use prohibit_stdio-safer_without_use prohibit_strcmp prohibit_strings_without_use prohibit_strncpy prohibit_test_double_equal prohibit_test_minus_ao prohibit_undesirable_word_seq prohibit_verify_without_use prohibit_xalloc_without_use proper_name_utf8_requires_ICONV prohibit_xfreopen_without_use redundant_const require_config_h require_config_h_first require_test_exit_idiom space_tab texinfo_acronym tight_scope trailing_blank unmarked_diagnostics useless_cpp_parens vulnerable_makefile_CVE-2009-4029 vulnerable_makefile_CVE-2012-3386 GEN sc_bracket_spacing_check ../tests/test-uris-common.c maint.mk: empty line(s) or no newline at EOF gmake: *** [../maint.mk:926: sc_prohibit_empty_lines_at_EOF] Error 1 gmake: *** Waiting for unfinished jobs.... Build step 'Execute shell' marked build as failure
1 2
0 0
  • ← Newer
  • 1
  • 2
  • 3
  • 4
  • 5
  • 6
  • 7
  • ...
  • 14
  • Older →

HyperKitty Powered by HyperKitty version 1.3.12.