libvirt List Archives
Sign In Sign Up
Manage this list Sign In Sign Up

Keyboard Shortcuts

Thread View

  • j: Next unread message
  • k: Previous unread message
  • j a: Jump to all threads
  • j l: Jump to MailingList overview

CI

Thread Start a new thread
Download
Threads by month
  • ----- 2025 -----
  • August
  • July
  • June
  • May
  • April
  • March
  • February
  • January
  • ----- 2024 -----
  • December
  • November
  • October
  • September
  • August
  • July
  • June
  • May
  • April
  • March
  • February
  • January
  • ----- 2023 -----
  • December
  • November
  • October
  • September
  • August
  • July
  • June
  • May
  • April
  • March
  • February
  • January
  • ----- 2022 -----
  • December
  • November
  • October
  • September
  • August
  • July
  • June
  • May
  • April
  • March
  • February
  • January
  • ----- 2021 -----
  • December
  • November
  • October
  • September
  • August
  • July
  • June
  • May
  • April
  • March
  • February
  • January
  • ----- 2020 -----
  • December
  • November
  • October
  • September
  • August
  • July
  • June
  • May
  • April
  • March
  • February
  • January
  • ----- 2019 -----
  • December
  • November
  • October
  • September
  • August
  • July
  • June
  • May
  • April
  • March
  • February
  • January
  • ----- 2018 -----
  • December
  • November
  • October
  • September
  • August
  • July
  • June
  • May
  • April
  • March
  • February
  • January
  • ----- 2017 -----
  • December
  • November
  • October
  • September
  • August
  • July
  • June
  • May
  • April
  • March
  • February
  • January
  • ----- 2016 -----
  • December
  • November
  • October
  • September
  • August
  • July
ci@lists.libvirt.org

February 2019

  • 2 participants
  • 132 discussions
[Libvirt-ci] Passed: libvirt/libvirt#2052 (v5.1.0-rc2 - 33a07b8)
by Travis CI 28 Feb '19

28 Feb '19
Build Update for libvirt/libvirt ------------------------------------- Build: #2052 Status: Passed Duration: 22 mins and 2 secs Commit: 33a07b8 (v5.1.0-rc2) Author: Eric Blake Message: snapshot: Improve message for VIR_ERR_INVALID_DOMAIN_SNAPSHOT For consistency with other error messages, and the fact that the object is always called a virDomainSnapshot rather than a mere virSnapshot, include the word "domain" in the error message. Suggested-by: John Ferlan <jferlan(a)redhat.com> Signed-off-by: Eric Blake <eblake(a)redhat.com> Reviewed-by: Daniel P. Berrangé <berrange(a)redhat.com> View the changeset: https://github.com/libvirt/libvirt/compare/v5.1.0-rc2 View the full build log and details: https://travis-ci.org/libvirt/libvirt/builds/499573973?utm_medium=notificat… -- You can unsubscribe from build emails from the libvirt/libvirt repository going to https://travis-ci.org/account/preferences/unsubscribe?repository=4872032&ut…. Or unsubscribe from *all* email updating your settings at https://travis-ci.org/account/preferences/unsubscribe?utm_medium=notificati…. Or configure specific recipients for build notifications in your .travis.yml file. See https://docs.travis-ci.com/user/notifications.
1 0
0 0
[Libvirt-ci] Failed: libvirt/libvirt#2045 (v5.1.0-rc1 - ac62e29)
by Travis CI 26 Feb '19

26 Feb '19
Build Update for libvirt/libvirt ------------------------------------- Build: #2045 Status: Failed Duration: 21 mins and 13 secs Commit: ac62e29 (v5.1.0-rc1) Author: Julio Faracco Message: lxc: Converting 'if, else' logic into a 'switch, case' The structure used to handle network entries was based on 'if,else' conditions. This commit converts this ugly structure into a switch to clearify each option of the handler. Signed-off-by: Julio Faracco <jcfaracco(a)gmail.com> Reviewed-by: John Ferlan <jferlan(a)redhat.com> View the changeset: https://github.com/libvirt/libvirt/compare/v5.1.0-rc1 View the full build log and details: https://travis-ci.org/libvirt/libvirt/builds/498459437?utm_medium=notificat… -- You can unsubscribe from build emails from the libvirt/libvirt repository going to https://travis-ci.org/account/preferences/unsubscribe?repository=4872032&ut…. Or unsubscribe from *all* email updating your settings at https://travis-ci.org/account/preferences/unsubscribe?utm_medium=notificati…. Or configure specific recipients for build notifications in your .travis.yml file. See https://docs.travis-ci.com/user/notifications.
1 0
0 0
[Libvirt-ci] Build failed in Jenkins: libvirt-go-xml-check » libvirt-fedora-rawhide #271
by ci@centos.org 25 Feb '19

25 Feb '19
See <https://ci.centos.org/job/libvirt-go-xml-check/systems=libvirt-fedora-rawhi…> ------------------------------------------ Started by upstream project "libvirt-go-xml-check" build number 271 originally caused by: Started by upstream project "libvirt-go-xml-build" build number 271 originally caused by: Started by upstream project "libvirt-build" build number 333 originally caused by: Started by an SCM change [EnvInject] - Loading node environment variables. Building remotely on libvirt-fedora-rawhide (libvirt) in workspace <https://ci.centos.org/job/libvirt-go-xml-check/systems=libvirt-fedora-rawhi…> [libvirt-go-xml] $ /bin/sh -xe /tmp/jenkins1197662944007306053.sh + export 'TEST_ARGS=-tags xmlroundtrip' + TEST_ARGS='-tags xmlroundtrip' + go test -tags xmlroundtrip --- FAIL: TestRoundTrip (7.46s) xml_test.go:400: testdata/libvirt/tests/bhyvexml2argvdata/bhyvexml2argv-msrs.xml: /domain[0]/features[0]/msrs[0]: element in expected XML missing in actual XML FAIL exit status 1 FAIL _<https://ci.centos.org/job/libvirt-go-xml-check/systems=libvirt-fedora-rawhi…> 7.641s Build step 'Execute shell' marked build as failure
1 3
0 0
[Libvirt-ci] Build failed in Jenkins: libvirt-go-xml-check » libvirt-freebsd-11 #271
by ci@centos.org 25 Feb '19

25 Feb '19
See <https://ci.centos.org/job/libvirt-go-xml-check/systems=libvirt-freebsd-11/2…> ------------------------------------------ Started by upstream project "libvirt-go-xml-check" build number 271 originally caused by: Started by upstream project "libvirt-go-xml-build" build number 271 originally caused by: Started by upstream project "libvirt-build" build number 333 originally caused by: Started by an SCM change [EnvInject] - Loading node environment variables. Building remotely on libvirt-freebsd-11 (libvirt) in workspace <https://ci.centos.org/job/libvirt-go-xml-check/systems=libvirt-freebsd-11/w…> [libvirt-go-xml] $ /bin/sh -xe /tmp/jenkins7820210270750742829.sh + export 'TEST_ARGS=-tags xmlroundtrip' + go test -tags xmlroundtrip --- FAIL: TestRoundTrip (19.76s) xml_test.go:400: testdata/libvirt/tests/bhyvexml2argvdata/bhyvexml2argv-msrs.xml: /domain[0]/features[0]/msrs[0]: element in expected XML missing in actual XML FAIL exit status 1 FAIL _/usr<https://ci.centos.org/job/libvirt-go-xml-check/systems=libvirt-freebsd-11/w…> 19.879s Build step 'Execute shell' marked build as failure
1 3
0 0
[Libvirt-ci] Build failed in Jenkins: libvirt-go-xml-check » libvirt-debian-8 #271
by ci@centos.org 25 Feb '19

25 Feb '19
See <https://ci.centos.org/job/libvirt-go-xml-check/systems=libvirt-debian-8/271…> ------------------------------------------ Started by upstream project "libvirt-go-xml-check" build number 271 originally caused by: Started by upstream project "libvirt-go-xml-build" build number 271 originally caused by: Started by upstream project "libvirt-build" build number 333 originally caused by: Started by an SCM change [EnvInject] - Loading node environment variables. Building remotely on libvirt-debian-8 (libvirt) in workspace <https://ci.centos.org/job/libvirt-go-xml-check/systems=libvirt-debian-8/ws/> [libvirt-go-xml] $ /bin/sh -xe /tmp/jenkins59097929318135214.sh + export TEST_ARGS=-tags xmlroundtrip + go test -tags xmlroundtrip --- FAIL: TestRoundTrip (8.74s) xml_test.go:400: testdata/libvirt/tests/bhyvexml2argvdata/bhyvexml2argv-msrs.xml: /domain[0]/features[0]/msrs[0]: element in expected XML missing in actual XML FAIL exit status 1 FAIL _<https://ci.centos.org/job/libvirt-go-xml-check/systems=libvirt-debian-8/ws/> 8.818s Build step 'Execute shell' marked build as failure
1 3
0 0
[Libvirt-ci] Build failed in Jenkins: libvirt-go-xml-check » libvirt-freebsd-12 #271
by ci@centos.org 25 Feb '19

25 Feb '19
See <https://ci.centos.org/job/libvirt-go-xml-check/systems=libvirt-freebsd-12/2…> ------------------------------------------ Started by upstream project "libvirt-go-xml-check" build number 271 originally caused by: Started by upstream project "libvirt-go-xml-build" build number 271 originally caused by: Started by upstream project "libvirt-build" build number 333 originally caused by: Started by an SCM change [EnvInject] - Loading node environment variables. Building remotely on libvirt-freebsd-12 (libvirt) in workspace <https://ci.centos.org/job/libvirt-go-xml-check/systems=libvirt-freebsd-12/w…> [libvirt-go-xml] $ /bin/sh -xe /tmp/jenkins2302911717799136619.sh + export 'TEST_ARGS=-tags xmlroundtrip' + go test -tags xmlroundtrip --- FAIL: TestRoundTrip (10.06s) xml_test.go:400: testdata/libvirt/tests/bhyvexml2argvdata/bhyvexml2argv-msrs.xml: /domain[0]/features[0]/msrs[0]: element in expected XML missing in actual XML FAIL exit status 1 FAIL _/usr<https://ci.centos.org/job/libvirt-go-xml-check/systems=libvirt-freebsd-12/w…> 10.114s Build step 'Execute shell' marked build as failure
1 3
0 0
[Libvirt-ci] Build failed in Jenkins: libvirt-go-xml-check » libvirt-fedora-29 #271
by ci@centos.org 25 Feb '19

25 Feb '19
See <https://ci.centos.org/job/libvirt-go-xml-check/systems=libvirt-fedora-29/27…> ------------------------------------------ Started by upstream project "libvirt-go-xml-check" build number 271 originally caused by: Started by upstream project "libvirt-go-xml-build" build number 271 originally caused by: Started by upstream project "libvirt-build" build number 333 originally caused by: Started by an SCM change [EnvInject] - Loading node environment variables. Building remotely on libvirt-fedora-29 (libvirt) in workspace <https://ci.centos.org/job/libvirt-go-xml-check/systems=libvirt-fedora-29/ws/> [libvirt-go-xml] $ /bin/sh -xe /tmp/jenkins4464472918900037956.sh + export 'TEST_ARGS=-tags xmlroundtrip' + TEST_ARGS='-tags xmlroundtrip' + go test -tags xmlroundtrip --- FAIL: TestRoundTrip (8.26s) xml_test.go:400: testdata/libvirt/tests/bhyvexml2argvdata/bhyvexml2argv-msrs.xml: /domain[0]/features[0]/msrs[0]: element in expected XML missing in actual XML FAIL exit status 1 FAIL _<https://ci.centos.org/job/libvirt-go-xml-check/systems=libvirt-fedora-29/ws/> 8.354s Build step 'Execute shell' marked build as failure
1 3
0 0
[Libvirt-ci] Build failed in Jenkins: libvirt-go-xml-check » libvirt-fedora-28 #271
by ci@centos.org 25 Feb '19

25 Feb '19
See <https://ci.centos.org/job/libvirt-go-xml-check/systems=libvirt-fedora-28/27…> ------------------------------------------ Started by upstream project "libvirt-go-xml-check" build number 271 originally caused by: Started by upstream project "libvirt-go-xml-build" build number 271 originally caused by: Started by upstream project "libvirt-build" build number 333 originally caused by: Started by an SCM change [EnvInject] - Loading node environment variables. Building remotely on libvirt-fedora-28 (libvirt) in workspace <https://ci.centos.org/job/libvirt-go-xml-check/systems=libvirt-fedora-28/ws/> [libvirt-go-xml] $ /bin/sh -xe /tmp/jenkins8022904236372059012.sh + export 'TEST_ARGS=-tags xmlroundtrip' + TEST_ARGS='-tags xmlroundtrip' + go test -tags xmlroundtrip --- FAIL: TestRoundTrip (17.55s) xml_test.go:400: testdata/libvirt/tests/bhyvexml2argvdata/bhyvexml2argv-msrs.xml: /domain[0]/features[0]/msrs[0]: element in expected XML missing in actual XML FAIL exit status 1 FAIL _<https://ci.centos.org/job/libvirt-go-xml-check/systems=libvirt-fedora-28/ws/> 17.700s Build step 'Execute shell' marked build as failure
1 3
0 0
[Libvirt-ci] Build failed in Jenkins: libvirt-go-xml-check » libvirt-debian-9 #271
by ci@centos.org 25 Feb '19

25 Feb '19
See <https://ci.centos.org/job/libvirt-go-xml-check/systems=libvirt-debian-9/271…> ------------------------------------------ Started by upstream project "libvirt-go-xml-check" build number 271 originally caused by: Started by upstream project "libvirt-go-xml-build" build number 271 originally caused by: Started by upstream project "libvirt-build" build number 333 originally caused by: Started by an SCM change [EnvInject] - Loading node environment variables. Building remotely on libvirt-debian-9 (libvirt) in workspace <https://ci.centos.org/job/libvirt-go-xml-check/systems=libvirt-debian-9/ws/> [libvirt-go-xml] $ /bin/sh -xe /tmp/jenkins2053944181236472426.sh + export TEST_ARGS=-tags xmlroundtrip + go test -tags xmlroundtrip --- FAIL: TestRoundTrip (22.61s) xml_test.go:400: testdata/libvirt/tests/bhyvexml2argvdata/bhyvexml2argv-msrs.xml: /domain[0]/features[0]/msrs[0]: element in expected XML missing in actual XML FAIL exit status 1 FAIL _<https://ci.centos.org/job/libvirt-go-xml-check/systems=libvirt-debian-9/ws/> 22.702s Build step 'Execute shell' marked build as failure
1 3
0 0
[Libvirt-ci] Build failed in Jenkins: libvirt-dbus-check » libvirt-fedora-rawhide #221
by ci@centos.org 25 Feb '19

25 Feb '19
See <https://ci.centos.org/job/libvirt-dbus-check/systems=libvirt-fedora-rawhide…> ------------------------------------------ [...truncated 21.54 KB...] def call_blocking(self, bus_name, object_path, dbus_interface, method, signature, args, timeout=-1.0, byte_arrays=False, **kwargs): """Call the given method, synchronously. :Since: 0.81.0 """ if object_path == LOCAL_PATH: raise DBusException('Methods may not be called on the reserved ' 'path %s' % LOCAL_PATH) if dbus_interface == LOCAL_IFACE: raise DBusException('Methods may not be called on the reserved ' 'interface %s' % LOCAL_IFACE) # no need to validate other args - MethodCallMessage ctor will do get_args_opts = dict(byte_arrays=byte_arrays) if is_py2: get_args_opts['utf8_strings'] = kwargs.get('utf8_strings', False) elif 'utf8_strings' in kwargs: raise TypeError("unexpected keyword argument 'utf8_strings'") message = MethodCallMessage(destination=bus_name, path=object_path, interface=dbus_interface, method=method) # Add the arguments to the function try: message.append(signature=signature, *args) except Exception as e: logging.basicConfig() _logger.error('Unable to set arguments %r according to ' 'signature %r: %s: %s', args, signature, e.__class__, e) raise # make a blocking call reply_message = self.send_message_with_reply_and_block( > message, timeout) E dbus.exceptions.DBusException: org.libvirt.Error: internal error: domain 'test' not running /usr/lib64/python3.7/site-packages/dbus/connection.py:651: DBusException --------------------------- Captured stderr teardown --------------------------- Disconnected from D-Bus. =============================== warnings summary =============================== tests/test_domain.py::TestDomain::()::test_suspend source:362: DeprecationWarning: invalid escape sequence \ source:399: DeprecationWarning: invalid escape sequence \ tests/test_domain.py::TestDomain::()::test_undefine source:362: DeprecationWarning: invalid escape sequence \ source:399: DeprecationWarning: invalid escape sequence \ -- Docs: https://docs.pytest.org/en/latest/warnings.html =========== 2 failed, 7 passed, 4 warnings, 1 error in 9.39 seconds ============ FAIL test_domain.py (exit status: 1) FAIL: test_interface.py ======================= ============================= test session starts ============================== platform linux -- Python 3.7.2, pytest-3.9.3, py-1.7.0, pluggy-0.8.1 rootdir: <https://ci.centos.org/job/libvirt-dbus-check/systems=libvirt-fedora-rawhide…,> inifile: collected 5 items ../../tests/test_interface.py E..EE [100%] ==================================== ERRORS ==================================== ___________ ERROR at setup of TestInterface.test_interface_undefine ____________ self = <test_interface.TestInterface object at 0x7fcf97490eb8> request = <SubRequest 'libvirt_dbus_setup' for <Function 'test_interface_undefine'>> @pytest.fixture(autouse=True) def libvirt_dbus_setup(self, request): """Start libvirt-dbus for each test function """ os.environ['LIBVIRT_DEBUG'] = '3' self.libvirt_dbus = subprocess.Popen([exe, '--session']) self.bus = dbus.SessionBus() for i in range(10): if self.bus.name_has_owner('org.libvirt'): break time.sleep(0.1) else: > raise TimeoutError('error starting libvirt-dbus') E TimeoutError: error starting libvirt-dbus ../../tests/libvirttest.py:44: TimeoutError ---------------------------- Captured stderr setup ----------------------------- dbus-daemon[12848]: Cannot setup inotify for '/home/jenkins/.local/share/dbus-1/services'; error 'Permission denied' ______ ERROR at setup of TestInterface.test_interface_get_xml_description ______ self = <test_interface.TestInterface object at 0x7fcf974bc160> @pytest.fixture def interface_create(self): """ Fixture to define dummy interface on the test driver This fixture should be used in the setup of every test manipulating with interfaces. """ path = self.connect.InterfaceDefineXML(xmldata.minimal_interface_xml, 0) obj = self.bus.get_object('org.libvirt', path) interface_obj = dbus.Interface(obj, 'org.libvirt.Interface') > interface_obj.Create(0) ../../tests/libvirttest.py:84: _ _ _ _ _ _ _ _ _ _ _ _ _ _ _ _ _ _ _ _ _ _ _ _ _ _ _ _ _ _ _ _ _ _ _ _ _ _ _ _ /usr/lib64/python3.7/site-packages/dbus/proxies.py:70: in __call__ return self._proxy_method(*args, **keywords) /usr/lib64/python3.7/site-packages/dbus/proxies.py:145: in __call__ **keywords) _ _ _ _ _ _ _ _ _ _ _ _ _ _ _ _ _ _ _ _ _ _ _ _ _ _ _ _ _ _ _ _ _ _ _ _ _ _ _ _ self = <dbus._dbus.SessionBus (session) at 0x7fcf974a9518> bus_name = dbus.String(':1.1') object_path = dbus.ObjectPath('/org/libvirt/Test/interface/11_3a22_3a33_3a44_3a55_3a66') dbus_interface = 'org.libvirt.Interface', method = 'Create', signature = 'u' args = (0,), timeout = -1.0, byte_arrays = False, kwargs = {} get_args_opts = {'byte_arrays': False} message = <dbus.lowlevel.MethodCallMessage path: /org/libvirt/Test/interface/11_3a22_3a33_3a44_3a55_3a66, iface: org.libvirt.Interface, member: Create dest: :1.1> def call_blocking(self, bus_name, object_path, dbus_interface, method, signature, args, timeout=-1.0, byte_arrays=False, **kwargs): """Call the given method, synchronously. :Since: 0.81.0 """ if object_path == LOCAL_PATH: raise DBusException('Methods may not be called on the reserved ' 'path %s' % LOCAL_PATH) if dbus_interface == LOCAL_IFACE: raise DBusException('Methods may not be called on the reserved ' 'interface %s' % LOCAL_IFACE) # no need to validate other args - MethodCallMessage ctor will do get_args_opts = dict(byte_arrays=byte_arrays) if is_py2: get_args_opts['utf8_strings'] = kwargs.get('utf8_strings', False) elif 'utf8_strings' in kwargs: raise TypeError("unexpected keyword argument 'utf8_strings'") message = MethodCallMessage(destination=bus_name, path=object_path, interface=dbus_interface, method=method) # Add the arguments to the function try: message.append(signature=signature, *args) except Exception as e: logging.basicConfig() _logger.error('Unable to set arguments %r according to ' 'signature %r: %s: %s', args, signature, e.__class__, e) raise # make a blocking call reply_message = self.send_message_with_reply_and_block( > message, timeout) E dbus.exceptions.DBusException: org.libvirt.Error: Requested operation is not valid /usr/lib64/python3.7/site-packages/dbus/connection.py:651: DBusException ________ ERROR at setup of TestInterface.test_interface_properties_type ________ self = <test_interface.TestInterface object at 0x7fcf97395da0> @pytest.fixture def interface_create(self): """ Fixture to define dummy interface on the test driver This fixture should be used in the setup of every test manipulating with interfaces. """ path = self.connect.InterfaceDefineXML(xmldata.minimal_interface_xml, 0) obj = self.bus.get_object('org.libvirt', path) interface_obj = dbus.Interface(obj, 'org.libvirt.Interface') > interface_obj.Create(0) ../../tests/libvirttest.py:84: _ _ _ _ _ _ _ _ _ _ _ _ _ _ _ _ _ _ _ _ _ _ _ _ _ _ _ _ _ _ _ _ _ _ _ _ _ _ _ _ /usr/lib64/python3.7/site-packages/dbus/proxies.py:70: in __call__ return self._proxy_method(*args, **keywords) /usr/lib64/python3.7/site-packages/dbus/proxies.py:145: in __call__ **keywords) _ _ _ _ _ _ _ _ _ _ _ _ _ _ _ _ _ _ _ _ _ _ _ _ _ _ _ _ _ _ _ _ _ _ _ _ _ _ _ _ self = <dbus._dbus.SessionBus (session) at 0x7fcf974a9518> bus_name = dbus.String(':1.1') object_path = dbus.ObjectPath('/org/libvirt/Test/interface/11_3a22_3a33_3a44_3a55_3a66') dbus_interface = 'org.libvirt.Interface', method = 'Create', signature = 'u' args = (0,), timeout = -1.0, byte_arrays = False, kwargs = {} get_args_opts = {'byte_arrays': False} message = <dbus.lowlevel.MethodCallMessage path: /org/libvirt/Test/interface/11_3a22_3a33_3a44_3a55_3a66, iface: org.libvirt.Interface, member: Create dest: :1.1> def call_blocking(self, bus_name, object_path, dbus_interface, method, signature, args, timeout=-1.0, byte_arrays=False, **kwargs): """Call the given method, synchronously. :Since: 0.81.0 """ if object_path == LOCAL_PATH: raise DBusException('Methods may not be called on the reserved ' 'path %s' % LOCAL_PATH) if dbus_interface == LOCAL_IFACE: raise DBusException('Methods may not be called on the reserved ' 'interface %s' % LOCAL_IFACE) # no need to validate other args - MethodCallMessage ctor will do get_args_opts = dict(byte_arrays=byte_arrays) if is_py2: get_args_opts['utf8_strings'] = kwargs.get('utf8_strings', False) elif 'utf8_strings' in kwargs: raise TypeError("unexpected keyword argument 'utf8_strings'") message = MethodCallMessage(destination=bus_name, path=object_path, interface=dbus_interface, method=method) # Add the arguments to the function try: message.append(signature=signature, *args) except Exception as e: logging.basicConfig() _logger.error('Unable to set arguments %r according to ' 'signature %r: %s: %s', args, signature, e.__class__, e) raise # make a blocking call reply_message = self.send_message_with_reply_and_block( > message, timeout) E dbus.exceptions.DBusException: org.libvirt.Error: Requested operation is not valid /usr/lib64/python3.7/site-packages/dbus/connection.py:651: DBusException =============================== warnings summary =============================== tests/test_interface.py::TestInterface::()::test_interface_get_xml_description source:362: DeprecationWarning: invalid escape sequence \ source:399: DeprecationWarning: invalid escape sequence \ tests/test_interface.py::TestInterface::()::test_interface_properties_type source:362: DeprecationWarning: invalid escape sequence \ source:399: DeprecationWarning: invalid escape sequence \ -- Docs: https://docs.pytest.org/en/latest/warnings.html ================ 2 passed, 4 warnings, 3 error in 6.74 seconds ================= FAIL test_interface.py (exit status: 1) + exit 1 Build step 'Execute shell' marked build as failure
1 1
0 0
  • ← Newer
  • 1
  • 2
  • 3
  • 4
  • ...
  • 14
  • Older →

HyperKitty Powered by HyperKitty version 1.3.12.