libvirt List Archives
Sign In Sign Up
Manage this list Sign In Sign Up

Keyboard Shortcuts

Thread View

  • j: Next unread message
  • k: Previous unread message
  • j a: Jump to all threads
  • j l: Jump to MailingList overview

CI

Thread Start a new thread
Download
Threads by month
  • ----- 2025 -----
  • August
  • July
  • June
  • May
  • April
  • March
  • February
  • January
  • ----- 2024 -----
  • December
  • November
  • October
  • September
  • August
  • July
  • June
  • May
  • April
  • March
  • February
  • January
  • ----- 2023 -----
  • December
  • November
  • October
  • September
  • August
  • July
  • June
  • May
  • April
  • March
  • February
  • January
  • ----- 2022 -----
  • December
  • November
  • October
  • September
  • August
  • July
  • June
  • May
  • April
  • March
  • February
  • January
  • ----- 2021 -----
  • December
  • November
  • October
  • September
  • August
  • July
  • June
  • May
  • April
  • March
  • February
  • January
  • ----- 2020 -----
  • December
  • November
  • October
  • September
  • August
  • July
  • June
  • May
  • April
  • March
  • February
  • January
  • ----- 2019 -----
  • December
  • November
  • October
  • September
  • August
  • July
  • June
  • May
  • April
  • March
  • February
  • January
  • ----- 2018 -----
  • December
  • November
  • October
  • September
  • August
  • July
  • June
  • May
  • April
  • March
  • February
  • January
  • ----- 2017 -----
  • December
  • November
  • October
  • September
  • August
  • July
  • June
  • May
  • April
  • March
  • February
  • January
  • ----- 2016 -----
  • December
  • November
  • October
  • September
  • August
  • July
ci@lists.libvirt.org

November 2019

  • 2 participants
  • 80 discussions
[Libvirt-ci] Broken: libvirt/libvirt#2800 (master - cf91545)
by Travis CI 07 Nov '19

07 Nov '19
Build Update for libvirt/libvirt ------------------------------------- Build: #2800 Status: Broken Duration: 27 mins and 53 secs Commit: cf91545 (master) Author: Andrea Bolognani Message: news: Update for ARM CPU features Signed-off-by: Andrea Bolognani <abologna(a)redhat.com> Tested-by: Andrew Jones <drjones(a)redhat.com> Reviewed-by: Michal Privoznik <mprivozn(a)redhat.com> View the changeset: https://github.com/libvirt/libvirt/compare/3f3f74dbc755...cf915455e440 View the full build log and details: https://travis-ci.org/libvirt/libvirt/builds/608790522?utm_medium=notificat… -- You can unsubscribe from build emails from the libvirt/libvirt repository going to https://travis-ci.org/account/preferences/unsubscribe?repository=4872032&ut…. Or unsubscribe from *all* email updating your settings at https://travis-ci.org/account/preferences/unsubscribe?utm_medium=notificati…. Or configure specific recipients for build notifications in your .travis.yml file. See https://docs.travis-ci.com/user/notifications.
1 0
0 0
[Libvirt-ci] Passed: libvirt/libvirt-python#63 (v5.9.0 - 1236ff5)
by Travis CI 06 Nov '19

06 Nov '19
Build Update for libvirt/libvirt-python ------------------------------------- Build: #63 Status: Passed Duration: 23 mins and 33 secs Commit: 1236ff5 (v5.9.0) Author: Daniel Veillard Message: Release of libvirt-python 5.9.0 * setup.py: update for release Signed-off-by: Daniel Veillard <veillard(a)redhat.com> View the changeset: https://github.com/libvirt/libvirt-python/compare/v5.9.0 View the full build log and details: https://travis-ci.org/libvirt/libvirt-python/builds/608226467?utm_medium=no… -- You can unsubscribe from build emails from the libvirt/libvirt-python repository going to https://travis-ci.org/account/preferences/unsubscribe?repository=4872050&ut…. Or unsubscribe from *all* email updating your settings at https://travis-ci.org/account/preferences/unsubscribe?utm_medium=notificati…. Or configure specific recipients for build notifications in your .travis.yml file. See https://docs.travis-ci.com/user/notifications.
1 0
0 0
[Libvirt-ci] Passed: libvirt/libvirt#2797 (v5.9.0 - a6dfa6e)
by Travis CI 06 Nov '19

06 Nov '19
Build Update for libvirt/libvirt ------------------------------------- Build: #2797 Status: Passed Duration: 48 mins and 41 secs Commit: a6dfa6e (v5.9.0) Author: Daniel Veillard Message: Release of libvirt-5.9.0 * doc/news.xml: update for release Signed-off-by: Daniel Veillard <veillard(a)redhat.com> View the changeset: https://github.com/libvirt/libvirt/compare/v5.9.0 View the full build log and details: https://travis-ci.org/libvirt/libvirt/builds/608226347?utm_medium=notificat… -- You can unsubscribe from build emails from the libvirt/libvirt repository going to https://travis-ci.org/account/preferences/unsubscribe?repository=4872032&ut…. Or unsubscribe from *all* email updating your settings at https://travis-ci.org/account/preferences/unsubscribe?utm_medium=notificati…. Or configure specific recipients for build notifications in your .travis.yml file. See https://docs.travis-ci.com/user/notifications.
1 0
0 0
[Libvirt-ci] Build failed in Jenkins: libvirt-go-xml-check » libvirt-freebsd-12 #806
by ci@centos.org 04 Nov '19

04 Nov '19
See <https://ci.centos.org/job/libvirt-go-xml-check/systems=libvirt-freebsd-12/8…> ------------------------------------------ Started by upstream project "libvirt-go-xml-check" build number 806 originally caused by: Started by upstream project "libvirt-go-xml-build" build number 808 originally caused by: Started by upstream project "libvirt-build" build number 947 originally caused by: Started by an SCM change Running as SYSTEM [EnvInject] - Loading node environment variables. Building remotely on libvirt-freebsd-12 (libvirt) in workspace <https://ci.centos.org/job/libvirt-go-xml-check/systems=libvirt-freebsd-12/w…> [libvirt-go-xml] $ /bin/sh -xe /tmp/jenkins15176476453842207943.sh + export 'TEST_ARGS=-tags xmlroundtrip' + go test -tags xmlroundtrip --- FAIL: TestRoundTrip (7.70s) xml_test.go:413: open testdata/libvirt/tests/domaincapsschemadata: no such file or directory FAIL exit status 1 FAIL _/usr<https://ci.centos.org/job/libvirt-go-xml-check/systems=libvirt-freebsd-12/w…> 7.782s Build step 'Execute shell' marked build as failure
1 3
0 0
[Libvirt-ci] Build failed in Jenkins: libvirt-go-xml-check » libvirt-fedora-rawhide #806
by ci@centos.org 04 Nov '19

04 Nov '19
See <https://ci.centos.org/job/libvirt-go-xml-check/systems=libvirt-fedora-rawhi…> ------------------------------------------ Started by upstream project "libvirt-go-xml-check" build number 806 originally caused by: Started by upstream project "libvirt-go-xml-build" build number 808 originally caused by: Started by upstream project "libvirt-build" build number 947 originally caused by: Started by an SCM change Running as SYSTEM [EnvInject] - Loading node environment variables. Building remotely on libvirt-fedora-rawhide (libvirt) in workspace <https://ci.centos.org/job/libvirt-go-xml-check/systems=libvirt-fedora-rawhi…> [libvirt-go-xml] $ /bin/sh -xe /tmp/jenkins507697814134823727.sh + export 'TEST_ARGS=-tags xmlroundtrip' + TEST_ARGS='-tags xmlroundtrip' + go test -tags xmlroundtrip --- FAIL: TestRoundTrip (24.89s) xml_test.go:413: open testdata/libvirt/tests/domaincapsschemadata: no such file or directory FAIL exit status 1 FAIL _<https://ci.centos.org/job/libvirt-go-xml-check/systems=libvirt-fedora-rawhi…> 24.990s Build step 'Execute shell' marked build as failure
1 3
0 0
[Libvirt-ci] Build failed in Jenkins: libvirt-go-xml-check » libvirt-fedora-29 #806
by ci@centos.org 04 Nov '19

04 Nov '19
See <https://ci.centos.org/job/libvirt-go-xml-check/systems=libvirt-fedora-29/80…> ------------------------------------------ Started by upstream project "libvirt-go-xml-check" build number 806 originally caused by: Started by upstream project "libvirt-go-xml-build" build number 808 originally caused by: Started by upstream project "libvirt-build" build number 947 originally caused by: Started by an SCM change Running as SYSTEM [EnvInject] - Loading node environment variables. Building remotely on libvirt-fedora-29 (libvirt) in workspace <https://ci.centos.org/job/libvirt-go-xml-check/systems=libvirt-fedora-29/ws/> [libvirt-go-xml] $ /bin/sh -xe /tmp/jenkins6969523622369209127.sh + export 'TEST_ARGS=-tags xmlroundtrip' + TEST_ARGS='-tags xmlroundtrip' + go test -tags xmlroundtrip --- FAIL: TestRoundTrip (28.94s) xml_test.go:413: open testdata/libvirt/tests/domaincapsschemadata: no such file or directory FAIL exit status 1 FAIL _<https://ci.centos.org/job/libvirt-go-xml-check/systems=libvirt-fedora-29/ws/> 29.117s Build step 'Execute shell' marked build as failure
1 3
0 0
[Libvirt-ci] Build failed in Jenkins: libvirt-go-xml-check » libvirt-fedora-30 #806
by ci@centos.org 04 Nov '19

04 Nov '19
See <https://ci.centos.org/job/libvirt-go-xml-check/systems=libvirt-fedora-30/80…> ------------------------------------------ Started by upstream project "libvirt-go-xml-check" build number 806 originally caused by: Started by upstream project "libvirt-go-xml-build" build number 808 originally caused by: Started by upstream project "libvirt-build" build number 947 originally caused by: Started by an SCM change Running as SYSTEM [EnvInject] - Loading node environment variables. Building remotely on libvirt-fedora-30 (libvirt) in workspace <https://ci.centos.org/job/libvirt-go-xml-check/systems=libvirt-fedora-30/ws/> [libvirt-go-xml] $ /bin/sh -xe /tmp/jenkins12331270501050855484.sh + export 'TEST_ARGS=-tags xmlroundtrip' + TEST_ARGS='-tags xmlroundtrip' + go test -tags xmlroundtrip --- FAIL: TestRoundTrip (15.01s) xml_test.go:413: open testdata/libvirt/tests/domaincapsschemadata: no such file or directory FAIL exit status 1 FAIL _<https://ci.centos.org/job/libvirt-go-xml-check/systems=libvirt-fedora-30/ws/> 15.111s Build step 'Execute shell' marked build as failure
1 3
0 0
[Libvirt-ci] Build failed in Jenkins: libvirt-go-xml-check » libvirt-freebsd-11 #806
by ci@centos.org 04 Nov '19

04 Nov '19
See <https://ci.centos.org/job/libvirt-go-xml-check/systems=libvirt-freebsd-11/8…> ------------------------------------------ Started by upstream project "libvirt-go-xml-check" build number 806 originally caused by: Started by upstream project "libvirt-go-xml-build" build number 808 originally caused by: Started by upstream project "libvirt-build" build number 947 originally caused by: Started by an SCM change Running as SYSTEM [EnvInject] - Loading node environment variables. Building remotely on libvirt-freebsd-11 (libvirt) in workspace <https://ci.centos.org/job/libvirt-go-xml-check/systems=libvirt-freebsd-11/w…> [libvirt-go-xml] $ /bin/sh -xe /tmp/jenkins5531366873825360221.sh + export 'TEST_ARGS=-tags xmlroundtrip' + go test -tags xmlroundtrip --- FAIL: TestRoundTrip (7.06s) xml_test.go:413: open testdata/libvirt/tests/domaincapsschemadata: no such file or directory FAIL exit status 1 FAIL _/usr<https://ci.centos.org/job/libvirt-go-xml-check/systems=libvirt-freebsd-11/w…> 7.122s Build step 'Execute shell' marked build as failure
1 3
0 0
[Libvirt-ci] Build failed in Jenkins: libvirt-go-xml-check » libvirt-debian-10 #806
by ci@centos.org 04 Nov '19

04 Nov '19
See <https://ci.centos.org/job/libvirt-go-xml-check/systems=libvirt-debian-10/80…> ------------------------------------------ Started by upstream project "libvirt-go-xml-check" build number 806 originally caused by: Started by upstream project "libvirt-go-xml-build" build number 808 originally caused by: Started by upstream project "libvirt-build" build number 947 originally caused by: Started by an SCM change Running as SYSTEM [EnvInject] - Loading node environment variables. Building remotely on libvirt-debian-10 (libvirt) in workspace <https://ci.centos.org/job/libvirt-go-xml-check/systems=libvirt-debian-10/ws/> [libvirt-go-xml] $ /bin/sh -xe /tmp/jenkins1571449020648801799.sh + export TEST_ARGS=-tags xmlroundtrip + go test -tags xmlroundtrip --- FAIL: TestRoundTrip (9.99s) xml_test.go:413: open testdata/libvirt/tests/domaincapsschemadata: no such file or directory FAIL exit status 1 FAIL _<https://ci.centos.org/job/libvirt-go-xml-check/systems=libvirt-debian-10/ws/> 10.076s Build step 'Execute shell' marked build as failure
1 3
0 0
[Libvirt-ci] Build failed in Jenkins: libvirt-go-xml-check » libvirt-debian-9 #806
by ci@centos.org 04 Nov '19

04 Nov '19
See <https://ci.centos.org/job/libvirt-go-xml-check/systems=libvirt-debian-9/806…> ------------------------------------------ Started by upstream project "libvirt-go-xml-check" build number 806 originally caused by: Started by upstream project "libvirt-go-xml-build" build number 808 originally caused by: Started by upstream project "libvirt-build" build number 947 originally caused by: Started by an SCM change Running as SYSTEM [EnvInject] - Loading node environment variables. Building remotely on libvirt-debian-9 (libvirt) in workspace <https://ci.centos.org/job/libvirt-go-xml-check/systems=libvirt-debian-9/ws/> [libvirt-go-xml] $ /bin/sh -xe /tmp/jenkins1174938345045970339.sh + export TEST_ARGS=-tags xmlroundtrip + go test -tags xmlroundtrip --- FAIL: TestRoundTrip (26.40s) xml_test.go:413: open testdata/libvirt/tests/domaincapsschemadata: no such file or directory FAIL exit status 1 FAIL _<https://ci.centos.org/job/libvirt-go-xml-check/systems=libvirt-debian-9/ws/> 26.575s Build step 'Execute shell' marked build as failure
1 3
0 0
  • ← Newer
  • 1
  • 2
  • 3
  • 4
  • 5
  • 6
  • 7
  • 8
  • Older →

HyperKitty Powered by HyperKitty version 1.3.12.