libvirt List Archives
Sign In Sign Up
Manage this list Sign In Sign Up

Keyboard Shortcuts

Thread View

  • j: Next unread message
  • k: Previous unread message
  • j a: Jump to all threads
  • j l: Jump to MailingList overview

CI

Thread Start a new thread
Download
Threads by month
  • ----- 2025 -----
  • August
  • July
  • June
  • May
  • April
  • March
  • February
  • January
  • ----- 2024 -----
  • December
  • November
  • October
  • September
  • August
  • July
  • June
  • May
  • April
  • March
  • February
  • January
  • ----- 2023 -----
  • December
  • November
  • October
  • September
  • August
  • July
  • June
  • May
  • April
  • March
  • February
  • January
  • ----- 2022 -----
  • December
  • November
  • October
  • September
  • August
  • July
  • June
  • May
  • April
  • March
  • February
  • January
  • ----- 2021 -----
  • December
  • November
  • October
  • September
  • August
  • July
  • June
  • May
  • April
  • March
  • February
  • January
  • ----- 2020 -----
  • December
  • November
  • October
  • September
  • August
  • July
  • June
  • May
  • April
  • March
  • February
  • January
  • ----- 2019 -----
  • December
  • November
  • October
  • September
  • August
  • July
  • June
  • May
  • April
  • March
  • February
  • January
  • ----- 2018 -----
  • December
  • November
  • October
  • September
  • August
  • July
  • June
  • May
  • April
  • March
  • February
  • January
  • ----- 2017 -----
  • December
  • November
  • October
  • September
  • August
  • July
  • June
  • May
  • April
  • March
  • February
  • January
  • ----- 2016 -----
  • December
  • November
  • October
  • September
  • August
  • July
ci@lists.libvirt.org

January 2019

  • 2 participants
  • 93 discussions
[Libvirt-ci] Still Failing: libvirt/libvirt#1899 (master - 4abd8d0)
by Travis CI 08 Jan '19

08 Jan '19
Build Update for libvirt/libvirt ------------------------------------- Build: #1899 Status: Still Failing Duration: 20 mins and 21 secs Commit: 4abd8d0 (master) Author: Andrea Bolognani Message: syntax-check: Simplify and fix unmarked_diagnostics The check was concerning itself with whitespace where it didn't need to, and used some confusing escaping for one of its regular expressions - which GNU sed was fine with, but FreeBSD's sed didn't like one bit. Switch to extended regular expressions (which, incidentally, were already in use in the same rule when calling grep) and remove all whitespace handling. Signed-off-by: Andrea Bolognani <abologna(a)redhat.com> Reviewed-by: Eric Blake <eblake(a)redhat.com> Reviewed-by: Ján Tomko <jtomko(a)redhat.com> View the changeset: https://github.com/libvirt/libvirt/compare/acf522e85a97...4abd8d01cdd8 View the full build log and details: https://travis-ci.org/libvirt/libvirt/builds/476926484?utm_medium=notificat… -- You can unsubscribe from build emails from the libvirt/libvirt repository going to https://travis-ci.org/account/preferences/unsubscribe?repository=4872032&ut…. Or unsubscribe from *all* email updating your settings at https://travis-ci.org/account/preferences/unsubscribe?utm_medium=notificati…. Or configure specific recipients for build notifications in your .travis.yml file. See https://docs.travis-ci.com/user/notifications.
1 0
0 0
[Libvirt-ci] Broken: libvirt/libvirt#1898 (master - acf522e)
by Travis CI 08 Jan '19

08 Jan '19
Build Update for libvirt/libvirt ------------------------------------- Build: #1898 Status: Broken Duration: 23 mins and 3 secs Commit: acf522e (master) Author: Eric Blake Message: examples: Avoid gnulib, have standalone examples Commit 0c6ad476 updated gnulib, which rearranged some of the conditions in gnulib wrapper headers such that compilation started failing on BSD systems when the normal system <unistd.h> tried to include another system header but instead got a gnulib wrapper header in an incomplete state; this is because gnulib headers only work if <config.h> is included first. Commit b6f78259 papered over the symptoms of that by including <config.h> in all the examples. But this logic is backwards - if our examples are truly meant to be stand-alone, they should NOT depend on how libvirt was configured, and should NOT depend on the gnulib fixes for system quirks. In particular, if an example does not need to link against libgnulib.la, then it also does not need to use -Ignulib in its compile flags, and likewise does not need to include <config.h> since none of the gnulib wrapper headers should be interfering. So, revert (most of) b6f78259 (except for the bogus pre-patch use of "config.h" in admin/logging.c: if config.h is included, it should be via <> rather than "", and must be before any system headers); then additionally nuke all mention of <config.h>, -Ignulib, and -llibgnu.la, making all of the examples truly standalone. Signed-off-by: Eric Blake <eblake(a)redhat.com> Acked-by: Michal Privoznik <mprivozn(a)redhat.com> Reviewed-by: Ján Tomko <jtomko(a)redhat.com> View the changeset: https://github.com/libvirt/libvirt/compare/30727583aed2...acf522e85a97 View the full build log and details: https://travis-ci.org/libvirt/libvirt/builds/476898632?utm_medium=notificat… -- You can unsubscribe from build emails from the libvirt/libvirt repository going to https://travis-ci.org/account/preferences/unsubscribe?repository=4872032&ut…. Or unsubscribe from *all* email updating your settings at https://travis-ci.org/account/preferences/unsubscribe?utm_medium=notificati…. Or configure specific recipients for build notifications in your .travis.yml file. See https://docs.travis-ci.com/user/notifications.
1 0
0 0
[Libvirt-ci] Build failed in Jenkins: libvirt-build » libvirt-fedora-rawhide #208
by ci@centos.org 08 Jan '19

08 Jan '19
See <https://ci.centos.org/job/libvirt-build/systems=libvirt-fedora-rawhide/208/…> Changes: [eblake] maint: Drop unused GETTEXT_CPPFLAGS variable [eblake] maint: Prefer AM_CPPFLAGS over INCLUDES ------------------------------------------ [...truncated 118.63 KB...] checking for perl... /usr/bin/perl checking Whether to build test suite by default... yes checking whether GET_VLAN_VID_CMD is declared... yes checking for struct ifreq.ifr_newname... yes checking for struct ifreq.ifr_ifindex... yes checking for struct ifreq.ifr_index... no checking for struct ifreq.ifr_hwaddr... yes checking whether BRDGSFD is declared... no checking whether BRDGADD is declared... no checking whether BRDGDEL is declared... no checking whether cpuset_getaffinity is declared... no checking for struct if_data.ifi_oqdrops... no checking whether clock_serv_t is declared... no checking whether host_get_clock_service is declared... no checking whether clock_get_time is declared... no checking whether this build is done by a static analysis tool... no checking that generated files are newer than configure... done configure: creating ./config.status config.status: creating run config.status: creating Makefile config.status: creating src/Makefile config.status: creating include/libvirt/Makefile config.status: creating docs/Makefile config.status: creating gnulib/lib/Makefile config.status: creating gnulib/tests/Makefile config.status: creating .color_coded config.status: creating .ycm_extra_conf.py config.status: creating libvirt.pc config.status: creating libvirt-qemu.pc config.status: creating libvirt-lxc.pc config.status: creating libvirt-admin.pc config.status: creating src/libvirt.pc config.status: creating src/libvirt-qemu.pc config.status: creating src/libvirt-lxc.pc config.status: creating libvirt.spec config.status: creating mingw-libvirt.spec config.status: creating po/Makefile config.status: creating include/libvirt/libvirt-common.h config.status: creating examples/Makefile config.status: creating tests/Makefile config.status: creating tools/Makefile config.status: creating config.h config.status: linking ../GNUmakefile to GNUmakefile config.status: executing depfiles commands config.status: executing libtool commands configure: configure: Configuration summary configure: ===================== configure: configure: Drivers configure: configure: QEMU: yes configure: OpenVZ: yes configure: VMware: yes configure: VBox: yes configure: XenAPI: no configure: libxl: yes configure: LXC: yes configure: PHYP: yes configure: ESX: yes configure: Hyper-V: yes configure: vz: no configure: Bhyve: no configure: Test: yes configure: Remote: yes configure: Network: yes configure: Libvirtd: yes configure: Interface: yes configure: configure: Storage Drivers configure: configure: Dir: yes configure: FS: yes configure: NetFS: yes configure: LVM: yes configure: iSCSI: yes configure: iscsi-direct: yes configure: SCSI: yes configure: mpath: yes configure: Disk: yes configure: RBD: yes configure: Sheepdog: yes configure: Gluster: yes configure: ZFS: yes configure: Virtuozzo storage: no configure: configure: Security Drivers configure: configure: SELinux: yes configure: AppArmor: no configure: configure: Driver Loadable Modules configure: configure: driver_modules: yes (CFLAGS='' LIBS='-ldl') configure: configure: Libraries configure: configure: acl: yes (CFLAGS='' LIBS='-lacl') configure: apparmor: no configure: attr: yes (CFLAGS='' LIBS='-lattr') configure: audit: yes (CFLAGS='' LIBS='-laudit') configure: avahi: yes (CFLAGS='-D_REENTRANT ' LIBS='-lavahi-common -lavahi-client ') configure: bash_completion: yes (CFLAGS='' LIBS='') configure: blkid: yes (CFLAGS='-I/usr/include/blkid -I/usr/include/uuid ' LIBS='-lblkid ') configure: capng: yes (CFLAGS='' LIBS='-lcap-ng') configure: curl: yes (CFLAGS='-DCURL_DISABLE_TYPECHECK ' LIBS='-lcurl ') configure: dbus: yes (CFLAGS='-I/usr/include/dbus-1.0 -I/usr/lib64/dbus-1.0/include ' LIBS='-ldbus-1 ') configure: dlopen: yes (CFLAGS='' LIBS='-ldl') configure: firewalld: yes (CFLAGS='' LIBS='') configure: fuse: yes (CFLAGS='-I/usr/include/fuse -D_FILE_OFFSET_BITS=64 ' LIBS='-lfuse -pthread ') configure: glusterfs: yes (CFLAGS='-D_FILE_OFFSET_BITS=64 -D__USE_FILE_OFFSET64 -DUSE_POSIX_ACLS=1 -I/usr/include/uuid ' LIBS='-lacl -lgfapi -lglusterfs -lgfrpc -lgfxdr -luuid ') configure: gnutls: yes (CFLAGS='-I/usr/include/p11-kit-1 ' LIBS='-lgnutls ') configure: hal: no configure: libiscsi: yes (CFLAGS='' LIBS='-L/usr/lib64/iscsi -liscsi ') configure: libnl: yes (CFLAGS='-I/usr/include/libnl3 -I/usr/include/libnl3 ' LIBS='-lnl-3 -lnl-route-3 -lnl-3 ') configure: libpcap: yes (CFLAGS='' LIBS='-lpcap') configure: libssh: yes (CFLAGS='' LIBS='-lssh ') configure: libxl: yes (CFLAGS=' -DLIBXL_API_VERSION=0x040500' LIBS='-lxenlight -lxlutil -lxenstore -lxentoollog') configure: libxml: yes (CFLAGS='-I/usr/include/libxml2 ' LIBS='-lxml2 ') configure: macvtap: yes (CFLAGS='' LIBS='') configure: netcf: yes (CFLAGS='' LIBS='-lnetcf ') configure: NLS: yes configure: nss: yes configure: numactl: yes (CFLAGS='' LIBS='-lnuma') configure: openwsman: yes (CFLAGS='-I/usr/include/openwsman ' LIBS='-lwsman -lwsman_client -lwsman_curl_client_transport ') configure: pciaccess: yes (CFLAGS='' LIBS='-lpciaccess ') configure: pm_utils: no configure: polkit: yes configure: rbd: yes (CFLAGS='' LIBS='-lrbd -lrados') configure: readline: yes (CFLAGS='-D_FUNCTION_DEF ' LIBS='-lreadline') configure: sanlock: yes (CFLAGS='' LIBS='-lsanlock_client') configure: sasl: yes (CFLAGS='' LIBS='-lsasl2') configure: selinux: yes (CFLAGS='' LIBS='-lselinux') configure: ssh2: yes (CFLAGS='' LIBS='-lssh2 ') configure: udev: yes (CFLAGS='' LIBS='-ludev ') configure: virtualport: yes (CFLAGS='' LIBS='') configure: xdr: yes (CFLAGS='-I/usr/include/tirpc' LIBS='') configure: xenapi: no configure: yajl: yes (CFLAGS='' LIBS='-lyajl') configure: configure: Windows configure: configure: Cygwin: no configure: MinGW: no configure: MSVC: no configure: windres: no configure: configure: Test suite configure: configure: Coverage: no configure: Alloc OOM: no configure: configure: Miscellaneous configure: configure: Debug: yes configure: Use -Werror: yes configure: Warning Flags: -fno-common -W -Waddress -Waggressive-loop-optimizations -Wall -Wattribute-alias -Wattributes -Wbad-function-cast -Wbool-compare -Wbool-operation -Wbuiltin-declaration-mismatch -Wbuiltin-macro-redefined -Wcast-align -Wcast-align=strict -Wcast-function-type -Wchar-subscripts -Wclobbered -Wcomment -Wcomments -Wcoverage-mismatch -Wcpp -Wdangling-else -Wdate-time -Wdeprecated-declarations -Wdesignated-init -Wdiscarded-array-qualifiers -Wdiscarded-qualifiers -Wdiv-by-zero -Wdouble-promotion -Wduplicated-cond -Wduplicate-decl-specifier -Wempty-body -Wendif-labels -Wexpansion-to-defined -Wextra -Wformat-contains-nul -Wformat-extra-args -Wformat-security -Wformat-y2k -Wformat-zero-length -Wframe-address -Wfree-nonheap-object -Whsa -Wif-not-aligned -Wignored-attributes -Wignored-qualifiers -Wimplicit -Wimplicit-function-declaration -Wimplicit-int -Wincompatible-pointer-types -Winit-self -Winline -Wint-conversion -Wint-in-bool-context -Wint-to-pointer-cast -Winvalid-memory-model -Winvalid-pch -Wlogical-not-parentheses -Wlogical-op -Wmain -Wmaybe-uninitialized -Wmemset-elt-size -Wmemset-transposed-args -Wmisleading-indentation -Wmissing-attributes -Wmissing-braces -Wmissing-declarations -Wmissing-field-initializers -Wmissing-include-dirs -Wmissing-parameter-type -Wmissing-prototypes -Wmultichar -Wmultistatement-macros -Wnarrowing -Wnested-externs -Wnonnull -Wnonnull-compare -Wnull-dereference -Wodr -Wold-style-declaration -Wold-style-definition -Wopenmp-simd -Woverflow -Woverride-init -Wpacked-bitfield-compat -Wpacked-not-aligned -Wparentheses -Wpointer-arith -Wpointer-compare -Wpointer-sign -Wpointer-to-int-cast -Wpragmas -Wpsabi -Wrestrict -Wreturn-local-addr -Wreturn-type -Wscalar-storage-order -Wsequence-point -Wshadow -Wshift-count-negative -Wshift-count-overflow -Wshift-negative-value -Wsizeof-array-argument -Wsizeof-pointer-div -Wsizeof-pointer-memaccess -Wstrict-aliasing -Wstrict-prototypes -Wstringop-truncation -Wsuggest-attribute=cold -Wsuggest-attribute=const -Wsuggest-attribute=format -Wsuggest-attribute=malloc -Wsuggest-attribute=noreturn -Wsuggest-attribute=pure -Wsuggest-final-methods -Wsuggest-final-types -Wswitch -Wswitch-bool -Wswitch-unreachable -Wsync-nand -Wtautological-compare -Wtrampolines -Wtrigraphs -Wtype-limits -Wuninitialized -Wunknown-pragmas -Wunused -Wunused-but-set-parameter -Wunused-but-set-variable -Wunused-function -Wunused-label -Wunused-local-typedefs -Wunused-parameter -Wunused-result -Wunused-value -Wunused-variable -Wvarargs -Wvariadic-macros -Wvector-operation-performance -Wvolatile-register-var -Wwrite-strings -Walloc-size-larger-than=9223372036854775807 -Warray-bounds=2 -Wformat-overflow=2 -Wformat-truncation=2 -Wimplicit-fallthrough=5 -Wnormalized=nfc -Wshift-overflow=2 -Wstringop-overflow=2 -Wunused-const-variable=2 -Wvla-larger-than=4031 -Wno-sign-compare -Wno-cast-function-type -Wjump-misses-init -Wswitch-enum -Wno-format-nonliteral -Wno-format-truncation -fstack-protector-strong -fexceptions -fasynchronous-unwind-tables -fipa-pure-const -Wno-suggest-attribute=pure -Wno-suggest-attribute=const -Werror configure: DTrace: yes configure: numad: yes configure: Init script: systemd configure: Char device locks: /var/lock configure: Default Editor: vi configure: Loader/NVRAM: configure: virt-login-shell: yes configure: virt-host-validate: yes configure: TLS priority: NORMAL configure: configure: Developer Tools configure: configure: wireshark_dissector: yes (CFLAGS='-I/usr/include/wireshark -I/usr/include/glib-2.0 -I/usr/lib64/glib-2.0/include -pthread ' LIBS='-lwireshark -Wl,--export-dynamic -lgmodule-2.0 -lglib-2.0 -lgthread-2.0 -pthread -lglib-2.0 ') configure: configure: Privileges configure: configure: QEMU: root:root configure: Now type 'make' to compile libvirt. + /usr/bin/gmake /usr/bin/gmake all-recursive gmake[1]: Entering directory '<https://ci.centos.org/job/libvirt-build/systems=libvirt-fedora-rawhide/ws/b…'> Making all in . gmake[2]: Entering directory '<https://ci.centos.org/job/libvirt-build/systems=libvirt-fedora-rawhide/ws/b…'> gmake[2]: Leaving directory '<https://ci.centos.org/job/libvirt-build/systems=libvirt-fedora-rawhide/ws/b…'> Making all in gnulib/lib gmake[2]: Entering directory '<https://ci.centos.org/job/libvirt-build/systems=libvirt-fedora-rawhide/ws/b…'> GEN alloca.h GEN configmake.h GEN arpa/inet.h GEN fcntl.h GEN getopt.h GEN getopt-cdefs.h GEN langinfo.h GEN limits.h GEN locale.h GEN netdb.h GEN poll.h GEN signal.h GEN pty.h GEN stdio.h GEN stdlib.h GEN string.h GEN strings.h GEN sys/ioctl.h GEN sys/select.h GEN sys/socket.h GEN sys/stat.h GEN sys/time.h GEN sys/uio.h GEN sys/types.h GEN sys/utsname.h GEN termios.h GEN sys/wait.h GEN time.h GEN unistd.h GEN unitypes.h GEN uniwidth.h GEN wchar.h GEN wctype.h /usr/bin/gmake all-am gmake[3]: Entering directory '<https://ci.centos.org/job/libvirt-build/systems=libvirt-fedora-rawhide/ws/b…'> CC allocator.lo CC areadlink.lo CC base64.lo In file included from ../../../gnulib/lib/allocator.c:2: ../../config.h:3244:10: fatal error: config-post.h: No such file or directory #include <config-post.h> ^~~~~~~~~~~~~~~ compilation terminated. gmake[3]: *** [Makefile:2633: allocator.lo] Error 1 gmake[3]: *** Waiting for unfinished jobs.... In file included from ../../../gnulib/lib/areadlink.c:22: ../../config.h:3244:10: fatal error: config-post.h: No such file or directory #include <config-post.h> ^~~~~~~~~~~~~~~ compilation terminated. In file included from ../../../gnulib/lib/base64.c:42: ../../config.h:3244:10: fatal error: config-post.h: No such file or directory #include <config-post.h> ^~~~~~~~~~~~~~~ compilation terminated. gmake[3]: *** [Makefile:2633: areadlink.lo] Error 1 gmake[3]: *** [Makefile:2633: base64.lo] Error 1 gmake[3]: Leaving directory '<https://ci.centos.org/job/libvirt-build/systems=libvirt-fedora-rawhide/ws/b…'> gmake[2]: *** [Makefile:2366: all] Error 2 gmake[2]: Leaving directory '<https://ci.centos.org/job/libvirt-build/systems=libvirt-fedora-rawhide/ws/b…'> gmake[1]: *** [Makefile:2130: all-recursive] Error 1 gmake[1]: Leaving directory '<https://ci.centos.org/job/libvirt-build/systems=libvirt-fedora-rawhide/ws/b…'> gmake: *** [Makefile:2023: all] Error 2 Build step 'Execute shell' marked build as failure
1 1
0 0
[Libvirt-ci] Build failed in Jenkins: libvirt+mingw64-build » libvirt-fedora-rawhide #222
by ci@centos.org 08 Jan '19

08 Jan '19
See <https://ci.centos.org/job/libvirt+mingw64-build/systems=libvirt-fedora-rawh…> Changes: [eblake] maint: Drop unused GETTEXT_CPPFLAGS variable [eblake] maint: Prefer AM_CPPFLAGS over INCLUDES ------------------------------------------ [...truncated 115.51 KB...] checking whether BRDGSFD is declared... no checking whether BRDGADD is declared... no checking whether BRDGDEL is declared... no checking whether cpuset_getaffinity is declared... no checking for struct if_data.ifi_oqdrops... no checking whether clock_serv_t is declared... no checking whether host_get_clock_service is declared... no checking whether clock_get_time is declared... no checking whether this build is done by a static analysis tool... no checking that generated files are newer than configure... done configure: creating ./config.status config.status: creating run config.status: creating Makefile config.status: creating src/Makefile config.status: creating include/libvirt/Makefile config.status: creating docs/Makefile config.status: creating gnulib/lib/Makefile config.status: creating gnulib/tests/Makefile config.status: creating .color_coded config.status: creating .ycm_extra_conf.py config.status: creating libvirt.pc config.status: creating libvirt-qemu.pc config.status: creating libvirt-lxc.pc config.status: creating libvirt-admin.pc config.status: creating src/libvirt.pc config.status: creating src/libvirt-qemu.pc config.status: creating src/libvirt-lxc.pc config.status: creating libvirt.spec config.status: creating mingw-libvirt.spec config.status: creating po/Makefile config.status: creating include/libvirt/libvirt-common.h config.status: creating examples/Makefile config.status: creating tests/Makefile config.status: creating tools/Makefile config.status: creating config.h config.status: linking ../GNUmakefile to GNUmakefile config.status: executing depfiles commands config.status: executing libtool commands configure: configure: Configuration summary configure: ===================== configure: configure: Drivers configure: configure: QEMU: no configure: OpenVZ: no configure: VMware: yes configure: VBox: no configure: XenAPI: no configure: libxl: no configure: LXC: no configure: PHYP: yes configure: ESX: yes configure: Hyper-V: no configure: vz: no configure: Bhyve: no configure: Test: yes configure: Remote: yes configure: Network: no configure: Libvirtd: no configure: Interface: no configure: configure: Storage Drivers configure: configure: Dir: no configure: FS: no configure: NetFS: no configure: LVM: no configure: iSCSI: no configure: iscsi-direct: no configure: SCSI: no configure: mpath: no configure: Disk: no configure: RBD: no configure: Sheepdog: no configure: Gluster: no configure: ZFS: no configure: Virtuozzo storage: no configure: configure: Security Drivers configure: configure: SELinux: no configure: AppArmor: no configure: configure: Driver Loadable Modules configure: configure: driver_modules: no configure: configure: Libraries configure: configure: acl: no configure: apparmor: no configure: attr: no configure: audit: no configure: avahi: no configure: bash_completion: no configure: blkid: no configure: capng: no configure: curl: yes (CFLAGS='-DCURL_DISABLE_TYPECHECK -I/usr/x86_64-w64-mingw32/sys-root/mingw/include ' LIBS='-L/usr/x86_64-w64-mingw32/sys-root/mingw/lib -lcurl ') configure: dbus: yes (CFLAGS='-I/usr/x86_64-w64-mingw32/sys-root/mingw/include/dbus-1.0 -I/usr/x86_64-w64-mingw32/sys-root/mingw/lib/dbus-1.0/include ' LIBS='-L/usr/x86_64-w64-mingw32/sys-root/mingw/lib -ldbus-1 ') configure: dlopen: yes (CFLAGS='' LIBS='') configure: firewalld: yes (CFLAGS='' LIBS='') configure: fuse: no configure: glusterfs: no configure: gnutls: yes (CFLAGS='-I/usr/x86_64-w64-mingw32/sys-root/mingw/include -I/usr/x86_64-w64-mingw32/sys-root/mingw/include/p11-kit-1 ' LIBS='-L/usr/x86_64-w64-mingw32/sys-root/mingw/lib -lgnutls ') configure: hal: no configure: libiscsi: no configure: libnl: no configure: libpcap: yes (CFLAGS='' LIBS='-lpcap') configure: libssh: no configure: libxl: no configure: libxml: yes (CFLAGS='-I/usr/x86_64-w64-mingw32/sys-root/mingw/include/libxml2 ' LIBS='-L/usr/x86_64-w64-mingw32/sys-root/mingw/lib -lxml2 ') configure: macvtap: no configure: netcf: no configure: NLS: yes configure: nss: no configure: numactl: no configure: openwsman: no configure: pciaccess: no configure: pm_utils: yes (CFLAGS='' LIBS='') configure: polkit: yes configure: rbd: no configure: readline: yes (CFLAGS='-D_FUNCTION_DEF ' LIBS='-lreadline') configure: sanlock: no configure: sasl: no configure: selinux: no configure: ssh2: yes (CFLAGS='-I/usr/x86_64-w64-mingw32/sys-root/mingw/include ' LIBS='-L/usr/x86_64-w64-mingw32/sys-root/mingw/lib -lssh2 -lws2_32 ') configure: udev: no configure: virtualport: no configure: xdr: yes (CFLAGS='' LIBS='') configure: xenapi: no configure: yajl: no configure: configure: Windows configure: configure: Cygwin: no configure: MinGW: no configure: MSVC: no configure: windres: yes (x86_64-w64-mingw32-windres) configure: configure: Test suite configure: configure: Coverage: no configure: Alloc OOM: no configure: configure: Miscellaneous configure: configure: Debug: yes configure: Use -Werror: yes configure: Warning Flags: -fno-common -W -Waddress -Waggressive-loop-optimizations -Wall -Wattribute-alias -Wattributes -Wbad-function-cast -Wbool-compare -Wbool-operation -Wbuiltin-declaration-mismatch -Wbuiltin-macro-redefined -Wcast-align -Wcast-align=strict -Wcast-function-type -Wchar-subscripts -Wclobbered -Wcomment -Wcomments -Wcoverage-mismatch -Wcpp -Wdangling-else -Wdate-time -Wdeprecated-declarations -Wdesignated-init -Wdiscarded-array-qualifiers -Wdiscarded-qualifiers -Wdiv-by-zero -Wdouble-promotion -Wduplicated-cond -Wduplicate-decl-specifier -Wempty-body -Wendif-labels -Wexpansion-to-defined -Wextra -Wformat-contains-nul -Wformat-extra-args -Wformat-security -Wformat-y2k -Wformat-zero-length -Wframe-address -Wfree-nonheap-object -Whsa -Wif-not-aligned -Wignored-attributes -Wignored-qualifiers -Wimplicit -Wimplicit-function-declaration -Wimplicit-int -Wincompatible-pointer-types -Winit-self -Winline -Wint-conversion -Wint-in-bool-context -Wint-to-pointer-cast -Winvalid-memory-model -Winvalid-pch -Wlogical-not-parentheses -Wlogical-op -Wmain -Wmaybe-uninitialized -Wmemset-elt-size -Wmemset-transposed-args -Wmisleading-indentation -Wmissing-attributes -Wmissing-braces -Wmissing-declarations -Wmissing-field-initializers -Wmissing-include-dirs -Wmissing-parameter-type -Wmissing-prototypes -Wmultichar -Wmultistatement-macros -Wnarrowing -Wnested-externs -Wnonnull -Wnonnull-compare -Wnull-dereference -Wodr -Wold-style-declaration -Wold-style-definition -Wopenmp-simd -Woverflow -Woverride-init -Wpacked-bitfield-compat -Wpacked-not-aligned -Wparentheses -Wpointer-arith -Wpointer-compare -Wpointer-sign -Wpointer-to-int-cast -Wpragmas -Wpsabi -Wrestrict -Wreturn-local-addr -Wreturn-type -Wscalar-storage-order -Wsequence-point -Wshadow -Wshift-count-negative -Wshift-count-overflow -Wshift-negative-value -Wsizeof-array-argument -Wsizeof-pointer-div -Wsizeof-pointer-memaccess -Wstrict-aliasing -Wstrict-prototypes -Wstringop-truncation -Wsuggest-attribute=cold -Wsuggest-attribute=const -Wsuggest-attribute=format -Wsuggest-attribute=malloc -Wsuggest-attribute=noreturn -Wsuggest-attribute=pure -Wsuggest-final-methods -Wsuggest-final-types -Wswitch -Wswitch-bool -Wswitch-unreachable -Wsync-nand -Wtautological-compare -Wtrampolines -Wtrigraphs -Wtype-limits -Wuninitialized -Wunknown-pragmas -Wunused -Wunused-but-set-parameter -Wunused-but-set-variable -Wunused-function -Wunused-label -Wunused-local-typedefs -Wunused-parameter -Wunused-result -Wunused-value -Wunused-variable -Wvarargs -Wvariadic-macros -Wvector-operation-performance -Wvolatile-register-var -Wwrite-strings -Walloc-size-larger-than=9223372036854775807 -Warray-bounds=2 -Wformat-overflow=2 -Wformat-truncation=2 -Wimplicit-fallthrough=5 -Wnormalized=nfc -Wshift-overflow=2 -Wstringop-overflow=2 -Wunused-const-variable=2 -Wvla-larger-than=4031 -Wno-sign-compare -Wno-cast-function-type -Wjump-misses-init -Wswitch-enum -Wno-format-nonliteral -Wno-format-truncation -fexceptions -fasynchronous-unwind-tables -fipa-pure-const -Wno-suggest-attribute=pure -Wno-suggest-attribute=const -Werror configure: DTrace: no configure: numad: no configure: Init script: none configure: Char device locks: no configure: Default Editor: vi configure: Loader/NVRAM: configure: virt-login-shell: no configure: virt-host-validate: no configure: TLS priority: NORMAL configure: configure: Developer Tools configure: configure: wireshark_dissector: no configure: configure: Privileges configure: configure: QEMU: root:root configure: Now type 'make' to compile libvirt. + /usr/bin/gmake /usr/bin/gmake all-recursive gmake[1]: Entering directory '<https://ci.centos.org/job/libvirt+mingw64-build/systems=libvirt-fedora-rawh…'> Making all in . gmake[2]: Entering directory '<https://ci.centos.org/job/libvirt+mingw64-build/systems=libvirt-fedora-rawh…'> gmake[2]: Leaving directory '<https://ci.centos.org/job/libvirt+mingw64-build/systems=libvirt-fedora-rawh…'> Making all in gnulib/lib gmake[2]: Entering directory '<https://ci.centos.org/job/libvirt+mingw64-build/systems=libvirt-fedora-rawh…'> GEN alloca.h GEN byteswap.h GEN arpa/inet.h GEN configmake.h GEN errno.h GEN execinfo.h GEN fcntl.h GEN fnmatch.h GEN getopt.h GEN getopt-cdefs.h GEN limits.h GEN langinfo.h GEN locale.h GEN netdb.h GEN net/if.h GEN poll.h GEN netinet/in.h GEN pty.h GEN signal.h GEN stdint.h GEN stdio.h GEN stdlib.h GEN string.h GEN strings.h GEN sys/ioctl.h GEN sys/select.h GEN sys/socket.h GEN sys/stat.h GEN sys/time.h GEN sys/types.h GEN sys/uio.h GEN sys/utsname.h GEN termios.h GEN sys/wait.h GEN time.h GEN unistd.h GEN unitypes.h GEN uniwidth.h GEN wchar.h GEN wctype.h /usr/bin/gmake all-am gmake[3]: Entering directory '<https://ci.centos.org/job/libvirt+mingw64-build/systems=libvirt-fedora-rawh…'> CC allocator.lo CC areadlink.lo CC base64.lo In file included from ../../../gnulib/lib/areadlink.c:22: ../../config.h:3244:10: fatal error: config-post.h: No such file or directory #include <config-post.h> ^~~~~~~~~~~~~~~ In file included from ../../../gnulib/lib/base64.c:42: ../../config.h:3244:10: fatal error: config-post.h: No such file or directory #include <config-post.h> ^~~~~~~~~~~~~~~ compilation terminated. compilation terminated. gmake[3]: *** [Makefile:2633: base64.lo] Error 1 gmake[3]: *** Waiting for unfinished jobs.... In file included from ../../../gnulib/lib/allocator.c:2: ../../config.h:3244:10: fatal error: config-post.h: No such file or directory #include <config-post.h> ^~~~~~~~~~~~~~~ compilation terminated. gmake[3]: *** [Makefile:2633: areadlink.lo] Error 1 gmake[3]: *** [Makefile:2633: allocator.lo] Error 1 gmake[3]: Leaving directory '<https://ci.centos.org/job/libvirt+mingw64-build/systems=libvirt-fedora-rawh…'> gmake[2]: *** [Makefile:2366: all] Error 2 gmake[2]: Leaving directory '<https://ci.centos.org/job/libvirt+mingw64-build/systems=libvirt-fedora-rawh…'> gmake[1]: *** [Makefile:2130: all-recursive] Error 1 gmake[1]: Leaving directory '<https://ci.centos.org/job/libvirt+mingw64-build/systems=libvirt-fedora-rawh…'> gmake: *** [Makefile:2023: all] Error 2 Build step 'Execute shell' marked build as failure
1 1
0 0
[Libvirt-ci] Build failed in Jenkins: libvirt+mingw32-build » libvirt-fedora-rawhide #222
by ci@centos.org 08 Jan '19

08 Jan '19
See <https://ci.centos.org/job/libvirt+mingw32-build/systems=libvirt-fedora-rawh…> Changes: [eblake] maint: Drop unused GETTEXT_CPPFLAGS variable [eblake] maint: Prefer AM_CPPFLAGS over INCLUDES ------------------------------------------ [...truncated 115.35 KB...] checking whether BRDGSFD is declared... no checking whether BRDGADD is declared... no checking whether BRDGDEL is declared... no checking whether cpuset_getaffinity is declared... no checking for struct if_data.ifi_oqdrops... no checking whether clock_serv_t is declared... no checking whether host_get_clock_service is declared... no checking whether clock_get_time is declared... no checking whether this build is done by a static analysis tool... no checking that generated files are newer than configure... done configure: creating ./config.status config.status: creating run config.status: creating Makefile config.status: creating src/Makefile config.status: creating include/libvirt/Makefile config.status: creating docs/Makefile config.status: creating gnulib/lib/Makefile config.status: creating gnulib/tests/Makefile config.status: creating .color_coded config.status: creating .ycm_extra_conf.py config.status: creating libvirt.pc config.status: creating libvirt-qemu.pc config.status: creating libvirt-lxc.pc config.status: creating libvirt-admin.pc config.status: creating src/libvirt.pc config.status: creating src/libvirt-qemu.pc config.status: creating src/libvirt-lxc.pc config.status: creating libvirt.spec config.status: creating mingw-libvirt.spec config.status: creating po/Makefile config.status: creating include/libvirt/libvirt-common.h config.status: creating examples/Makefile config.status: creating tests/Makefile config.status: creating tools/Makefile config.status: creating config.h config.status: linking ../GNUmakefile to GNUmakefile config.status: executing depfiles commands config.status: executing libtool commands configure: configure: Configuration summary configure: ===================== configure: configure: Drivers configure: configure: QEMU: no configure: OpenVZ: no configure: VMware: yes configure: VBox: no configure: XenAPI: no configure: libxl: no configure: LXC: no configure: PHYP: yes configure: ESX: yes configure: Hyper-V: no configure: vz: no configure: Bhyve: no configure: Test: yes configure: Remote: yes configure: Network: no configure: Libvirtd: no configure: Interface: no configure: configure: Storage Drivers configure: configure: Dir: no configure: FS: no configure: NetFS: no configure: LVM: no configure: iSCSI: no configure: iscsi-direct: no configure: SCSI: no configure: mpath: no configure: Disk: no configure: RBD: no configure: Sheepdog: no configure: Gluster: no configure: ZFS: no configure: Virtuozzo storage: no configure: configure: Security Drivers configure: configure: SELinux: no configure: AppArmor: no configure: configure: Driver Loadable Modules configure: configure: driver_modules: no configure: configure: Libraries configure: configure: acl: no configure: apparmor: no configure: attr: no configure: audit: no configure: avahi: no configure: bash_completion: no configure: blkid: no configure: capng: no configure: curl: yes (CFLAGS='-DCURL_DISABLE_TYPECHECK -I/usr/i686-w64-mingw32/sys-root/mingw/include ' LIBS='-L/usr/i686-w64-mingw32/sys-root/mingw/lib -lcurl ') configure: dbus: yes (CFLAGS='-I/usr/i686-w64-mingw32/sys-root/mingw/include/dbus-1.0 -I/usr/i686-w64-mingw32/sys-root/mingw/lib/dbus-1.0/include ' LIBS='-L/usr/i686-w64-mingw32/sys-root/mingw/lib -ldbus-1 ') configure: dlopen: yes (CFLAGS='' LIBS='') configure: firewalld: yes (CFLAGS='' LIBS='') configure: fuse: no configure: glusterfs: no configure: gnutls: yes (CFLAGS='-I/usr/i686-w64-mingw32/sys-root/mingw/include -I/usr/i686-w64-mingw32/sys-root/mingw/include/p11-kit-1 ' LIBS='-L/usr/i686-w64-mingw32/sys-root/mingw/lib -lgnutls ') configure: hal: no configure: libiscsi: no configure: libnl: no configure: libpcap: yes (CFLAGS='' LIBS='-lpcap') configure: libssh: no configure: libxl: no configure: libxml: yes (CFLAGS='-I/usr/i686-w64-mingw32/sys-root/mingw/include/libxml2 ' LIBS='-L/usr/i686-w64-mingw32/sys-root/mingw/lib -lxml2 ') configure: macvtap: no configure: netcf: no configure: NLS: yes configure: nss: no configure: numactl: no configure: openwsman: no configure: pciaccess: no configure: pm_utils: yes (CFLAGS='' LIBS='') configure: polkit: yes configure: rbd: no configure: readline: yes (CFLAGS='-D_FUNCTION_DEF ' LIBS='-lreadline') configure: sanlock: no configure: sasl: no configure: selinux: no configure: ssh2: yes (CFLAGS='-I/usr/i686-w64-mingw32/sys-root/mingw/include ' LIBS='-L/usr/i686-w64-mingw32/sys-root/mingw/lib -lssh2 -lws2_32 ') configure: udev: no configure: virtualport: no configure: xdr: yes (CFLAGS='' LIBS='') configure: xenapi: no configure: yajl: no configure: configure: Windows configure: configure: Cygwin: no configure: MinGW: no configure: MSVC: no configure: windres: yes (i686-w64-mingw32-windres) configure: configure: Test suite configure: configure: Coverage: no configure: Alloc OOM: no configure: configure: Miscellaneous configure: configure: Debug: yes configure: Use -Werror: yes configure: Warning Flags: -fno-common -W -Waddress -Waggressive-loop-optimizations -Wall -Wattribute-alias -Wattributes -Wbad-function-cast -Wbool-compare -Wbool-operation -Wbuiltin-declaration-mismatch -Wbuiltin-macro-redefined -Wcast-align -Wcast-align=strict -Wcast-function-type -Wchar-subscripts -Wclobbered -Wcomment -Wcomments -Wcoverage-mismatch -Wcpp -Wdangling-else -Wdate-time -Wdeprecated-declarations -Wdesignated-init -Wdiscarded-array-qualifiers -Wdiscarded-qualifiers -Wdiv-by-zero -Wdouble-promotion -Wduplicated-cond -Wduplicate-decl-specifier -Wempty-body -Wendif-labels -Wexpansion-to-defined -Wextra -Wformat-contains-nul -Wformat-extra-args -Wformat-security -Wformat-y2k -Wformat-zero-length -Wframe-address -Wfree-nonheap-object -Whsa -Wif-not-aligned -Wignored-attributes -Wignored-qualifiers -Wimplicit -Wimplicit-function-declaration -Wimplicit-int -Wincompatible-pointer-types -Winit-self -Winline -Wint-conversion -Wint-in-bool-context -Wint-to-pointer-cast -Winvalid-memory-model -Winvalid-pch -Wlogical-not-parentheses -Wlogical-op -Wmain -Wmaybe-uninitialized -Wmemset-elt-size -Wmemset-transposed-args -Wmisleading-indentation -Wmissing-attributes -Wmissing-braces -Wmissing-declarations -Wmissing-field-initializers -Wmissing-include-dirs -Wmissing-parameter-type -Wmissing-prototypes -Wmultichar -Wmultistatement-macros -Wnarrowing -Wnested-externs -Wnonnull -Wnonnull-compare -Wnull-dereference -Wodr -Wold-style-declaration -Wold-style-definition -Wopenmp-simd -Woverflow -Woverride-init -Wpacked-bitfield-compat -Wpacked-not-aligned -Wparentheses -Wpointer-arith -Wpointer-compare -Wpointer-sign -Wpointer-to-int-cast -Wpragmas -Wpsabi -Wrestrict -Wreturn-local-addr -Wreturn-type -Wscalar-storage-order -Wsequence-point -Wshadow -Wshift-count-negative -Wshift-count-overflow -Wshift-negative-value -Wsizeof-array-argument -Wsizeof-pointer-div -Wsizeof-pointer-memaccess -Wstrict-aliasing -Wstrict-prototypes -Wstringop-truncation -Wsuggest-attribute=cold -Wsuggest-attribute=const -Wsuggest-attribute=format -Wsuggest-attribute=malloc -Wsuggest-attribute=noreturn -Wsuggest-attribute=pure -Wsuggest-final-methods -Wsuggest-final-types -Wswitch -Wswitch-bool -Wswitch-unreachable -Wsync-nand -Wtautological-compare -Wtrampolines -Wtrigraphs -Wtype-limits -Wuninitialized -Wunknown-pragmas -Wunused -Wunused-but-set-parameter -Wunused-but-set-variable -Wunused-function -Wunused-label -Wunused-local-typedefs -Wunused-parameter -Wunused-result -Wunused-value -Wunused-variable -Wvarargs -Wvariadic-macros -Wvector-operation-performance -Wvolatile-register-var -Wwrite-strings -Walloc-size-larger-than=2147483647 -Warray-bounds=2 -Wformat-overflow=2 -Wformat-truncation=2 -Wimplicit-fallthrough=5 -Wnormalized=nfc -Wshift-overflow=2 -Wstringop-overflow=2 -Wunused-const-variable=2 -Wvla-larger-than=4031 -Wno-sign-compare -Wno-cast-function-type -Wjump-misses-init -Wswitch-enum -Wno-format-nonliteral -Wno-format-truncation -fexceptions -fasynchronous-unwind-tables -fipa-pure-const -Wno-suggest-attribute=pure -Wno-suggest-attribute=const -Werror configure: DTrace: no configure: numad: no configure: Init script: none configure: Char device locks: no configure: Default Editor: vi configure: Loader/NVRAM: configure: virt-login-shell: no configure: virt-host-validate: no configure: TLS priority: NORMAL configure: configure: Developer Tools configure: configure: wireshark_dissector: no configure: configure: Privileges configure: configure: QEMU: root:root configure: Now type 'make' to compile libvirt. + /usr/bin/gmake /usr/bin/gmake all-recursive gmake[1]: Entering directory '<https://ci.centos.org/job/libvirt+mingw32-build/systems=libvirt-fedora-rawh…'> Making all in . gmake[2]: Entering directory '<https://ci.centos.org/job/libvirt+mingw32-build/systems=libvirt-fedora-rawh…'> gmake[2]: Leaving directory '<https://ci.centos.org/job/libvirt+mingw32-build/systems=libvirt-fedora-rawh…'> Making all in gnulib/lib gmake[2]: Entering directory '<https://ci.centos.org/job/libvirt+mingw32-build/systems=libvirt-fedora-rawh…'> GEN alloca.h GEN byteswap.h GEN arpa/inet.h GEN configmake.h GEN errno.h GEN execinfo.h GEN fcntl.h GEN fnmatch.h GEN getopt.h GEN getopt-cdefs.h GEN langinfo.h GEN limits.h GEN locale.h GEN net/if.h GEN netdb.h GEN netinet/in.h GEN poll.h GEN pty.h GEN signal.h GEN stdint.h GEN stdio.h GEN stdlib.h GEN string.h GEN strings.h GEN sys/ioctl.h GEN sys/select.h GEN sys/socket.h GEN sys/stat.h GEN sys/time.h GEN sys/types.h GEN sys/uio.h GEN sys/utsname.h GEN sys/wait.h GEN termios.h GEN time.h GEN unistd.h GEN unitypes.h GEN uniwidth.h GEN wchar.h GEN wctype.h /usr/bin/gmake all-am gmake[3]: Entering directory '<https://ci.centos.org/job/libvirt+mingw32-build/systems=libvirt-fedora-rawh…'> CC allocator.lo CC areadlink.lo CC base64.lo In file included from ../../../gnulib/lib/allocator.c:2: ../../config.h:3244:10: fatal error: config-post.h: No such file or directory #include <config-post.h> ^~~~~~~~~~~~~~~ compilation terminated. gmake[3]: *** [Makefile:2633: allocator.lo] Error 1 gmake[3]: *** Waiting for unfinished jobs.... In file included from ../../../gnulib/lib/areadlink.c:22: ../../config.h:3244:10: fatal error: config-post.h: No such file or directory #include <config-post.h> ^~~~~~~~~~~~~~~ compilation terminated. gmake[3]: *** [Makefile:2633: areadlink.lo] Error 1 In file included from ../../../gnulib/lib/base64.c:42: ../../config.h:3244:10: fatal error: config-post.h: No such file or directory #include <config-post.h> ^~~~~~~~~~~~~~~ compilation terminated. gmake[3]: *** [Makefile:2633: base64.lo] Error 1 gmake[3]: Leaving directory '<https://ci.centos.org/job/libvirt+mingw32-build/systems=libvirt-fedora-rawh…'> gmake[2]: *** [Makefile:2366: all] Error 2 gmake[2]: Leaving directory '<https://ci.centos.org/job/libvirt+mingw32-build/systems=libvirt-fedora-rawh…'> gmake[1]: *** [Makefile:2130: all-recursive] Error 1 gmake[1]: Leaving directory '<https://ci.centos.org/job/libvirt+mingw32-build/systems=libvirt-fedora-rawh…'> gmake: *** [Makefile:2023: all] Error 2 Build step 'Execute shell' marked build as failure
1 1
0 0
[Libvirt-ci] Build failed in Jenkins: libvirt-build » libvirt-fedora-28 #208
by ci@centos.org 08 Jan '19

08 Jan '19
See <https://ci.centos.org/job/libvirt-build/systems=libvirt-fedora-28/208/displ…> Changes: [eblake] maint: Drop unused GETTEXT_CPPFLAGS variable [eblake] maint: Prefer AM_CPPFLAGS over INCLUDES ------------------------------------------ [...truncated 118.75 KB...] checking for perl... /usr/bin/perl checking Whether to build test suite by default... yes checking whether GET_VLAN_VID_CMD is declared... yes checking for struct ifreq.ifr_newname... yes checking for struct ifreq.ifr_ifindex... yes checking for struct ifreq.ifr_index... no checking for struct ifreq.ifr_hwaddr... yes checking whether BRDGSFD is declared... no checking whether BRDGADD is declared... no checking whether BRDGDEL is declared... no checking whether cpuset_getaffinity is declared... no checking for struct if_data.ifi_oqdrops... no checking whether clock_serv_t is declared... no checking whether host_get_clock_service is declared... no checking whether clock_get_time is declared... no checking whether this build is done by a static analysis tool... no checking that generated files are newer than configure... done configure: creating ./config.status config.status: creating run config.status: creating Makefile config.status: creating src/Makefile config.status: creating include/libvirt/Makefile config.status: creating docs/Makefile config.status: creating gnulib/lib/Makefile config.status: creating gnulib/tests/Makefile config.status: creating .color_coded config.status: creating .ycm_extra_conf.py config.status: creating libvirt.pc config.status: creating libvirt-qemu.pc config.status: creating libvirt-lxc.pc config.status: creating libvirt-admin.pc config.status: creating src/libvirt.pc config.status: creating src/libvirt-qemu.pc config.status: creating src/libvirt-lxc.pc config.status: creating libvirt.spec config.status: creating mingw-libvirt.spec config.status: creating po/Makefile config.status: creating include/libvirt/libvirt-common.h config.status: creating examples/Makefile config.status: creating tests/Makefile config.status: creating tools/Makefile config.status: creating config.h config.status: linking ../GNUmakefile to GNUmakefile config.status: executing depfiles commands config.status: executing libtool commands configure: configure: Configuration summary configure: ===================== configure: configure: Drivers configure: configure: QEMU: yes configure: OpenVZ: yes configure: VMware: yes configure: VBox: yes configure: XenAPI: no configure: libxl: yes configure: LXC: yes configure: PHYP: yes configure: ESX: yes configure: Hyper-V: yes configure: vz: no configure: Bhyve: no configure: Test: yes configure: Remote: yes configure: Network: yes configure: Libvirtd: yes configure: Interface: yes configure: configure: Storage Drivers configure: configure: Dir: yes configure: FS: yes configure: NetFS: yes configure: LVM: yes configure: iSCSI: yes configure: iscsi-direct: yes configure: SCSI: yes configure: mpath: yes configure: Disk: yes configure: RBD: yes configure: Sheepdog: yes configure: Gluster: yes configure: ZFS: yes configure: Virtuozzo storage: no configure: configure: Security Drivers configure: configure: SELinux: yes configure: AppArmor: no configure: configure: Driver Loadable Modules configure: configure: driver_modules: yes (CFLAGS='' LIBS='-ldl') configure: configure: Libraries configure: configure: acl: yes (CFLAGS='' LIBS='-lacl') configure: apparmor: no configure: attr: yes (CFLAGS='' LIBS='-lattr') configure: audit: yes (CFLAGS='' LIBS='-laudit') configure: avahi: yes (CFLAGS='-D_REENTRANT ' LIBS='-lavahi-common -lavahi-client ') configure: bash_completion: yes (CFLAGS='' LIBS='') configure: blkid: yes (CFLAGS='-I/usr/include/blkid -I/usr/include/uuid ' LIBS='-lblkid ') configure: capng: yes (CFLAGS='' LIBS='-lcap-ng') configure: curl: yes (CFLAGS='-DCURL_DISABLE_TYPECHECK ' LIBS='-lcurl ') configure: dbus: yes (CFLAGS='-I/usr/include/dbus-1.0 -I/usr/lib64/dbus-1.0/include ' LIBS='-ldbus-1 ') configure: dlopen: yes (CFLAGS='' LIBS='-ldl') configure: firewalld: yes (CFLAGS='' LIBS='') configure: fuse: yes (CFLAGS='-I/usr/include/fuse -D_FILE_OFFSET_BITS=64 ' LIBS='-lfuse -pthread ') configure: glusterfs: yes (CFLAGS='-D_FILE_OFFSET_BITS=64 -D__USE_FILE_OFFSET64 -DUSE_POSIX_ACLS=1 -I/usr/include/uuid ' LIBS='-lacl -lgfapi -lglusterfs -lgfrpc -lgfxdr -luuid ') configure: gnutls: yes (CFLAGS='-I/usr/include/p11-kit-1 ' LIBS='-lgnutls ') configure: hal: no configure: libiscsi: yes (CFLAGS='' LIBS='-L/usr/lib64/iscsi -liscsi ') configure: libnl: yes (CFLAGS='-I/usr/include/libnl3 -I/usr/include/libnl3 ' LIBS='-lnl-3 -lnl-route-3 -lnl-3 ') configure: libpcap: yes (CFLAGS='' LIBS='-lpcap') configure: libssh: yes (CFLAGS='' LIBS='-lssh ') configure: libxl: yes (CFLAGS=' -DLIBXL_API_VERSION=0x040500' LIBS='-lxenlight -lxlutil -lxenstore -lxentoollog') configure: libxml: yes (CFLAGS='-I/usr/include/libxml2 ' LIBS='-lxml2 ') configure: macvtap: yes (CFLAGS='' LIBS='') configure: netcf: yes (CFLAGS='' LIBS='-lnetcf ') configure: NLS: yes configure: nss: yes configure: numactl: yes (CFLAGS='' LIBS='-lnuma') configure: openwsman: yes (CFLAGS='-I/usr/include/openwsman ' LIBS='-lwsman -lwsman_client -lwsman_curl_client_transport ') configure: pciaccess: yes (CFLAGS='' LIBS='-lpciaccess ') configure: pm_utils: no configure: polkit: yes configure: rbd: yes (CFLAGS='' LIBS='-lrbd -lrados') configure: readline: yes (CFLAGS='-D_FUNCTION_DEF ' LIBS='-lreadline') configure: sanlock: yes (CFLAGS='' LIBS='-lsanlock_client') configure: sasl: yes (CFLAGS='' LIBS='-lsasl2') configure: selinux: yes (CFLAGS='' LIBS='-lselinux') configure: ssh2: yes (CFLAGS='' LIBS='-lssh2 ') configure: udev: yes (CFLAGS='' LIBS='-ludev ') configure: virtualport: yes (CFLAGS='' LIBS='') configure: xdr: yes (CFLAGS='-I/usr/include/tirpc' LIBS='') configure: xenapi: no configure: yajl: yes (CFLAGS='' LIBS='-lyajl') configure: configure: Windows configure: configure: Cygwin: no configure: MinGW: no configure: MSVC: no configure: windres: no configure: configure: Test suite configure: configure: Coverage: no configure: Alloc OOM: no configure: configure: Miscellaneous configure: configure: Debug: yes configure: Use -Werror: yes configure: Warning Flags: -fno-common -W -Waddress -Waggressive-loop-optimizations -Wall -Wattribute-alias -Wattributes -Wbad-function-cast -Wbool-compare -Wbool-operation -Wbuiltin-declaration-mismatch -Wbuiltin-macro-redefined -Wcast-align -Wcast-align=strict -Wcast-function-type -Wchar-subscripts -Wclobbered -Wcomment -Wcomments -Wcoverage-mismatch -Wcpp -Wdangling-else -Wdate-time -Wdeprecated-declarations -Wdesignated-init -Wdiscarded-array-qualifiers -Wdiscarded-qualifiers -Wdiv-by-zero -Wdouble-promotion -Wduplicated-cond -Wduplicate-decl-specifier -Wempty-body -Wendif-labels -Wexpansion-to-defined -Wextra -Wformat-contains-nul -Wformat-extra-args -Wformat-security -Wformat-y2k -Wformat-zero-length -Wframe-address -Wfree-nonheap-object -Whsa -Wif-not-aligned -Wignored-attributes -Wignored-qualifiers -Wimplicit -Wimplicit-function-declaration -Wimplicit-int -Wincompatible-pointer-types -Winit-self -Winline -Wint-conversion -Wint-in-bool-context -Wint-to-pointer-cast -Winvalid-memory-model -Winvalid-pch -Wlogical-not-parentheses -Wlogical-op -Wmain -Wmaybe-uninitialized -Wmemset-elt-size -Wmemset-transposed-args -Wmisleading-indentation -Wmissing-attributes -Wmissing-braces -Wmissing-declarations -Wmissing-field-initializers -Wmissing-include-dirs -Wmissing-parameter-type -Wmissing-prototypes -Wmultichar -Wmultistatement-macros -Wnarrowing -Wnested-externs -Wnonnull -Wnonnull-compare -Wnull-dereference -Wodr -Wold-style-declaration -Wold-style-definition -Wopenmp-simd -Woverflow -Woverride-init -Wpacked-bitfield-compat -Wpacked-not-aligned -Wparentheses -Wpointer-arith -Wpointer-compare -Wpointer-sign -Wpointer-to-int-cast -Wpragmas -Wpsabi -Wrestrict -Wreturn-local-addr -Wreturn-type -Wscalar-storage-order -Wsequence-point -Wshadow -Wshift-count-negative -Wshift-count-overflow -Wshift-negative-value -Wsizeof-array-argument -Wsizeof-pointer-div -Wsizeof-pointer-memaccess -Wstrict-aliasing -Wstrict-prototypes -Wstringop-truncation -Wsuggest-attribute=cold -Wsuggest-attribute=const -Wsuggest-attribute=format -Wsuggest-attribute=malloc -Wsuggest-attribute=noreturn -Wsuggest-attribute=pure -Wsuggest-final-methods -Wsuggest-final-types -Wswitch -Wswitch-bool -Wswitch-unreachable -Wsync-nand -Wtautological-compare -Wtrampolines -Wtrigraphs -Wtype-limits -Wuninitialized -Wunknown-pragmas -Wunused -Wunused-but-set-parameter -Wunused-but-set-variable -Wunused-function -Wunused-label -Wunused-local-typedefs -Wunused-parameter -Wunused-result -Wunused-value -Wunused-variable -Wvarargs -Wvariadic-macros -Wvector-operation-performance -Wvolatile-register-var -Wwrite-strings -Walloc-size-larger-than=9223372036854775807 -Warray-bounds=2 -Wformat-overflow=2 -Wformat-truncation=2 -Wimplicit-fallthrough=5 -Wnormalized=nfc -Wshift-overflow=2 -Wstringop-overflow=2 -Wunused-const-variable=2 -Wvla-larger-than=4031 -Wno-sign-compare -Wno-cast-function-type -Wjump-misses-init -Wswitch-enum -Wno-format-nonliteral -Wno-format-truncation -fstack-protector-strong -fexceptions -fasynchronous-unwind-tables -fipa-pure-const -Wno-suggest-attribute=pure -Wno-suggest-attribute=const -Werror configure: DTrace: yes configure: numad: yes configure: Init script: systemd configure: Char device locks: /var/lock configure: Default Editor: vi configure: Loader/NVRAM: configure: virt-login-shell: yes configure: virt-host-validate: yes configure: TLS priority: NORMAL configure: configure: Developer Tools configure: configure: wireshark_dissector: yes (CFLAGS='-I/usr/include/wireshark -I/usr/include/glib-2.0 -I/usr/lib64/glib-2.0/include -pthread ' LIBS='-lwireshark -Wl,--export-dynamic -lgmodule-2.0 -lgthread-2.0 -pthread -lglib-2.0 ') configure: configure: Privileges configure: configure: QEMU: root:root configure: Now type 'make' to compile libvirt. + /usr/bin/gmake /usr/bin/gmake all-recursive gmake[1]: Entering directory '<https://ci.centos.org/job/libvirt-build/systems=libvirt-fedora-28/ws/build'> Making all in . gmake[2]: Entering directory '<https://ci.centos.org/job/libvirt-build/systems=libvirt-fedora-28/ws/build'> gmake[2]: Leaving directory '<https://ci.centos.org/job/libvirt-build/systems=libvirt-fedora-28/ws/build'> Making all in gnulib/lib gmake[2]: Entering directory '<https://ci.centos.org/job/libvirt-build/systems=libvirt-fedora-28/ws/build/…'> GEN alloca.h GEN configmake.h GEN arpa/inet.h GEN fcntl.h GEN getopt.h GEN getopt-cdefs.h GEN langinfo.h GEN limits.h GEN locale.h GEN netdb.h GEN poll.h GEN pty.h GEN signal.h GEN stdlib.h GEN string.h GEN stdio.h GEN strings.h GEN sys/ioctl.h GEN sys/select.h GEN sys/socket.h GEN sys/stat.h GEN sys/time.h GEN sys/types.h GEN sys/uio.h GEN sys/wait.h GEN sys/utsname.h GEN termios.h GEN time.h GEN unistd.h GEN unitypes.h GEN uniwidth.h GEN wchar.h GEN wctype.h /usr/bin/gmake all-am gmake[3]: Entering directory '<https://ci.centos.org/job/libvirt-build/systems=libvirt-fedora-28/ws/build/…'> CC allocator.lo CC areadlink.lo CC base64.lo In file included from ../../../gnulib/lib/areadlink.c:22: ../../config.h:3244:10: fatal error: config-post.h: No such file or directory #include <config-post.h> ^~~~~~~~~~~~~~~ compilation terminated. gmake[3]: *** [Makefile:2544: areadlink.lo] Error 1 gmake[3]: *** Waiting for unfinished jobs.... In file included from ../../../gnulib/lib/base64.c:42: ../../config.h:3244:10: fatal error: config-post.h: No such file or directory #include <config-post.h> ^~~~~~~~~~~~~~~ compilation terminated. gmake[3]: *** [Makefile:2544: base64.lo] Error 1 In file included from ../../../gnulib/lib/allocator.c:2: ../../config.h:3244:10: fatal error: config-post.h: No such file or directory #include <config-post.h> ^~~~~~~~~~~~~~~ compilation terminated. gmake[3]: *** [Makefile:2544: allocator.lo] Error 1 gmake[3]: Leaving directory '<https://ci.centos.org/job/libvirt-build/systems=libvirt-fedora-28/ws/build/…'> gmake[2]: *** [Makefile:2283: all] Error 2 gmake[2]: Leaving directory '<https://ci.centos.org/job/libvirt-build/systems=libvirt-fedora-28/ws/build/…'> gmake[1]: *** [Makefile:2130: all-recursive] Error 1 gmake[1]: Leaving directory '<https://ci.centos.org/job/libvirt-build/systems=libvirt-fedora-28/ws/build'> gmake: *** [Makefile:2023: all] Error 2 Build step 'Execute shell' marked build as failure
1 1
0 0
[Libvirt-ci] Build failed in Jenkins: libvirt-build » libvirt-fedora-29 #208
by ci@centos.org 08 Jan '19

08 Jan '19
See <https://ci.centos.org/job/libvirt-build/systems=libvirt-fedora-29/208/displ…> Changes: [eblake] maint: Drop unused GETTEXT_CPPFLAGS variable [eblake] maint: Prefer AM_CPPFLAGS over INCLUDES ------------------------------------------ [...truncated 118.61 KB...] checking for perl... /usr/bin/perl checking Whether to build test suite by default... yes checking whether GET_VLAN_VID_CMD is declared... yes checking for struct ifreq.ifr_newname... yes checking for struct ifreq.ifr_ifindex... yes checking for struct ifreq.ifr_index... no checking for struct ifreq.ifr_hwaddr... yes checking whether BRDGSFD is declared... no checking whether BRDGADD is declared... no checking whether BRDGDEL is declared... no checking whether cpuset_getaffinity is declared... no checking for struct if_data.ifi_oqdrops... no checking whether clock_serv_t is declared... no checking whether host_get_clock_service is declared... no checking whether clock_get_time is declared... no checking whether this build is done by a static analysis tool... no checking that generated files are newer than configure... done configure: creating ./config.status config.status: creating run config.status: creating Makefile config.status: creating src/Makefile config.status: creating include/libvirt/Makefile config.status: creating docs/Makefile config.status: creating gnulib/lib/Makefile config.status: creating gnulib/tests/Makefile config.status: creating .color_coded config.status: creating .ycm_extra_conf.py config.status: creating libvirt.pc config.status: creating libvirt-qemu.pc config.status: creating libvirt-lxc.pc config.status: creating libvirt-admin.pc config.status: creating src/libvirt.pc config.status: creating src/libvirt-qemu.pc config.status: creating src/libvirt-lxc.pc config.status: creating libvirt.spec config.status: creating mingw-libvirt.spec config.status: creating po/Makefile config.status: creating include/libvirt/libvirt-common.h config.status: creating examples/Makefile config.status: creating tests/Makefile config.status: creating tools/Makefile config.status: creating config.h config.status: linking ../GNUmakefile to GNUmakefile config.status: executing depfiles commands config.status: executing libtool commands configure: configure: Configuration summary configure: ===================== configure: configure: Drivers configure: configure: QEMU: yes configure: OpenVZ: yes configure: VMware: yes configure: VBox: yes configure: XenAPI: no configure: libxl: yes configure: LXC: yes configure: PHYP: yes configure: ESX: yes configure: Hyper-V: yes configure: vz: no configure: Bhyve: no configure: Test: yes configure: Remote: yes configure: Network: yes configure: Libvirtd: yes configure: Interface: yes configure: configure: Storage Drivers configure: configure: Dir: yes configure: FS: yes configure: NetFS: yes configure: LVM: yes configure: iSCSI: yes configure: iscsi-direct: yes configure: SCSI: yes configure: mpath: yes configure: Disk: yes configure: RBD: yes configure: Sheepdog: yes configure: Gluster: yes configure: ZFS: yes configure: Virtuozzo storage: no configure: configure: Security Drivers configure: configure: SELinux: yes configure: AppArmor: no configure: configure: Driver Loadable Modules configure: configure: driver_modules: yes (CFLAGS='' LIBS='-ldl') configure: configure: Libraries configure: configure: acl: yes (CFLAGS='' LIBS='-lacl') configure: apparmor: no configure: attr: yes (CFLAGS='' LIBS='-lattr') configure: audit: yes (CFLAGS='' LIBS='-laudit') configure: avahi: yes (CFLAGS='-D_REENTRANT ' LIBS='-lavahi-common -lavahi-client ') configure: bash_completion: yes (CFLAGS='' LIBS='') configure: blkid: yes (CFLAGS='-I/usr/include/blkid -I/usr/include/uuid ' LIBS='-lblkid ') configure: capng: yes (CFLAGS='' LIBS='-lcap-ng') configure: curl: yes (CFLAGS='-DCURL_DISABLE_TYPECHECK ' LIBS='-lcurl ') configure: dbus: yes (CFLAGS='-I/usr/include/dbus-1.0 -I/usr/lib64/dbus-1.0/include ' LIBS='-ldbus-1 ') configure: dlopen: yes (CFLAGS='' LIBS='-ldl') configure: firewalld: yes (CFLAGS='' LIBS='') configure: fuse: yes (CFLAGS='-I/usr/include/fuse -D_FILE_OFFSET_BITS=64 ' LIBS='-lfuse -pthread ') configure: glusterfs: yes (CFLAGS='-D_FILE_OFFSET_BITS=64 -D__USE_FILE_OFFSET64 -DUSE_POSIX_ACLS=1 -I/usr/include/uuid ' LIBS='-lacl -lgfapi -lglusterfs -lgfrpc -lgfxdr -luuid ') configure: gnutls: yes (CFLAGS='-I/usr/include/p11-kit-1 ' LIBS='-lgnutls ') configure: hal: no configure: libiscsi: yes (CFLAGS='' LIBS='-L/usr/lib64/iscsi -liscsi ') configure: libnl: yes (CFLAGS='-I/usr/include/libnl3 -I/usr/include/libnl3 ' LIBS='-lnl-3 -lnl-route-3 -lnl-3 ') configure: libpcap: yes (CFLAGS='' LIBS='-lpcap') configure: libssh: yes (CFLAGS='' LIBS='-lssh ') configure: libxl: yes (CFLAGS=' -DLIBXL_API_VERSION=0x040500' LIBS='-lxenlight -lxlutil -lxenstore -lxentoollog') configure: libxml: yes (CFLAGS='-I/usr/include/libxml2 ' LIBS='-lxml2 ') configure: macvtap: yes (CFLAGS='' LIBS='') configure: netcf: yes (CFLAGS='' LIBS='-lnetcf ') configure: NLS: yes configure: nss: yes configure: numactl: yes (CFLAGS='' LIBS='-lnuma') configure: openwsman: yes (CFLAGS='-I/usr/include/openwsman ' LIBS='-lwsman -lwsman_client -lwsman_curl_client_transport ') configure: pciaccess: yes (CFLAGS='' LIBS='-lpciaccess ') configure: pm_utils: no configure: polkit: yes configure: rbd: yes (CFLAGS='' LIBS='-lrbd -lrados') configure: readline: yes (CFLAGS='-D_FUNCTION_DEF ' LIBS='-lreadline') configure: sanlock: yes (CFLAGS='' LIBS='-lsanlock_client') configure: sasl: yes (CFLAGS='' LIBS='-lsasl2') configure: selinux: yes (CFLAGS='' LIBS='-lselinux') configure: ssh2: yes (CFLAGS='' LIBS='-lssh2 ') configure: udev: yes (CFLAGS='' LIBS='-ludev ') configure: virtualport: yes (CFLAGS='' LIBS='') configure: xdr: yes (CFLAGS='-I/usr/include/tirpc' LIBS='') configure: xenapi: no configure: yajl: yes (CFLAGS='' LIBS='-lyajl') configure: configure: Windows configure: configure: Cygwin: no configure: MinGW: no configure: MSVC: no configure: windres: no configure: configure: Test suite configure: configure: Coverage: no configure: Alloc OOM: no configure: configure: Miscellaneous configure: configure: Debug: yes configure: Use -Werror: yes configure: Warning Flags: -fno-common -W -Waddress -Waggressive-loop-optimizations -Wall -Wattribute-alias -Wattributes -Wbad-function-cast -Wbool-compare -Wbool-operation -Wbuiltin-declaration-mismatch -Wbuiltin-macro-redefined -Wcast-align -Wcast-align=strict -Wcast-function-type -Wchar-subscripts -Wclobbered -Wcomment -Wcomments -Wcoverage-mismatch -Wcpp -Wdangling-else -Wdate-time -Wdeprecated-declarations -Wdesignated-init -Wdiscarded-array-qualifiers -Wdiscarded-qualifiers -Wdiv-by-zero -Wdouble-promotion -Wduplicated-cond -Wduplicate-decl-specifier -Wempty-body -Wendif-labels -Wexpansion-to-defined -Wextra -Wformat-contains-nul -Wformat-extra-args -Wformat-security -Wformat-y2k -Wformat-zero-length -Wframe-address -Wfree-nonheap-object -Whsa -Wif-not-aligned -Wignored-attributes -Wignored-qualifiers -Wimplicit -Wimplicit-function-declaration -Wimplicit-int -Wincompatible-pointer-types -Winit-self -Winline -Wint-conversion -Wint-in-bool-context -Wint-to-pointer-cast -Winvalid-memory-model -Winvalid-pch -Wlogical-not-parentheses -Wlogical-op -Wmain -Wmaybe-uninitialized -Wmemset-elt-size -Wmemset-transposed-args -Wmisleading-indentation -Wmissing-attributes -Wmissing-braces -Wmissing-declarations -Wmissing-field-initializers -Wmissing-include-dirs -Wmissing-parameter-type -Wmissing-prototypes -Wmultichar -Wmultistatement-macros -Wnarrowing -Wnested-externs -Wnonnull -Wnonnull-compare -Wnull-dereference -Wodr -Wold-style-declaration -Wold-style-definition -Wopenmp-simd -Woverflow -Woverride-init -Wpacked-bitfield-compat -Wpacked-not-aligned -Wparentheses -Wpointer-arith -Wpointer-compare -Wpointer-sign -Wpointer-to-int-cast -Wpragmas -Wpsabi -Wrestrict -Wreturn-local-addr -Wreturn-type -Wscalar-storage-order -Wsequence-point -Wshadow -Wshift-count-negative -Wshift-count-overflow -Wshift-negative-value -Wsizeof-array-argument -Wsizeof-pointer-div -Wsizeof-pointer-memaccess -Wstrict-aliasing -Wstrict-prototypes -Wstringop-truncation -Wsuggest-attribute=cold -Wsuggest-attribute=const -Wsuggest-attribute=format -Wsuggest-attribute=malloc -Wsuggest-attribute=noreturn -Wsuggest-attribute=pure -Wsuggest-final-methods -Wsuggest-final-types -Wswitch -Wswitch-bool -Wswitch-unreachable -Wsync-nand -Wtautological-compare -Wtrampolines -Wtrigraphs -Wtype-limits -Wuninitialized -Wunknown-pragmas -Wunused -Wunused-but-set-parameter -Wunused-but-set-variable -Wunused-function -Wunused-label -Wunused-local-typedefs -Wunused-parameter -Wunused-result -Wunused-value -Wunused-variable -Wvarargs -Wvariadic-macros -Wvector-operation-performance -Wvolatile-register-var -Wwrite-strings -Walloc-size-larger-than=9223372036854775807 -Warray-bounds=2 -Wformat-overflow=2 -Wformat-truncation=2 -Wimplicit-fallthrough=5 -Wnormalized=nfc -Wshift-overflow=2 -Wstringop-overflow=2 -Wunused-const-variable=2 -Wvla-larger-than=4031 -Wno-sign-compare -Wno-cast-function-type -Wjump-misses-init -Wswitch-enum -Wno-format-nonliteral -Wno-format-truncation -fstack-protector-strong -fexceptions -fasynchronous-unwind-tables -fipa-pure-const -Wno-suggest-attribute=pure -Wno-suggest-attribute=const -Werror configure: DTrace: yes configure: numad: yes configure: Init script: systemd configure: Char device locks: /var/lock configure: Default Editor: vi configure: Loader/NVRAM: configure: virt-login-shell: yes configure: virt-host-validate: yes configure: TLS priority: NORMAL configure: configure: Developer Tools configure: configure: wireshark_dissector: yes (CFLAGS='-I/usr/include/wireshark -I/usr/include/glib-2.0 -I/usr/lib64/glib-2.0/include -pthread ' LIBS='-lwireshark -Wl,--export-dynamic -lgmodule-2.0 -lgthread-2.0 -pthread -lglib-2.0 ') configure: configure: Privileges configure: configure: QEMU: root:root configure: Now type 'make' to compile libvirt. + /usr/bin/gmake /usr/bin/gmake all-recursive gmake[1]: Entering directory '<https://ci.centos.org/job/libvirt-build/systems=libvirt-fedora-29/ws/build'> Making all in . gmake[2]: Entering directory '<https://ci.centos.org/job/libvirt-build/systems=libvirt-fedora-29/ws/build'> gmake[2]: Leaving directory '<https://ci.centos.org/job/libvirt-build/systems=libvirt-fedora-29/ws/build'> Making all in gnulib/lib gmake[2]: Entering directory '<https://ci.centos.org/job/libvirt-build/systems=libvirt-fedora-29/ws/build/…'> GEN alloca.h GEN configmake.h GEN arpa/inet.h GEN fcntl.h GEN getopt.h GEN getopt-cdefs.h GEN langinfo.h GEN limits.h GEN locale.h GEN poll.h GEN netdb.h GEN pty.h GEN signal.h GEN stdio.h GEN stdlib.h GEN string.h GEN strings.h GEN sys/ioctl.h GEN sys/select.h GEN sys/socket.h GEN sys/stat.h GEN sys/time.h GEN sys/types.h GEN sys/uio.h GEN sys/utsname.h GEN termios.h GEN sys/wait.h GEN time.h GEN unistd.h GEN unitypes.h GEN uniwidth.h GEN wchar.h GEN wctype.h /usr/bin/gmake all-am gmake[3]: Entering directory '<https://ci.centos.org/job/libvirt-build/systems=libvirt-fedora-29/ws/build/…'> CC allocator.lo CC areadlink.lo CC base64.lo In file included from ../../../gnulib/lib/base64.c:42: ../../config.h:3244:10: fatal error: config-post.h: No such file or directory #include <config-post.h> ^~~~~~~~~~~~~~~ compilation terminated. gmake[3]: *** [Makefile:2633: base64.lo] Error 1 gmake[3]: *** Waiting for unfinished jobs.... In file included from ../../../gnulib/lib/allocator.c:2: ../../config.h:3244:10: fatal error: config-post.h: No such file or directory #include <config-post.h> ^~~~~~~~~~~~~~~ compilation terminated. gmake[3]: *** [Makefile:2633: allocator.lo] Error 1 In file included from ../../../gnulib/lib/areadlink.c:22: ../../config.h:3244:10: fatal error: config-post.h: No such file or directory #include <config-post.h> ^~~~~~~~~~~~~~~ compilation terminated. gmake[3]: *** [Makefile:2633: areadlink.lo] Error 1 gmake[3]: Leaving directory '<https://ci.centos.org/job/libvirt-build/systems=libvirt-fedora-29/ws/build/…'> gmake[2]: *** [Makefile:2366: all] Error 2 gmake[2]: Leaving directory '<https://ci.centos.org/job/libvirt-build/systems=libvirt-fedora-29/ws/build/…'> gmake[1]: *** [Makefile:2130: all-recursive] Error 1 gmake[1]: Leaving directory '<https://ci.centos.org/job/libvirt-build/systems=libvirt-fedora-29/ws/build'> gmake: *** [Makefile:2023: all] Error 2 Build step 'Execute shell' marked build as failure
1 1
0 0
[Libvirt-ci] Build failed in Jenkins: libvirt-build » libvirt-debian-9 #208
by ci@centos.org 08 Jan '19

08 Jan '19
See <https://ci.centos.org/job/libvirt-build/systems=libvirt-debian-9/208/displa…> Changes: [eblake] maint: Drop unused GETTEXT_CPPFLAGS variable [eblake] maint: Prefer AM_CPPFLAGS over INCLUDES ------------------------------------------ [...truncated 118.88 KB...] checking whether BRDGSFD is declared... no checking whether BRDGADD is declared... no checking whether BRDGDEL is declared... no checking whether cpuset_getaffinity is declared... no checking for struct if_data.ifi_oqdrops... no checking whether clock_serv_t is declared... no checking whether host_get_clock_service is declared... no checking whether clock_get_time is declared... no checking whether this build is done by a static analysis tool... no checking that generated files are newer than configure... done configure: creating ./config.status config.status: creating run config.status: creating Makefile config.status: creating src/Makefile config.status: creating include/libvirt/Makefile config.status: creating docs/Makefile config.status: creating gnulib/lib/Makefile config.status: creating gnulib/tests/Makefile config.status: creating .color_coded config.status: creating .ycm_extra_conf.py config.status: creating libvirt.pc config.status: creating libvirt-qemu.pc config.status: creating libvirt-lxc.pc config.status: creating libvirt-admin.pc config.status: creating src/libvirt.pc config.status: creating src/libvirt-qemu.pc config.status: creating src/libvirt-lxc.pc config.status: creating libvirt.spec config.status: creating mingw-libvirt.spec config.status: creating po/Makefile config.status: creating include/libvirt/libvirt-common.h config.status: creating examples/Makefile config.status: creating tests/Makefile config.status: creating tools/Makefile config.status: creating config.h config.status: linking ../GNUmakefile to GNUmakefile config.status: executing depfiles commands config.status: executing libtool commands configure: configure: Configuration summary configure: ===================== configure: configure: Drivers configure: configure: QEMU: yes configure: OpenVZ: yes configure: VMware: yes configure: VBox: yes configure: XenAPI: no configure: libxl: yes configure: LXC: yes configure: PHYP: yes configure: ESX: yes configure: Hyper-V: no configure: vz: no configure: Bhyve: no configure: Test: yes configure: Remote: yes configure: Network: yes configure: Libvirtd: yes configure: Interface: yes configure: configure: Storage Drivers configure: configure: Dir: yes configure: FS: yes configure: NetFS: yes configure: LVM: yes configure: iSCSI: yes configure: iscsi-direct: no configure: SCSI: yes configure: mpath: yes configure: Disk: yes configure: RBD: yes configure: Sheepdog: yes configure: Gluster: yes configure: ZFS: yes configure: Virtuozzo storage: no configure: configure: Security Drivers configure: configure: SELinux: yes configure: AppArmor: yes (install profiles: no) configure: configure: Driver Loadable Modules configure: configure: driver_modules: yes (CFLAGS='' LIBS='-ldl') configure: configure: Libraries configure: configure: acl: yes (CFLAGS='' LIBS='-lacl') configure: apparmor: yes (CFLAGS='' LIBS='-lapparmor') configure: attr: yes (CFLAGS='' LIBS='-lattr') configure: audit: yes (CFLAGS='' LIBS='-laudit') configure: avahi: yes (CFLAGS='-D_REENTRANT ' LIBS='-lavahi-common -lavahi-client ') configure: bash_completion: yes (CFLAGS=' ' LIBS=' ') configure: blkid: yes (CFLAGS='-I/usr/include/blkid -I/usr/include/uuid ' LIBS='-lblkid ') configure: capng: yes (CFLAGS='' LIBS='-lcap-ng') configure: curl: yes (CFLAGS='-DCURL_DISABLE_TYPECHECK -I/usr/include/x86_64-linux-gnu ' LIBS='-lcurl ') configure: dbus: yes (CFLAGS='-I/usr/include/dbus-1.0 -I/usr/lib/x86_64-linux-gnu/dbus-1.0/include ' LIBS='-ldbus-1 ') configure: dlopen: yes (CFLAGS='' LIBS='-ldl') configure: firewalld: yes (CFLAGS='' LIBS='') configure: fuse: yes (CFLAGS='-I/usr/include/fuse -D_FILE_OFFSET_BITS=64 ' LIBS='-lfuse -pthread ') configure: glusterfs: yes (CFLAGS='-I/usr/include/glusterfs -D_FILE_OFFSET_BITS=64 -D__USE_FILE_OFFSET64 -DUSE_POSIX_ACLS=1 -I/usr/include/uuid ' LIBS='-lacl -lgfapi -lglusterfs -lgfrpc -lgfxdr -luuid ') configure: gnutls: yes (CFLAGS='-I/usr/include/p11-kit-1 ' LIBS='-lgnutls ') configure: hal: no configure: libiscsi: no configure: libnl: yes (CFLAGS='-I/usr/include/libnl3 -I/usr/include/libnl3 ' LIBS='-lnl-3 -lnl-route-3 -lnl-3 ') configure: libpcap: yes (CFLAGS='-I/usr/include' LIBS='-L/usr/lib/x86_64-linux-gnu -lpcap') configure: libssh: yes (CFLAGS=' ' LIBS='-lssh ') configure: libxl: yes (CFLAGS=' -DLIBXL_API_VERSION=0x040500' LIBS='-lxenlight -lxlutil -lxenstore -lxentoollog') configure: libxml: yes (CFLAGS='-I/usr/include/libxml2 ' LIBS='-lxml2 ') configure: macvtap: yes (CFLAGS='' LIBS='') configure: netcf: yes (CFLAGS=' ' LIBS='-lnetcf ') configure: NLS: yes configure: nss: yes configure: numactl: yes (CFLAGS='' LIBS='-lnuma') configure: openwsman: no configure: pciaccess: yes (CFLAGS=' ' LIBS='-lpciaccess ') configure: pm_utils: no configure: polkit: yes configure: rbd: yes (CFLAGS='' LIBS='-lrbd -lrados') configure: readline: yes (CFLAGS='-D_FUNCTION_DEF ' LIBS='-lreadline') configure: sanlock: yes (CFLAGS='' LIBS='-lsanlock_client') configure: sasl: yes (CFLAGS='' LIBS='-lsasl2') configure: selinux: yes (CFLAGS='' LIBS='-lselinux') configure: ssh2: yes (CFLAGS=' ' LIBS='-lssh2 ') configure: udev: yes (CFLAGS=' ' LIBS='-ludev ') configure: virtualport: yes (CFLAGS='' LIBS='') configure: xdr: yes (CFLAGS='' LIBS='') configure: xenapi: no configure: yajl: yes (CFLAGS='' LIBS='-lyajl') configure: configure: Windows configure: configure: Cygwin: no configure: MinGW: no configure: MSVC: no configure: windres: no configure: configure: Test suite configure: configure: Coverage: no configure: Alloc OOM: no configure: configure: Miscellaneous configure: configure: Debug: yes configure: Use -Werror: yes configure: Warning Flags: -fno-common -W -Waddress -Waggressive-loop-optimizations -Wall -Wattributes -Wbad-function-cast -Wbool-compare -Wbuiltin-macro-redefined -Wcast-align -Wchar-subscripts -Wclobbered -Wcomment -Wcomments -Wcoverage-mismatch -Wcpp -Wdate-time -Wdeprecated-declarations -Wdesignated-init -Wdiscarded-array-qualifiers -Wdiscarded-qualifiers -Wdiv-by-zero -Wdouble-promotion -Wduplicated-cond -Wempty-body -Wendif-labels -Wextra -Wformat-contains-nul -Wformat-extra-args -Wformat-security -Wformat-y2k -Wformat-zero-length -Wframe-address -Wfree-nonheap-object -Whsa -Wignored-attributes -Wignored-qualifiers -Wimplicit -Wimplicit-function-declaration -Wimplicit-int -Wincompatible-pointer-types -Winit-self -Winline -Wint-conversion -Wint-to-pointer-cast -Winvalid-memory-model -Winvalid-pch -Wlogical-not-parentheses -Wlogical-op -Wmain -Wmaybe-uninitialized -Wmemset-transposed-args -Wmisleading-indentation -Wmissing-braces -Wmissing-declarations -Wmissing-field-initializers -Wmissing-include-dirs -Wmissing-parameter-type -Wmissing-prototypes -Wmultichar -Wnarrowing -Wnested-externs -Wnonnull -Wnonnull-compare -Wnull-dereference -Wodr -Wold-style-declaration -Wold-style-definition -Wopenmp-simd -Woverflow -Woverride-init -Wpacked-bitfield-compat -Wparentheses -Wpointer-arith -Wpointer-sign -Wpointer-to-int-cast -Wpragmas -Wpsabi -Wreturn-local-addr -Wreturn-type -Wscalar-storage-order -Wsequence-point -Wshadow -Wshift-count-negative -Wshift-count-overflow -Wshift-negative-value -Wsizeof-array-argument -Wsizeof-pointer-memaccess -Wstrict-aliasing -Wstrict-prototypes -Wsuggest-attribute=const -Wsuggest-attribute=format -Wsuggest-attribute=noreturn -Wsuggest-attribute=pure -Wsuggest-final-methods -Wsuggest-final-types -Wswitch -Wswitch-bool -Wsync-nand -Wtautological-compare -Wtrampolines -Wtrigraphs -Wtype-limits -Wuninitialized -Wunknown-pragmas -Wunused -Wunused-but-set-parameter -Wunused-but-set-variable -Wunused-function -Wunused-label -Wunused-local-typedefs -Wunused-parameter -Wunused-result -Wunused-value -Wunused-variable -Wvarargs -Wvariadic-macros -Wvector-operation-performance -Wvolatile-register-var -Wwrite-strings -Warray-bounds=2 -Wnormalized=nfc -Wshift-overflow=2 -Wunused-const-variable=2 -Wno-sign-compare -Wjump-misses-init -Wswitch-enum -Wno-format-nonliteral -fstack-protector-strong -fexceptions -fasynchronous-unwind-tables -fipa-pure-const -Wno-suggest-attribute=pure -Wno-suggest-attribute=const -Werror configure: DTrace: yes configure: numad: yes configure: Init script: systemd configure: Char device locks: /var/lock configure: Default Editor: vi configure: Loader/NVRAM: configure: virt-login-shell: yes configure: virt-host-validate: yes configure: TLS priority: NORMAL configure: configure: Developer Tools configure: configure: wireshark_dissector: yes (CFLAGS='-I/usr/include/wireshark -I/usr/include/glib-2.0 -I/usr/lib/x86_64-linux-gnu/glib-2.0/include -pthread ' LIBS='-lwireshark -Wl,--export-dynamic -lgmodule-2.0 -lgthread-2.0 -pthread -lglib-2.0 ') configure: configure: Privileges configure: configure: QEMU: root:root configure: Now type 'make' to compile libvirt. + /usr/bin/make /usr/bin/make all-recursive make[1]: Entering directory '<https://ci.centos.org/job/libvirt-build/systems=libvirt-debian-9/ws/build'> Making all in . make[2]: Entering directory '<https://ci.centos.org/job/libvirt-build/systems=libvirt-debian-9/ws/build'> make[2]: Leaving directory '<https://ci.centos.org/job/libvirt-build/systems=libvirt-debian-9/ws/build'> Making all in gnulib/lib make[2]: Entering directory '<https://ci.centos.org/job/libvirt-build/systems=libvirt-debian-9/ws/build/g…'> GEN alloca.h GEN configmake.h GEN arpa/inet.h GEN fcntl.h GEN getopt.h GEN getopt-cdefs.h GEN langinfo.h GEN limits.h GEN locale.h GEN netdb.h GEN poll.h GEN pty.h GEN signal.h GEN stdint.h GEN stdio.h GEN stdlib.h GEN string.h GEN strings.h GEN sys/ioctl.h GEN sys/select.h GEN sys/socket.h GEN sys/stat.h GEN sys/time.h GEN sys/types.h GEN sys/uio.h GEN sys/utsname.h GEN sys/wait.h GEN termios.h GEN time.h GEN unistd.h GEN unitypes.h GEN uniwidth.h GEN wchar.h GEN wctype.h /usr/bin/make all-am make[3]: Entering directory '<https://ci.centos.org/job/libvirt-build/systems=libvirt-debian-9/ws/build/g…'> CC allocator.lo CC areadlink.lo CC base64.lo In file included from ../../../gnulib/lib/base64.c:42:0: ../../config.h:3244:25: fatal error: config-post.h: No such file or directory #include <config-post.h> ^ compilation terminated. Makefile:2545: recipe for target 'base64.lo' failed make[3]: *** [base64.lo] Error 1 make[3]: *** Waiting for unfinished jobs.... In file included from ../../../gnulib/lib/allocator.c:2:0: ../../config.h:3244:25: fatal error: config-post.h: No such file or directory #include <config-post.h> ^ compilation terminated. In file included from ../../../gnulib/lib/areadlink.c:22:0: ../../config.h:3244:25: fatal error: config-post.h: No such file or directory #include <config-post.h> ^ Makefile:2545: recipe for target 'allocator.lo' failed make[3]: *** [allocator.lo] Error 1 compilation terminated. Makefile:2545: recipe for target 'areadlink.lo' failed make[3]: *** [areadlink.lo] Error 1 make[3]: Leaving directory '<https://ci.centos.org/job/libvirt-build/systems=libvirt-debian-9/ws/build/g…'> Makefile:2283: recipe for target 'all' failed make[2]: *** [all] Error 2 make[2]: Leaving directory '<https://ci.centos.org/job/libvirt-build/systems=libvirt-debian-9/ws/build/g…'> Makefile:2130: recipe for target 'all-recursive' failed make[1]: *** [all-recursive] Error 1 make[1]: Leaving directory '<https://ci.centos.org/job/libvirt-build/systems=libvirt-debian-9/ws/build'> Makefile:2023: recipe for target 'all' failed make: *** [all] Error 2 Build step 'Execute shell' marked build as failure
1 1
0 0
[Libvirt-ci] Build failed in Jenkins: libvirt-build » libvirt-centos-7 #208
by ci@centos.org 08 Jan '19

08 Jan '19
See <https://ci.centos.org/job/libvirt-build/systems=libvirt-centos-7/208/displa…> Changes: [eblake] maint: Drop unused GETTEXT_CPPFLAGS variable [eblake] maint: Prefer AM_CPPFLAGS over INCLUDES ------------------------------------------ [...truncated 118.62 KB...] checking whether GET_VLAN_VID_CMD is declared... yes checking for struct ifreq.ifr_newname... yes checking for struct ifreq.ifr_ifindex... yes checking for struct ifreq.ifr_index... no checking for struct ifreq.ifr_hwaddr... yes checking whether BRDGSFD is declared... no checking whether BRDGADD is declared... no checking whether BRDGDEL is declared... no checking whether cpuset_getaffinity is declared... no checking for struct if_data.ifi_oqdrops... no checking whether clock_serv_t is declared... no checking whether host_get_clock_service is declared... no checking whether clock_get_time is declared... no checking whether this build is done by a static analysis tool... no checking that generated files are newer than configure... done configure: creating ./config.status config.status: creating run config.status: creating Makefile config.status: creating src/Makefile config.status: creating include/libvirt/Makefile config.status: creating docs/Makefile config.status: creating gnulib/lib/Makefile config.status: creating gnulib/tests/Makefile config.status: creating .color_coded config.status: creating .ycm_extra_conf.py config.status: creating libvirt.pc config.status: creating libvirt-qemu.pc config.status: creating libvirt-lxc.pc config.status: creating libvirt-admin.pc config.status: creating src/libvirt.pc config.status: creating src/libvirt-qemu.pc config.status: creating src/libvirt-lxc.pc config.status: creating libvirt.spec config.status: creating mingw-libvirt.spec config.status: creating po/Makefile config.status: creating include/libvirt/libvirt-common.h config.status: creating examples/Makefile config.status: creating tests/Makefile config.status: creating tools/Makefile config.status: creating config.h config.status: linking ../GNUmakefile to GNUmakefile config.status: executing depfiles commands config.status: executing libtool commands configure: configure: Configuration summary configure: ===================== configure: configure: Drivers configure: configure: QEMU: yes configure: OpenVZ: yes configure: VMware: yes configure: VBox: yes configure: XenAPI: no configure: libxl: no configure: LXC: yes configure: PHYP: yes configure: ESX: yes configure: Hyper-V: yes configure: vz: no configure: Bhyve: no configure: Test: yes configure: Remote: yes configure: Network: yes configure: Libvirtd: yes configure: Interface: yes configure: configure: Storage Drivers configure: configure: Dir: yes configure: FS: yes configure: NetFS: yes configure: LVM: yes configure: iSCSI: yes configure: iscsi-direct: no configure: SCSI: yes configure: mpath: yes configure: Disk: yes configure: RBD: yes configure: Sheepdog: no configure: Gluster: yes configure: ZFS: no configure: Virtuozzo storage: no configure: configure: Security Drivers configure: configure: SELinux: yes configure: AppArmor: no configure: configure: Driver Loadable Modules configure: configure: driver_modules: yes (CFLAGS='' LIBS='-ldl') configure: configure: Libraries configure: configure: acl: yes (CFLAGS='' LIBS='-lacl') configure: apparmor: no configure: attr: yes (CFLAGS='' LIBS='-lattr') configure: audit: yes (CFLAGS='' LIBS='-laudit') configure: avahi: yes (CFLAGS='-D_REENTRANT ' LIBS='-lavahi-common -lavahi-client ') configure: bash_completion: yes (CFLAGS=' ' LIBS=' ') configure: blkid: yes (CFLAGS='-I/usr/include/blkid -I/usr/include/uuid ' LIBS='-lblkid ') configure: capng: yes (CFLAGS='' LIBS='-lcap-ng') configure: curl: yes (CFLAGS='-DCURL_DISABLE_TYPECHECK ' LIBS='-lcurl ') configure: dbus: yes (CFLAGS='-I/usr/include/dbus-1.0 -I/usr/lib64/dbus-1.0/include ' LIBS='-ldbus-1 ') configure: dlopen: yes (CFLAGS='' LIBS='-ldl') configure: firewalld: yes (CFLAGS='' LIBS='') configure: fuse: yes (CFLAGS='-D_FILE_OFFSET_BITS=64 -I/usr/include/fuse ' LIBS='-pthread -lfuse ') configure: glusterfs: yes (CFLAGS='-D_FILE_OFFSET_BITS=64 -D__USE_FILE_OFFSET64 -DUSE_POSIX_ACLS=1 -I/usr/include/glusterfs -I/usr/include/uuid ' LIBS='-lacl -lgfapi -lglusterfs -lgfrpc -lgfxdr -luuid ') configure: gnutls: yes (CFLAGS='-I/usr/include/p11-kit-1 ' LIBS='-lgnutls ') configure: hal: no configure: libiscsi: no configure: libnl: yes (CFLAGS='-I/usr/include/libnl3 -I/usr/include/libnl3 ' LIBS='-lnl-3 -lnl-route-3 -lnl-3 ') configure: libpcap: yes (CFLAGS='' LIBS='-lpcap') configure: libssh: yes (CFLAGS=' ' LIBS='-lssh ') configure: libxl: no configure: libxml: yes (CFLAGS='-I/usr/include/libxml2 ' LIBS='-lxml2 ') configure: macvtap: yes (CFLAGS='' LIBS='') configure: netcf: yes (CFLAGS=' ' LIBS='-lnetcf ') configure: NLS: yes configure: nss: yes configure: numactl: yes (CFLAGS='' LIBS='-lnuma') configure: openwsman: yes (CFLAGS='-I/usr/include/openwsman ' LIBS='-lwsman -lwsman_client -lwsman_curl_client_transport ') configure: pciaccess: yes (CFLAGS=' ' LIBS='-lpciaccess ') configure: pm_utils: no configure: polkit: yes configure: rbd: yes (CFLAGS='' LIBS='-lrbd -lrados') configure: readline: yes (CFLAGS='-D_FUNCTION_DEF ' LIBS='-lreadline') configure: sanlock: yes (CFLAGS='' LIBS='-lsanlock_client') configure: sasl: yes (CFLAGS='' LIBS='-lsasl2') configure: selinux: yes (CFLAGS='' LIBS='-lselinux') configure: ssh2: yes (CFLAGS=' ' LIBS='-lssh2 ') configure: udev: yes (CFLAGS=' ' LIBS='-ludev ') configure: virtualport: yes (CFLAGS='' LIBS='') configure: xdr: yes (CFLAGS='' LIBS='') configure: xenapi: no configure: yajl: yes (CFLAGS='' LIBS='-lyajl') configure: configure: Windows configure: configure: Cygwin: no configure: MinGW: no configure: MSVC: no configure: windres: no configure: configure: Test suite configure: configure: Coverage: no configure: Alloc OOM: no configure: configure: Miscellaneous configure: configure: Debug: yes configure: Use -Werror: yes configure: Warning Flags: -fno-common -W -Waddress -Waggressive-loop-optimizations -Wall -Wattributes -Wbad-function-cast -Wbuiltin-macro-redefined -Wcast-align -Wchar-subscripts -Wclobbered -Wcomment -Wcomments -Wcoverage-mismatch -Wcpp -Wdeprecated-declarations -Wdiv-by-zero -Wdouble-promotion -Wempty-body -Wendif-labels -Wextra -Wformat-contains-nul -Wformat-extra-args -Wformat-security -Wformat-y2k -Wformat-zero-length -Wfree-nonheap-object -Wignored-qualifiers -Wimplicit -Wimplicit-function-declaration -Wimplicit-int -Winit-self -Winline -Wint-to-pointer-cast -Winvalid-memory-model -Winvalid-pch -Wlogical-op -Wmain -Wmaybe-uninitialized -Wmissing-braces -Wmissing-declarations -Wmissing-field-initializers -Wmissing-include-dirs -Wmissing-parameter-type -Wmissing-prototypes -Wmultichar -Wnarrowing -Wnested-externs -Wnonnull -Wold-style-declaration -Wold-style-definition -Woverflow -Woverride-init -Wpacked-bitfield-compat -Wparentheses -Wpointer-arith -Wpointer-sign -Wpointer-to-int-cast -Wpragmas -Wpsabi -Wreturn-local-addr -Wreturn-type -Wsequence-point -Wshadow -Wsizeof-pointer-memaccess -Wstrict-aliasing -Wstrict-prototypes -Wsuggest-attribute=const -Wsuggest-attribute=format -Wsuggest-attribute=noreturn -Wsuggest-attribute=pure -Wswitch -Wsync-nand -Wtrampolines -Wtrigraphs -Wtype-limits -Wuninitialized -Wunknown-pragmas -Wunused -Wunused-but-set-parameter -Wunused-but-set-variable -Wunused-function -Wunused-label -Wunused-local-typedefs -Wunused-parameter -Wunused-result -Wunused-value -Wunused-variable -Wvarargs -Wvariadic-macros -Wvector-operation-performance -Wvolatile-register-var -Wwrite-strings -Wnormalized=nfc -Wno-sign-compare -Wjump-misses-init -Wswitch-enum -Wno-format-nonliteral -fstack-protector-strong -fexceptions -fasynchronous-unwind-tables -fipa-pure-const -Wno-suggest-attribute=pure -Wno-suggest-attribute=const -Werror configure: DTrace: yes configure: numad: yes configure: Init script: systemd configure: Char device locks: /var/lock configure: Default Editor: vi configure: Loader/NVRAM: configure: virt-login-shell: yes configure: virt-host-validate: yes configure: TLS priority: NORMAL configure: configure: Developer Tools configure: configure: wireshark_dissector: no configure: configure: Privileges configure: configure: QEMU: root:root configure: Now type 'make' to compile libvirt. + /usr/bin/gmake /usr/bin/gmake all-recursive gmake[1]: Entering directory `<https://ci.centos.org/job/libvirt-build/systems=libvirt-centos-7/ws/build'> Making all in . gmake[2]: Entering directory `<https://ci.centos.org/job/libvirt-build/systems=libvirt-centos-7/ws/build'> gmake[2]: Leaving directory `<https://ci.centos.org/job/libvirt-build/systems=libvirt-centos-7/ws/build'> Making all in gnulib/lib gmake[2]: Entering directory `<https://ci.centos.org/job/libvirt-build/systems=libvirt-centos-7/ws/build/g…'> GEN alloca.h GEN arpa/inet.h GEN configmake.h GEN fcntl.h GEN getopt.h GEN getopt-cdefs.h GEN langinfo.h GEN limits.h GEN locale.h GEN netdb.h GEN poll.h GEN pty.h GEN signal.h GEN stddef.h GEN stdint.h GEN stdio.h GEN stdlib.h GEN string.h GEN strings.h GEN sys/ioctl.h GEN sys/select.h GEN sys/socket.h GEN sys/stat.h GEN sys/time.h GEN sys/types.h GEN sys/uio.h GEN sys/utsname.h GEN sys/wait.h GEN termios.h GEN time.h GEN unistd.h GEN unitypes.h GEN uniwidth.h GEN wchar.h GEN wctype.h /usr/bin/gmake all-am gmake[3]: Entering directory `<https://ci.centos.org/job/libvirt-build/systems=libvirt-centos-7/ws/build/g…'> CC allocator.lo CC areadlink.lo CC base64.lo In file included from ../../../gnulib/lib/areadlink.c:22:0: ../../config.h:3248:25: fatal error: config-post.h: No such file or directory #include <config-post.h> ^ compilation terminated. In file included from ../../../gnulib/lib/allocator.c:2:0: ../../config.h:3248:25: fatal error: config-post.h: No such file or directory #include <config-post.h> ^ compilation terminated. In file included from ../../../gnulib/lib/base64.c:42:0: ../../config.h:3248:25: fatal error: config-post.h: No such file or directory #include <config-post.h> ^ compilation terminated. gmake[3]: *** [areadlink.lo] Error 1 gmake[3]: *** Waiting for unfinished jobs.... gmake[3]: *** [allocator.lo] Error 1 gmake[3]: *** [base64.lo] Error 1 gmake[3]: Leaving directory `<https://ci.centos.org/job/libvirt-build/systems=libvirt-centos-7/ws/build/g…'> gmake[2]: *** [all] Error 2 gmake[2]: Leaving directory `<https://ci.centos.org/job/libvirt-build/systems=libvirt-centos-7/ws/build/g…'> gmake[1]: *** [all-recursive] Error 1 gmake[1]: Leaving directory `<https://ci.centos.org/job/libvirt-build/systems=libvirt-centos-7/ws/build'> gmake: *** [all] Error 2 Build step 'Execute shell' marked build as failure
1 1
0 0
[Libvirt-ci] Build failed in Jenkins: libvirt-build » libvirt-freebsd-11 #208
by ci@centos.org 08 Jan '19

08 Jan '19
See <https://ci.centos.org/job/libvirt-build/systems=libvirt-freebsd-11/208/disp…> Changes: [eblake] maint: Drop unused GETTEXT_CPPFLAGS variable [eblake] maint: Prefer AM_CPPFLAGS over INCLUDES ------------------------------------------ [...truncated 116.36 KB...] checking for struct ifreq.ifr_ifindex... no checking for struct ifreq.ifr_index... yes checking for struct ifreq.ifr_hwaddr... no checking whether BRDGSFD is declared... yes checking whether BRDGADD is declared... yes checking whether BRDGDEL is declared... yes checking whether cpuset_getaffinity is declared... yes checking for kvm_getprocs in -lkvm... yes checking for struct if_data.ifi_oqdrops... yes checking whether clock_serv_t is declared... no checking whether host_get_clock_service is declared... no checking whether clock_get_time is declared... no checking for ifconfig... /sbin/ifconfig checking whether this build is done by a static analysis tool... no checking that generated files are newer than configure... done configure: creating ./config.status config.status: creating run config.status: creating Makefile config.status: creating src/Makefile config.status: creating include/libvirt/Makefile config.status: creating docs/Makefile config.status: creating gnulib/lib/Makefile config.status: creating gnulib/tests/Makefile config.status: creating .color_coded config.status: creating .ycm_extra_conf.py config.status: creating libvirt.pc config.status: creating libvirt-qemu.pc config.status: creating libvirt-lxc.pc config.status: creating libvirt-admin.pc config.status: creating src/libvirt.pc config.status: creating src/libvirt-qemu.pc config.status: creating src/libvirt-lxc.pc config.status: creating libvirt.spec config.status: creating mingw-libvirt.spec config.status: creating po/Makefile config.status: creating include/libvirt/libvirt-common.h config.status: creating examples/Makefile config.status: creating tests/Makefile config.status: creating tools/Makefile config.status: creating config.h config.status: linking ../GNUmakefile to GNUmakefile config.status: executing depfiles commands config.status: executing libtool commands configure: configure: Configuration summary configure: ===================== configure: configure: Drivers configure: configure: QEMU: yes configure: OpenVZ: no configure: VMware: yes configure: VBox: yes configure: XenAPI: no configure: libxl: no configure: LXC: no configure: PHYP: yes configure: ESX: yes configure: Hyper-V: no configure: vz: no configure: Bhyve: yes configure: Test: yes configure: Remote: yes configure: Network: yes configure: Libvirtd: yes configure: Interface: no configure: configure: Storage Drivers configure: configure: Dir: yes configure: FS: no configure: NetFS: no configure: LVM: no configure: iSCSI: no configure: iscsi-direct: no configure: SCSI: no configure: mpath: no configure: Disk: no configure: RBD: no configure: Sheepdog: no configure: Gluster: no configure: ZFS: yes configure: Virtuozzo storage: no configure: configure: Security Drivers configure: configure: SELinux: no configure: AppArmor: no configure: configure: Driver Loadable Modules configure: configure: driver_modules: yes (CFLAGS='' LIBS='') configure: configure: Libraries configure: configure: acl: no configure: apparmor: no configure: attr: no configure: audit: no configure: avahi: yes (CFLAGS='-D_REENTRANT -D_THREAD_SAFE -pthread -I/usr/local/include ' LIBS='-L/usr/local/lib -lavahi-common -lavahi-client ') configure: bash_completion: yes (CFLAGS='' LIBS='') configure: blkid: no configure: capng: no configure: curl: yes (CFLAGS='-DCURL_DISABLE_TYPECHECK -I/usr/local/include ' LIBS='-L/usr/local/lib -lcurl ') configure: dbus: yes (CFLAGS='-I/usr/local/include/dbus-1.0 -I/usr/local/lib/dbus-1.0/include ' LIBS='-L/usr/local/lib -ldbus-1 ') configure: dlopen: yes (CFLAGS='' LIBS='') configure: firewalld: no configure: fuse: yes (CFLAGS='-I/usr/local/include/fuse -D_FILE_OFFSET_BITS=64 ' LIBS='-L/usr/local/lib -lfuse -pthread ') configure: glusterfs: no configure: gnutls: yes (CFLAGS='-I/usr/local/include -I/usr/local/include/p11-kit-1 ' LIBS='-L/usr/local/lib -lgnutls ') configure: hal: yes (CFLAGS='-DDBUS_API_SUBJECT_TO_CHANGE -I/usr/local/include/hal -I/usr/local/include/dbus-1.0 -I/usr/local/lib/dbus-1.0/include ' LIBS='-L/usr/local/lib -lhal -ldbus-1 ') configure: libiscsi: no configure: libnl: no configure: libpcap: yes (CFLAGS='-I/usr/local/include' LIBS='-L/usr/local/lib -Wl,-rpath,/usr/local/lib -lpcap') configure: libssh: yes (CFLAGS='-I/usr/local/include ' LIBS='-L/usr/local/lib -lssh ') configure: libxl: no configure: libxml: yes (CFLAGS='-I/usr/local/include/libxml2 ' LIBS='-L/usr/local/lib -lxml2 ') configure: macvtap: no configure: netcf: no configure: NLS: no configure: nss: yes configure: numactl: no configure: openwsman: no configure: pciaccess: yes (CFLAGS='-I/usr/local/include ' LIBS='-L/usr/local/lib -lpciaccess ') configure: pm_utils: yes (CFLAGS='' LIBS='') configure: polkit: yes configure: rbd: no configure: readline: yes (CFLAGS='-D_FUNCTION_DEF ' LIBS='-lreadline') configure: sanlock: no configure: sasl: yes (CFLAGS='' LIBS='-lsasl2') configure: selinux: no configure: ssh2: yes (CFLAGS='-I/usr/local/include ' LIBS='-L/usr/local/lib -lssh2 ') configure: udev: no configure: virtualport: no configure: xdr: yes (CFLAGS='' LIBS='') configure: xenapi: no configure: yajl: yes (CFLAGS='' LIBS='-lyajl') configure: configure: Windows configure: configure: Cygwin: no configure: MinGW: no configure: MSVC: no configure: windres: no configure: configure: Test suite configure: configure: Coverage: no configure: Alloc OOM: no configure: configure: Miscellaneous configure: configure: Debug: yes configure: Use -Werror: yes configure: Warning Flags: -fno-common -W -Waddress -Wall -Wattributes -Wbad-function-cast -Wbuiltin-macro-redefined -Wcast-align -Wchar-subscripts -Wcomment -Wcomments -Wcpp -Wdangling-else -Wdate-time -Wdeprecated-declarations -Wdiv-by-zero -Wdouble-promotion -Wduplicate-decl-specifier -Wempty-body -Wendif-labels -Wexpansion-to-defined -Wextra -Wformat-extra-args -Wformat-security -Wformat-y2k -Wformat-zero-length -Wignored-attributes -Wignored-qualifiers -Wimplicit -Wimplicit-function-declaration -Wimplicit-int -Wincompatible-pointer-types -Winit-self -Winline -Wint-conversion -Wint-to-pointer-cast -Winvalid-pch -Wlogical-not-parentheses -Wmain -Wmissing-braces -Wmissing-declarations -Wmissing-field-initializers -Wmissing-include-dirs -Wmissing-prototypes -Wmultichar -Wnarrowing -Wnested-externs -Wnonnull -Wnull-dereference -Wodr -Wold-style-definition -Woverflow -Wparentheses -Wpointer-arith -Wpointer-sign -Wpointer-to-int-cast -Wpragmas -Wreturn-type -Wsequence-point -Wshadow -Wshift-count-negative -Wshift-count-overflow -Wshift-negative-value -Wsizeof-array-argument -Wsizeof-pointer-memaccess -Wstrict-aliasing -Wstrict-prototypes -Wswitch -Wswitch-bool -Wtautological-compare -Wtrigraphs -Wtype-limits -Wuninitialized -Wunknown-pragmas -Wunused -Wunused-function -Wunused-label -Wunused-local-typedefs -Wunused-parameter -Wunused-result -Wunused-value -Wunused-variable -Wvarargs -Wvariadic-macros -Wvolatile-register-var -Wwrite-strings -Wno-sign-compare -Wswitch-enum -Wno-format-nonliteral -fstack-protector -Wno-unused-command-line-argument -fexceptions -fasynchronous-unwind-tables -Werror configure: DTrace: no configure: numad: no configure: Init script: none configure: Char device locks: no configure: Default Editor: vi configure: Loader/NVRAM: configure: virt-login-shell: no configure: virt-host-validate: yes configure: TLS priority: NORMAL configure: configure: Developer Tools configure: configure: wireshark_dissector: no configure: configure: Privileges configure: configure: QEMU: root:wheel configure: Now type 'gmake' to compile libvirt. + /usr/local/bin/gmake /usr/local/bin/gmake all-recursive gmake[1]: Entering directory '/usr<https://ci.centos.org/job/libvirt-build/systems=libvirt-freebsd-11/ws/build'> Making all in . gmake[2]: Entering directory '/usr<https://ci.centos.org/job/libvirt-build/systems=libvirt-freebsd-11/ws/build'> gmake[2]: Leaving directory '/usr<https://ci.centos.org/job/libvirt-build/systems=libvirt-freebsd-11/ws/build'> Making all in gnulib/lib gmake[2]: Entering directory '/usr<https://ci.centos.org/job/libvirt-build/systems=libvirt-freebsd-11/ws/build…'> GEN alloca.h GEN byteswap.h GEN configmake.h GEN fcntl.h GEN getopt.h GEN getopt-cdefs.h GEN arpa/inet.h GEN langinfo.h GEN limits.h GEN locale.h GEN netdb.h GEN poll.h GEN pty.h GEN signal.h GEN stdint.h GEN stdio.h GEN stdlib.h GEN string.h GEN strings.h GEN sys/ioctl.h GEN sys/select.h GEN sys/stat.h GEN sys/socket.h GEN sys/time.h GEN sys/types.h GEN sys/uio.h GEN sys/utsname.h GEN termios.h GEN sys/wait.h GEN time.h GEN unistd.h GEN unitypes.h GEN uniwidth.h GEN wchar.h GEN wctype.h /usr/local/bin/gmake all-am gmake[3]: Entering directory '/usr<https://ci.centos.org/job/libvirt-build/systems=libvirt-freebsd-11/ws/build…'> CC allocator.lo CC areadlink.lo CC base64.lo In file included from ../../../gnulib/lib/areadlink.c:22: ../../config.h:3244:10: fatal error: 'config-post.h' file not found #include <config-post.h> ^~~~~~~~~~~~~~~ 1 error generated. gmake[3]: *** [Makefile:2633: areadlink.lo] Error 1 gmake[3]: *** Waiting for unfinished jobs.... In file included from ../../../gnulib/lib/allocator.c:2: ../../config.h:3244:10: fatal error: 'config-post.h' file not found #include <config-post.h> ^~~~~~~~~~~~~~~ In file included from ../../../gnulib/lib/base64.c:42: ../../config.h:3244:10: fatal error: 'config-post.h' file not found #include <config-post.h> ^~~~~~~~~~~~~~~ 1 error generated. gmake[3]: *** [Makefile:2633: allocator.lo] Error 1 1 error generated. gmake[3]: *** [Makefile:2633: base64.lo] Error 1 gmake[3]: Leaving directory '/usr<https://ci.centos.org/job/libvirt-build/systems=libvirt-freebsd-11/ws/build…'> gmake[2]: *** [Makefile:2366: all] Error 2 gmake[2]: Leaving directory '/usr<https://ci.centos.org/job/libvirt-build/systems=libvirt-freebsd-11/ws/build…'> gmake[1]: *** [Makefile:2130: all-recursive] Error 1 gmake[1]: Leaving directory '/usr<https://ci.centos.org/job/libvirt-build/systems=libvirt-freebsd-11/ws/build'> gmake: *** [Makefile:2023: all] Error 2 Build step 'Execute shell' marked build as failure
1 1
0 0
  • ← Newer
  • 1
  • 2
  • 3
  • 4
  • 5
  • 6
  • 7
  • 8
  • 9
  • 10
  • Older →

HyperKitty Powered by HyperKitty version 1.3.12.