libvirt List Archives
Sign In Sign Up
Manage this list Sign In Sign Up

Keyboard Shortcuts

Thread View

  • j: Next unread message
  • k: Previous unread message
  • j a: Jump to all threads
  • j l: Jump to MailingList overview

CI

Thread Start a new thread
Download
Threads by month
  • ----- 2025 -----
  • August
  • July
  • June
  • May
  • April
  • March
  • February
  • January
  • ----- 2024 -----
  • December
  • November
  • October
  • September
  • August
  • July
  • June
  • May
  • April
  • March
  • February
  • January
  • ----- 2023 -----
  • December
  • November
  • October
  • September
  • August
  • July
  • June
  • May
  • April
  • March
  • February
  • January
  • ----- 2022 -----
  • December
  • November
  • October
  • September
  • August
  • July
  • June
  • May
  • April
  • March
  • February
  • January
  • ----- 2021 -----
  • December
  • November
  • October
  • September
  • August
  • July
  • June
  • May
  • April
  • March
  • February
  • January
  • ----- 2020 -----
  • December
  • November
  • October
  • September
  • August
  • July
  • June
  • May
  • April
  • March
  • February
  • January
  • ----- 2019 -----
  • December
  • November
  • October
  • September
  • August
  • July
  • June
  • May
  • April
  • March
  • February
  • January
  • ----- 2018 -----
  • December
  • November
  • October
  • September
  • August
  • July
  • June
  • May
  • April
  • March
  • February
  • January
  • ----- 2017 -----
  • December
  • November
  • October
  • September
  • August
  • July
  • June
  • May
  • April
  • March
  • February
  • January
  • ----- 2016 -----
  • December
  • November
  • October
  • September
  • August
  • July
ci@lists.libvirt.org

January 2019

  • 2 participants
  • 93 discussions
[Libvirt-ci] Build failed in Jenkins: libvirt-build » libvirt-freebsd-12 #208
by ci@centos.org 08 Jan '19

08 Jan '19
See <https://ci.centos.org/job/libvirt-build/systems=libvirt-freebsd-12/208/disp…> Changes: [eblake] maint: Drop unused GETTEXT_CPPFLAGS variable [eblake] maint: Prefer AM_CPPFLAGS over INCLUDES ------------------------------------------ [...truncated 116.30 KB...] checking for struct ifreq.ifr_ifindex... no checking for struct ifreq.ifr_index... yes checking for struct ifreq.ifr_hwaddr... no checking whether BRDGSFD is declared... yes checking whether BRDGADD is declared... yes checking whether BRDGDEL is declared... yes checking whether cpuset_getaffinity is declared... yes checking for kvm_getprocs in -lkvm... yes checking for struct if_data.ifi_oqdrops... yes checking whether clock_serv_t is declared... no checking whether host_get_clock_service is declared... no checking whether clock_get_time is declared... no checking for ifconfig... /sbin/ifconfig checking whether this build is done by a static analysis tool... no checking that generated files are newer than configure... done configure: creating ./config.status config.status: creating run config.status: creating Makefile config.status: creating src/Makefile config.status: creating include/libvirt/Makefile config.status: creating docs/Makefile config.status: creating gnulib/lib/Makefile config.status: creating gnulib/tests/Makefile config.status: creating .color_coded config.status: creating .ycm_extra_conf.py config.status: creating libvirt.pc config.status: creating libvirt-qemu.pc config.status: creating libvirt-lxc.pc config.status: creating libvirt-admin.pc config.status: creating src/libvirt.pc config.status: creating src/libvirt-qemu.pc config.status: creating src/libvirt-lxc.pc config.status: creating libvirt.spec config.status: creating mingw-libvirt.spec config.status: creating po/Makefile config.status: creating include/libvirt/libvirt-common.h config.status: creating examples/Makefile config.status: creating tests/Makefile config.status: creating tools/Makefile config.status: creating config.h config.status: linking ../GNUmakefile to GNUmakefile config.status: executing depfiles commands config.status: executing libtool commands configure: configure: Configuration summary configure: ===================== configure: configure: Drivers configure: configure: QEMU: yes configure: OpenVZ: no configure: VMware: yes configure: VBox: yes configure: XenAPI: no configure: libxl: no configure: LXC: no configure: PHYP: yes configure: ESX: yes configure: Hyper-V: no configure: vz: no configure: Bhyve: yes configure: Test: yes configure: Remote: yes configure: Network: yes configure: Libvirtd: yes configure: Interface: no configure: configure: Storage Drivers configure: configure: Dir: yes configure: FS: no configure: NetFS: no configure: LVM: no configure: iSCSI: no configure: iscsi-direct: no configure: SCSI: no configure: mpath: no configure: Disk: no configure: RBD: no configure: Sheepdog: no configure: Gluster: no configure: ZFS: yes configure: Virtuozzo storage: no configure: configure: Security Drivers configure: configure: SELinux: no configure: AppArmor: no configure: configure: Driver Loadable Modules configure: configure: driver_modules: yes (CFLAGS='' LIBS='') configure: configure: Libraries configure: configure: acl: no configure: apparmor: no configure: attr: no configure: audit: no configure: avahi: yes (CFLAGS='-D_REENTRANT -D_THREAD_SAFE -pthread -I/usr/local/include ' LIBS='-L/usr/local/lib -lavahi-common -lavahi-client ') configure: bash_completion: yes (CFLAGS='' LIBS='') configure: blkid: no configure: capng: no configure: curl: yes (CFLAGS='-DCURL_DISABLE_TYPECHECK -I/usr/local/include ' LIBS='-L/usr/local/lib -lcurl ') configure: dbus: yes (CFLAGS='-I/usr/local/include/dbus-1.0 -I/usr/local/lib/dbus-1.0/include ' LIBS='-L/usr/local/lib -ldbus-1 ') configure: dlopen: yes (CFLAGS='' LIBS='') configure: firewalld: no configure: fuse: yes (CFLAGS='-I/usr/local/include/fuse -D_FILE_OFFSET_BITS=64 ' LIBS='-L/usr/local/lib -lfuse -pthread ') configure: glusterfs: no configure: gnutls: yes (CFLAGS='-I/usr/local/include -I/usr/local/include/p11-kit-1 ' LIBS='-L/usr/local/lib -lgnutls ') configure: hal: yes (CFLAGS='-DDBUS_API_SUBJECT_TO_CHANGE -I/usr/local/include/hal -I/usr/local/include/dbus-1.0 -I/usr/local/lib/dbus-1.0/include ' LIBS='-L/usr/local/lib -lhal -ldbus-1 ') configure: libiscsi: no configure: libnl: no configure: libpcap: yes (CFLAGS='-I/usr/local/include' LIBS='-L/usr/local/lib -Wl,-rpath,/usr/local/lib -lpcap') configure: libssh: yes (CFLAGS='-I/usr/local/include ' LIBS='-L/usr/local/lib -lssh ') configure: libxl: no configure: libxml: yes (CFLAGS='-I/usr/local/include/libxml2 ' LIBS='-L/usr/local/lib -lxml2 ') configure: macvtap: no configure: netcf: no configure: NLS: no configure: nss: yes configure: numactl: no configure: openwsman: no configure: pciaccess: yes (CFLAGS='-I/usr/local/include ' LIBS='-L/usr/local/lib -lpciaccess ') configure: pm_utils: yes (CFLAGS='' LIBS='') configure: polkit: yes configure: rbd: no configure: readline: yes (CFLAGS='-D_FUNCTION_DEF ' LIBS='-lreadline') configure: sanlock: no configure: sasl: yes (CFLAGS='' LIBS='-lsasl2') configure: selinux: no configure: ssh2: yes (CFLAGS='-I/usr/local/include ' LIBS='-L/usr/local/lib -lssh2 ') configure: udev: no configure: virtualport: no configure: xdr: yes (CFLAGS='' LIBS='') configure: xenapi: no configure: yajl: yes (CFLAGS='' LIBS='-lyajl') configure: configure: Windows configure: configure: Cygwin: no configure: MinGW: no configure: MSVC: no configure: windres: no configure: configure: Test suite configure: configure: Coverage: no configure: Alloc OOM: no configure: configure: Miscellaneous configure: configure: Debug: yes configure: Use -Werror: yes configure: Warning Flags: -fno-common -W -Waddress -Wall -Wattributes -Wbad-function-cast -Wbuiltin-macro-redefined -Wcast-align -Wchar-subscripts -Wcomment -Wcomments -Wcpp -Wdangling-else -Wdate-time -Wdeprecated-declarations -Wdiv-by-zero -Wdouble-promotion -Wduplicate-decl-specifier -Wempty-body -Wendif-labels -Wexpansion-to-defined -Wextra -Wformat-extra-args -Wformat-security -Wformat-y2k -Wformat-zero-length -Wignored-attributes -Wignored-qualifiers -Wimplicit -Wimplicit-function-declaration -Wimplicit-int -Wincompatible-pointer-types -Winit-self -Winline -Wint-conversion -Wint-to-pointer-cast -Winvalid-pch -Wlogical-not-parentheses -Wmain -Wmissing-braces -Wmissing-declarations -Wmissing-field-initializers -Wmissing-include-dirs -Wmissing-prototypes -Wmultichar -Wnarrowing -Wnested-externs -Wnonnull -Wnull-dereference -Wodr -Wold-style-definition -Woverflow -Wparentheses -Wpointer-arith -Wpointer-sign -Wpointer-to-int-cast -Wpragmas -Wreturn-type -Wsequence-point -Wshadow -Wshift-count-negative -Wshift-count-overflow -Wshift-negative-value -Wsizeof-array-argument -Wsizeof-pointer-memaccess -Wstrict-aliasing -Wstrict-prototypes -Wswitch -Wswitch-bool -Wtautological-compare -Wtrigraphs -Wtype-limits -Wuninitialized -Wunknown-pragmas -Wunused -Wunused-function -Wunused-label -Wunused-local-typedefs -Wunused-parameter -Wunused-result -Wunused-value -Wunused-variable -Wvarargs -Wvariadic-macros -Wvolatile-register-var -Wwrite-strings -Wno-sign-compare -Wswitch-enum -Wno-format-nonliteral -fstack-protector -Wno-unused-command-line-argument -fexceptions -fasynchronous-unwind-tables -Werror configure: DTrace: no configure: numad: no configure: Init script: none configure: Char device locks: no configure: Default Editor: vi configure: Loader/NVRAM: configure: virt-login-shell: no configure: virt-host-validate: yes configure: TLS priority: NORMAL configure: configure: Developer Tools configure: configure: wireshark_dissector: no configure: configure: Privileges configure: configure: QEMU: root:wheel configure: Now type 'gmake' to compile libvirt. + /usr/local/bin/gmake /usr/local/bin/gmake all-recursive gmake[1]: Entering directory '/usr<https://ci.centos.org/job/libvirt-build/systems=libvirt-freebsd-12/ws/build'> Making all in . gmake[2]: Entering directory '/usr<https://ci.centos.org/job/libvirt-build/systems=libvirt-freebsd-12/ws/build'> gmake[2]: Leaving directory '/usr<https://ci.centos.org/job/libvirt-build/systems=libvirt-freebsd-12/ws/build'> Making all in gnulib/lib gmake[2]: Entering directory '/usr<https://ci.centos.org/job/libvirt-build/systems=libvirt-freebsd-12/ws/build…'> GEN alloca.h GEN byteswap.h GEN configmake.h GEN arpa/inet.h GEN fcntl.h GEN getopt.h GEN getopt-cdefs.h GEN langinfo.h GEN limits.h GEN locale.h GEN netdb.h GEN poll.h GEN pty.h GEN signal.h GEN stdint.h GEN stdio.h GEN stdlib.h GEN string.h GEN strings.h GEN sys/ioctl.h GEN sys/socket.h GEN sys/stat.h GEN sys/time.h GEN sys/types.h GEN sys/select.h GEN sys/uio.h GEN sys/utsname.h GEN sys/wait.h GEN termios.h GEN time.h GEN unistd.h GEN unitypes.h GEN uniwidth.h GEN wchar.h GEN wctype.h /usr/local/bin/gmake all-am gmake[3]: Entering directory '/usr<https://ci.centos.org/job/libvirt-build/systems=libvirt-freebsd-12/ws/build…'> CC allocator.lo CC areadlink.lo CC base64.lo In file included from In file included from ../../../gnulib/lib/areadlink.cIn file included from :../../../gnulib/lib/allocator.c22../../../gnulib/lib/base64.c:: 2../../config.h: :../../config.h3244::324410::10 :fatal error : fatal error'config-post.h' file not found: 'config-post.h' file not found#include <config-post.h> #include <config-post.h> ^~~~~~~~~~~~~~~ ^~~~~~~~~~~~~~~: 42: ../../config.h:3244:10: fatal error: 'config-post.h' file not found #include <config-post.h> ^~~~~~~~~~~~~~~ 1 error generated. 1 error generated. gmake[3]: *** [Makefile:2633: allocator.lo] Error 1 gmake[3]: *** Waiting for unfinished jobs.... gmake[3]: *** [Makefile:2633: areadlink.lo] Error 1 1 error generated. gmake[3]: *** [Makefile:2633: base64.lo] Error 1 gmake[3]: Leaving directory '/usr<https://ci.centos.org/job/libvirt-build/systems=libvirt-freebsd-12/ws/build…'> gmake[2]: *** [Makefile:2366: all] Error 2 gmake[2]: Leaving directory '/usr<https://ci.centos.org/job/libvirt-build/systems=libvirt-freebsd-12/ws/build…'> gmake[1]: *** [Makefile:2130: all-recursive] Error 1 gmake[1]: Leaving directory '/usr<https://ci.centos.org/job/libvirt-build/systems=libvirt-freebsd-12/ws/build'> gmake: *** [Makefile:2023: all] Error 2 Build step 'Execute shell' marked build as failure
1 1
0 0
[Libvirt-ci] Build failed in Jenkins: libvirt-build » libvirt-debian-8 #208
by ci@centos.org 08 Jan '19

08 Jan '19
See <https://ci.centos.org/job/libvirt-build/systems=libvirt-debian-8/208/displa…> Changes: [eblake] maint: Drop unused GETTEXT_CPPFLAGS variable [eblake] maint: Prefer AM_CPPFLAGS over INCLUDES ------------------------------------------ [...truncated 118.85 KB...] checking whether BRDGADD is declared... no checking whether BRDGDEL is declared... no checking whether cpuset_getaffinity is declared... no checking for struct if_data.ifi_oqdrops... no checking whether clock_serv_t is declared... no checking whether host_get_clock_service is declared... no checking whether clock_get_time is declared... no checking whether this build is done by a static analysis tool... no checking that generated files are newer than configure... done configure: creating ./config.status config.status: creating run config.status: creating Makefile config.status: creating src/Makefile config.status: creating include/libvirt/Makefile config.status: creating docs/Makefile config.status: creating gnulib/lib/Makefile config.status: creating gnulib/tests/Makefile config.status: creating .color_coded config.status: creating .ycm_extra_conf.py config.status: creating libvirt.pc config.status: creating libvirt-qemu.pc config.status: creating libvirt-lxc.pc config.status: creating libvirt-admin.pc config.status: creating src/libvirt.pc config.status: creating src/libvirt-qemu.pc config.status: creating src/libvirt-lxc.pc config.status: creating libvirt.spec config.status: creating mingw-libvirt.spec config.status: creating po/Makefile config.status: creating include/libvirt/libvirt-common.h config.status: creating examples/Makefile config.status: creating tests/Makefile config.status: creating tools/Makefile config.status: creating config.h config.status: linking ../GNUmakefile to GNUmakefile config.status: executing depfiles commands config.status: executing libtool commands configure: configure: Configuration summary configure: ===================== configure: configure: Drivers configure: configure: QEMU: yes configure: OpenVZ: yes configure: VMware: yes configure: VBox: yes configure: XenAPI: no configure: libxl: no configure: LXC: yes configure: PHYP: yes configure: ESX: yes configure: Hyper-V: no configure: vz: no configure: Bhyve: no configure: Test: yes configure: Remote: yes configure: Network: yes configure: Libvirtd: yes configure: Interface: yes configure: configure: Storage Drivers configure: configure: Dir: yes configure: FS: yes configure: NetFS: yes configure: LVM: yes configure: iSCSI: yes configure: iscsi-direct: no configure: SCSI: yes configure: mpath: yes configure: Disk: yes configure: RBD: yes configure: Sheepdog: yes configure: Gluster: yes configure: ZFS: yes configure: Virtuozzo storage: no configure: configure: Security Drivers configure: configure: SELinux: yes configure: AppArmor: yes (install profiles: no) configure: configure: Driver Loadable Modules configure: configure: driver_modules: yes (CFLAGS='' LIBS='-ldl') configure: configure: Libraries configure: configure: acl: yes (CFLAGS='' LIBS='-lacl') configure: apparmor: yes (CFLAGS='' LIBS='-lapparmor') configure: attr: yes (CFLAGS='' LIBS='-lattr') configure: audit: yes (CFLAGS='' LIBS='-laudit') configure: avahi: yes (CFLAGS='-D_REENTRANT ' LIBS='-lavahi-common -lavahi-client ') configure: bash_completion: yes (CFLAGS=' ' LIBS=' ') configure: blkid: yes (CFLAGS='-I/usr/include/blkid -I/usr/include/uuid ' LIBS='-lblkid ') configure: capng: yes (CFLAGS='' LIBS='-lcap-ng') configure: curl: yes (CFLAGS='-DCURL_DISABLE_TYPECHECK ' LIBS='-lcurl ') configure: dbus: yes (CFLAGS='-I/usr/include/dbus-1.0 -I/usr/lib/x86_64-linux-gnu/dbus-1.0/include ' LIBS='-ldbus-1 ') configure: dlopen: yes (CFLAGS='' LIBS='-ldl') configure: firewalld: yes (CFLAGS='' LIBS='') configure: fuse: yes (CFLAGS='-I/usr/include/fuse -D_FILE_OFFSET_BITS=64 ' LIBS='-lfuse -pthread ') configure: glusterfs: yes (CFLAGS='-I/usr/include/glusterfs -D_FILE_OFFSET_BITS=64 -D__USE_FILE_OFFSET64 -DUSE_POSIX_ACLS=1 -I/usr/include/uuid ' LIBS='-lacl -lgfapi -lglusterfs -lgfrpc -lgfxdr -luuid ') configure: gnutls: yes (CFLAGS='-I/usr/include/p11-kit-1 ' LIBS='-lgnutls ') configure: hal: no configure: libiscsi: no configure: libnl: yes (CFLAGS='-I/usr/include/libnl3 -I/usr/include/libnl3 ' LIBS='-lnl-3 -lnl-route-3 -lnl-3 ') configure: libpcap: yes (CFLAGS='-I/usr/include' LIBS='-L/usr/lib/x86_64-linux-gnu -lpcap') configure: libssh: no configure: libxl: no configure: libxml: yes (CFLAGS='-I/usr/include/libxml2 ' LIBS='-lxml2 ') configure: macvtap: yes (CFLAGS='' LIBS='') configure: netcf: yes (CFLAGS=' ' LIBS='-lnetcf ') configure: NLS: yes configure: nss: yes configure: numactl: yes (CFLAGS='' LIBS='-lnuma') configure: openwsman: no configure: pciaccess: yes (CFLAGS=' ' LIBS='-lpciaccess ') configure: pm_utils: no configure: polkit: yes configure: rbd: yes (CFLAGS='' LIBS='-lrbd -lrados') configure: readline: yes (CFLAGS='-D_FUNCTION_DEF ' LIBS='-lreadline') configure: sanlock: yes (CFLAGS='' LIBS='-lsanlock_client') configure: sasl: yes (CFLAGS='' LIBS='-lsasl2') configure: selinux: yes (CFLAGS='' LIBS='-lselinux') configure: ssh2: yes (CFLAGS=' ' LIBS='-lssh2 ') configure: udev: yes (CFLAGS=' ' LIBS='-ludev ') configure: virtualport: yes (CFLAGS='' LIBS='') configure: xdr: yes (CFLAGS='' LIBS='') configure: xenapi: no configure: yajl: yes (CFLAGS='' LIBS='-lyajl') configure: configure: Windows configure: configure: Cygwin: no configure: MinGW: no configure: MSVC: no configure: windres: no configure: configure: Test suite configure: configure: Coverage: no configure: Alloc OOM: no configure: configure: Miscellaneous configure: configure: Debug: yes configure: Use -Werror: yes configure: Warning Flags: -fno-common -W -Waddress -Waggressive-loop-optimizations -Wall -Wattributes -Wbad-function-cast -Wbuiltin-macro-redefined -Wcast-align -Wchar-subscripts -Wclobbered -Wcomment -Wcomments -Wcoverage-mismatch -Wcpp -Wdate-time -Wdeprecated-declarations -Wdiv-by-zero -Wdouble-promotion -Wempty-body -Wendif-labels -Wextra -Wformat-contains-nul -Wformat-extra-args -Wformat-security -Wformat-y2k -Wformat-zero-length -Wfree-nonheap-object -Wignored-qualifiers -Wimplicit -Wimplicit-function-declaration -Wimplicit-int -Winit-self -Winline -Wint-to-pointer-cast -Winvalid-memory-model -Winvalid-pch -Wlogical-op -Wmain -Wmaybe-uninitialized -Wmemset-transposed-args -Wmissing-braces -Wmissing-declarations -Wmissing-field-initializers -Wmissing-include-dirs -Wmissing-parameter-type -Wmissing-prototypes -Wmultichar -Wnarrowing -Wnested-externs -Wnonnull -Wold-style-declaration -Wold-style-definition -Wopenmp-simd -Woverflow -Woverride-init -Wpacked-bitfield-compat -Wparentheses -Wpointer-arith -Wpointer-sign -Wpointer-to-int-cast -Wpragmas -Wpsabi -Wreturn-local-addr -Wreturn-type -Wsequence-point -Wshadow -Wsizeof-pointer-memaccess -Wstrict-aliasing -Wstrict-prototypes -Wsuggest-attribute=const -Wsuggest-attribute=format -Wsuggest-attribute=noreturn -Wsuggest-attribute=pure -Wswitch -Wsync-nand -Wtrampolines -Wtrigraphs -Wtype-limits -Wuninitialized -Wunknown-pragmas -Wunused -Wunused-but-set-parameter -Wunused-but-set-variable -Wunused-function -Wunused-label -Wunused-local-typedefs -Wunused-parameter -Wunused-result -Wunused-value -Wunused-variable -Wvarargs -Wvariadic-macros -Wvector-operation-performance -Wvolatile-register-var -Wwrite-strings -Wnormalized=nfc -Wno-sign-compare -Wjump-misses-init -Wswitch-enum -Wno-format-nonliteral -fstack-protector-strong -fexceptions -fasynchronous-unwind-tables -fipa-pure-const -Wno-suggest-attribute=pure -Wno-suggest-attribute=const -Werror configure: DTrace: yes configure: numad: no configure: Init script: systemd configure: Char device locks: /var/lock configure: Default Editor: vi configure: Loader/NVRAM: configure: virt-login-shell: yes configure: virt-host-validate: yes configure: TLS priority: NORMAL configure: configure: Developer Tools configure: configure: wireshark_dissector: no configure: configure: Privileges configure: configure: QEMU: root:root configure: Now type 'make' to compile libvirt. + /usr/bin/make /usr/bin/make all-recursive make[1]: Entering directory '<https://ci.centos.org/job/libvirt-build/systems=libvirt-debian-8/ws/build'> Making all in . make[2]: Entering directory '<https://ci.centos.org/job/libvirt-build/systems=libvirt-debian-8/ws/build'> make[2]: Leaving directory '<https://ci.centos.org/job/libvirt-build/systems=libvirt-debian-8/ws/build'> Making all in gnulib/lib make[2]: Entering directory '<https://ci.centos.org/job/libvirt-build/systems=libvirt-debian-8/ws/build/g…'> GEN alloca.h GEN configmake.h GEN arpa/inet.h GEN fcntl.h GEN getopt.h GEN getopt-cdefs.h GEN langinfo.h GEN limits.h GEN locale.h GEN netdb.h GEN poll.h GEN pty.h GEN signal.h GEN stddef.h GEN stdint.h GEN stdio.h GEN stdlib.h GEN string.h GEN strings.h GEN sys/ioctl.h GEN sys/select.h GEN sys/socket.h GEN sys/stat.h GEN sys/types.h GEN sys/uio.h GEN sys/time.h GEN sys/utsname.h GEN sys/wait.h GEN termios.h GEN time.h GEN unitypes.h GEN unistd.h GEN uniwidth.h GEN wchar.h GEN wctype.h /usr/bin/make all-am make[3]: Entering directory '<https://ci.centos.org/job/libvirt-build/systems=libvirt-debian-8/ws/build/g…'> CC allocator.lo CC areadlink.lo CC base64.lo In file included from ../../../gnulib/lib/base64.c:42:0: ../../config.h:3245:25: fatal error: config-post.h: No such file or directory #include <config-post.h> ^ compilation terminated. In file included from ../../../gnulib/lib/allocator.c:2:0: ../../config.h:3245:25: fatal error: config-post.h: No such file or directory #include <config-post.h> ^ compilation terminated. In file included from ../../../gnulib/lib/areadlink.c:22:0: ../../config.h:3245:25: fatal error: config-post.h: No such file or directory #include <config-post.h> ^ compilation terminated. Makefile:2534: recipe for target 'base64.lo' failed make[3]: *** [base64.lo] Error 1 make[3]: *** Waiting for unfinished jobs.... Makefile:2534: recipe for target 'areadlink.lo' failed make[3]: *** [areadlink.lo] Error 1 Makefile:2534: recipe for target 'allocator.lo' failed make[3]: *** [allocator.lo] Error 1 make[3]: Leaving directory '<https://ci.centos.org/job/libvirt-build/systems=libvirt-debian-8/ws/build/g…'> Makefile:2271: recipe for target 'all' failed make[2]: *** [all] Error 2 make[2]: Leaving directory '<https://ci.centos.org/job/libvirt-build/systems=libvirt-debian-8/ws/build/g…'> Makefile:2119: recipe for target 'all-recursive' failed make[1]: *** [all-recursive] Error 1 make[1]: Leaving directory '<https://ci.centos.org/job/libvirt-build/systems=libvirt-debian-8/ws/build'> Makefile:2011: recipe for target 'all' failed make: *** [all] Error 2 Build step 'Execute shell' marked build as failure
1 1
0 0
[Libvirt-ci] Fixed: libvirt/libvirt#1896 (master - f3a4fbd)
by Travis CI 08 Jan '19

08 Jan '19
Build Update for libvirt/libvirt ------------------------------------- Build: #1896 Status: Fixed Duration: 20 mins and 55 secs Commit: f3a4fbd (master) Author: Eric Blake Message: maint: Fix VPATH build In a VPATH build, <config.h> is in the builddir (which automake includes automatically), but it includes <config-post.h> from the top source directory (which is not automatic); hence, we need to keep the -I(top_srcdir) directive that was accidentally removed from commit 7a879323 (the problem is not visible in an in-tree build). Signed-off-by: Eric Blake <eblake(a)redhat.com> View the changeset: https://github.com/libvirt/libvirt/compare/1862a554625e...f3a4fbd24bf4 View the full build log and details: https://travis-ci.org/libvirt/libvirt/builds/476674982?utm_medium=notificat… -- You can unsubscribe from build emails from the libvirt/libvirt repository going to https://travis-ci.org/account/preferences/unsubscribe?repository=4872032&ut…. Or unsubscribe from *all* email updating your settings at https://travis-ci.org/account/preferences/unsubscribe?utm_medium=notificati…. Or configure specific recipients for build notifications in your .travis.yml file. See https://docs.travis-ci.com/user/notifications.
1 0
0 0
[Libvirt-ci] Broken: libvirt/libvirt#1895 (master - 1862a55)
by Travis CI 08 Jan '19

08 Jan '19
Build Update for libvirt/libvirt ------------------------------------- Build: #1895 Status: Broken Duration: 20 mins and 35 secs Commit: 1862a55 (master) Author: Eric Blake Message: maint: Prefer AM_CPPFLAGS over INCLUDES Our use of INCLUDES in Makefile.am hearkens back to when we had to cater to automake 1.9.6 (thanks, RHEL 5) which lacked AM_CPPFLAGS. Modern Automake flags a warning that INCLUDES is deprecated, and now that we mandate RHEL 7 or better (see commit c1bc9c66), we no longer have to cater to the old spelling. This change will also make it easier to do per-binary CPPFLAGS. Signed-off-by: Eric Blake <eblake(a)redhat.com> Reviewed-by: Ján Tomko <jtomko(a)redhat.com> View the changeset: https://github.com/libvirt/libvirt/compare/ab51b22c07d2...1862a554625e View the full build log and details: https://travis-ci.org/libvirt/libvirt/builds/476662628?utm_medium=notificat… -- You can unsubscribe from build emails from the libvirt/libvirt repository going to https://travis-ci.org/account/preferences/unsubscribe?repository=4872032&ut…. Or unsubscribe from *all* email updating your settings at https://travis-ci.org/account/preferences/unsubscribe?utm_medium=notificati…. Or configure specific recipients for build notifications in your .travis.yml file. See https://docs.travis-ci.com/user/notifications.
1 0
0 0
[Libvirt-ci] Build failed in Jenkins: libvirt-build » libvirt-freebsd-11 #199
by ci@centos.org 07 Jan '19

07 Jan '19
See <https://ci.centos.org/job/libvirt-build/systems=libvirt-freebsd-11/199/disp…> Changes: [jtomko] maint: update to latest gnulib ------------------------------------------ [...truncated 162.86 KB...] CC qemuxml2xmltest.o CC qemuargv2xmltest.o CC domainsnapshotxml2xmltest.o CC qemumonitorjsontest.o CC qemumonitortestutils.lo CC testutilsqemuschema.lo CC qemuhotplugtest.o CC qemuagenttest.o CC qemucapabilitiestest.o CC qemucaps2xmltest.o CC qemumemlocktest.o CC qemucommandutiltest.o CC qemublocktest.o CC qemumigparamstest.o CC qemusecuritytest.o CC qemusecuritymock.o CC esxutilstest.o CC vboxsnapshotxmltest.o CC vmx2xmltest.o CC xml2vmxtest.o CC vmwarevertest.o CC bhyvexml2argvtest.o CC bhyvexml2xmltest.o CC bhyveargv2xmltest.o CC virjsontest.o CC networkxml2xmltest.o CC networkxml2xmlupdatetest.o CC networkxml2conftest.o CC networkxml2firewalltest.o CC nwfilterxml2xmltest.o CC virnwfilterbindingxml2xmltest.o CC storagevolxml2argvtest.o CC storagepoolxml2argvtest.o CC virstorageutiltest.o CC nsstest-nsstest.o CC nsstest-testutils.o CC nssguesttest-nsstest.o CC nssguesttest-testutils.o CC storagevolxml2xmltest.o CC storagepoolxml2xmltest.o CC nodedevxml2xmltest.o CC interfacexml2xmltest.o CC cputest.o CC metadatatest.o CC secretxml2xmltest.o CC genericxml2xmltest.o CC eventtest.o CC virdrivermoduletest.o CC objecteventtest.o CC virmacmaptest.o CC commandhelper.o CC ssh.o CC qemucapsprobe.o CC nsslinktest-nsslinktest.o CC nssguestlinktest-nsslinktest.o CC virportallocatormock.lo CC virnetdaemonmock.lo CC virnetserverclientmock.lo CC vircgroupmock.lo CC virpcimock.lo CC virnetdevmock_la-virnetdevmock.lo CC virrandommock.lo CC virhostcpumock.lo CC domaincapsmock.lo CC virfilecachemock.lo CC virdbusmock_la-virdbusmock.lo CC qemuxml2argvmock.lo CC qemucaps2xmlmock.lo CC qemucapsprobemock.lo CC qemucpumock.lo CC bhyvexml2argvmock.lo CC bhyveargv2xmlmock.lo CC nssmock.lo CC virdeterministichashmock.lo CCLD virshtest CCLD sockettest CCLD virhostcputest CCLD virbuftest CCLD commandtest CCLD seclabeltest CCLD virhashtest CCLD virconftest CCLD viratomictest CCLD utiltest CCLD libshunload.la CCLD virtimetest CCLD viruritest CCLD virkeyfiletest CCLD viralloctest CCLD virauthconfigtest CCLD virbitmaptest CCLD vircgrouptest CCLD vircryptotest CCLD virpcitest CCLD virendiantest CCLD virfiletest CCLD virfilecachetest CCLD virfirewalltest CCLD viriscsitest CCLD virkeycodetest CCLD virlockspacetest CCLD virlogtest CCLD virrotatingfiletest CCLD virschematest CCLD virstringtest CCLD virportallocatortest CCLD sysinfotest CCLD virkmodtest CCLD vircapstest CCLD domaincapstest CCLD domainconftest CCLD virhostdevtest CCLD virnetdevtest CCLD virtypedparamtest CCLD vshtabletest CCLD virerrortest CCLD virnetmessagetest CCLD virnetsockettest CCLD virnetdaemontest CCLD virnetserverclienttest CCLD virnettlscontexttest CCLD virnettlssessiontest CCLD fdstreamtest CCLD virdbustest CCLD virsystemdtest CCLD virpolkittest CCLD qemuxml2argvtest CCLD qemuxml2xmltest CCLD qemuargv2xmltest CCLD domainsnapshotxml2xmltest CCLD libqemumonitortestutils.la CCLD qemucaps2xmltest CCLD qemumemlocktest CCLD qemucommandutiltest CCLD qemublocktest CCLD qemumigparamstest CCLD qemusecuritytest CCLD esxutilstest CCLD vboxsnapshotxmltest CCLD vmx2xmltest CCLD xml2vmxtest CCLD vmwarevertest CCLD bhyvexml2argvtest CCLD bhyvexml2xmltest CCLD bhyveargv2xmltest CCLD virjsontest CCLD networkxml2xmltest CCLD networkxml2xmlupdatetest CCLD networkxml2conftest CCLD networkxml2firewalltest CCLD nwfilterxml2xmltest CCLD virnwfilterbindingxml2xmltest CCLD storagevolxml2argvtest CCLD storagepoolxml2argvtest CCLD virstorageutiltest CCLD nsstest CCLD nssguesttest CCLD storagevolxml2xmltest CCLD storagepoolxml2xmltest CCLD nodedevxml2xmltest CCLD interfacexml2xmltest CCLD cputest CCLD metadatatest CCLD secretxml2xmltest CCLD genericxml2xmltest CCLD eventtest CCLD virdrivermoduletest CCLD objecteventtest CCLD virmacmaptest CCLD commandhelper CCLD ssh CCLD qemucapsprobe CCLD nsslinktest CCLD nssguestlinktest CCLD virportallocatormock.la CCLD virnetdaemonmock.la CCLD virnetserverclientmock.la CCLD vircgroupmock.la CCLD virpcimock.la CCLD virnetdevmock.la CCLD virrandommock.la CCLD virhostcpumock.la CCLD domaincapsmock.la CCLD virfilecachemock.la CCLD virdbusmock.la CCLD qemuxml2argvmock.la CCLD qemucaps2xmlmock.la CCLD qemucapsprobemock.la CCLD qemucpumock.la CCLD bhyvexml2argvmock.la CCLD bhyveargv2xmlmock.la CCLD nssmock.la CCLD virdeterministichashmock.la CCLD shunloadtest CCLD qemumonitorjsontest CCLD qemuhotplugtest CCLD qemuagenttest CCLD qemucapabilitiestest gmake[2]: Leaving directory '/usr<https://ci.centos.org/job/libvirt-build/systems=libvirt-freebsd-11/ws/build…'> Making all in po gmake[2]: Entering directory '/usr<https://ci.centos.org/job/libvirt-build/systems=libvirt-freebsd-11/ws/build…'> gmake[2]: Nothing to be done for 'all'. gmake[2]: Leaving directory '/usr<https://ci.centos.org/job/libvirt-build/systems=libvirt-freebsd-11/ws/build…'> Making all in examples gmake[2]: Entering directory '/usr<https://ci.centos.org/job/libvirt-build/systems=libvirt-freebsd-11/ws/build…'> CC dominfo/info1.o CC dommigrate/dommigrate.o CC domsuspend/suspend.o In file included from ../../examples/dommigrate/dommigrate.c:26: In file included from ../gnulib/lib/stdlib.h:100: ../gnulib/lib/unistd.h:618:3: error: "Please include config.h first." #error "Please include config.h first." ^ ../gnulib/lib/unistd.h:620:1: error: unknown type name '_GL_INLINE_HEADER_BEGIN' _GL_INLINE_HEADER_BEGIN ^ ../gnulib/lib/unistd.h:762:1: error: expected identifier or '(' _GL_CXXALIAS_SYS (chown, int, (const char *file, uid_t uid, gid_t gid)); ^ ../gnulib/lib/time.h:247:5: note: expanded from macro '_GL_CXXALIAS_SYS' _GL_EXTERN_C int _gl_cxxalias_dummy CC domtop/domtop.o ^ ../gnulib/lib/time.h:139:23: note: expanded from macro '_GL_EXTERN_C' # define _GL_EXTERN_C extern ^ In file included from ../../examples/dommigrate/dommigrate.c:26: In file included from ../gnulib/lib/stdlib.h:100: ../gnulib/lib/unistd.h:2138:1: error: unknown type name '_GL_INLINE_HEADER_END' _GL_INLINE_HEADER_END ^ In file included from ../../examples/dommigrate/dommigrate.c:26: ../gnulib/lib/stdlib.h:665:1: error: expected identifier or '(' _GL_CXXALIAS_SYS (calloc, void *, (size_t nmemb, size_t size)); ^ ../gnulib/lib/time.h:247:5: note: expanded from macro '_GL_CXXALIAS_SYS' _GL_EXTERN_C int _gl_cxxalias_dummy ^ ../gnulib/lib/time.h:139:23: note: expanded from macro '_GL_EXTERN_C' # define _GL_EXTERN_C extern ^ 5 errors generated. gmake[2]: *** [Makefile:2411: dommigrate/dommigrate.o] Error 1 gmake[2]: *** Waiting for unfinished jobs.... gmake[2]: Leaving directory '/usr<https://ci.centos.org/job/libvirt-build/systems=libvirt-freebsd-11/ws/build…'> gmake[1]: *** [Makefile:2130: all-recursive] Error 1 gmake[1]: Leaving directory '/usr<https://ci.centos.org/job/libvirt-build/systems=libvirt-freebsd-11/ws/build'> gmake: *** [Makefile:2023: all] Error 2 Build step 'Execute shell' marked build as failure
1 6
0 0
[Libvirt-ci] Build failed in Jenkins: libvirt-build » libvirt-freebsd-12 #199
by ci@centos.org 07 Jan '19

07 Jan '19
See <https://ci.centos.org/job/libvirt-build/systems=libvirt-freebsd-12/199/disp…> Changes: [jtomko] maint: update to latest gnulib ------------------------------------------ [...truncated 163.92 KB...] CC nsstest-testutils.o CC nssguesttest-nsstest.o CC nssguesttest-testutils.o CC storagevolxml2xmltest.o CC storagepoolxml2xmltest.o CC nodedevxml2xmltest.o CC interfacexml2xmltest.o CC cputest.o CC metadatatest.o CC secretxml2xmltest.o CC genericxml2xmltest.o CC eventtest.o CC virdrivermoduletest.o CC objecteventtest.o CC virmacmaptest.o CC commandhelper.o CC ssh.o CC qemucapsprobe.o CC nsslinktest-nsslinktest.o CC nssguestlinktest-nsslinktest.o CC virportallocatormock.lo CC virnetdaemonmock.lo CC virnetserverclientmock.lo CC vircgroupmock.lo CC virpcimock.lo CC virnetdevmock_la-virnetdevmock.lo CC virrandommock.lo CC virhostcpumock.lo CC domaincapsmock.lo CC virfilecachemock.lo CC virdbusmock_la-virdbusmock.lo CC qemuxml2argvmock.lo CC qemucaps2xmlmock.lo CC qemucapsprobemock.lo CC qemucpumock.lo CC bhyvexml2argvmock.lo CC bhyveargv2xmlmock.lo CC nssmock.lo CC virdeterministichashmock.lo CCLD virshtest CCLD sockettest CCLD virhostcputest CCLD virbuftest CCLD commandtest CCLD seclabeltest CCLD virhashtest CCLD virconftest CCLD viratomictest CCLD utiltest CCLD libshunload.la CCLD virtimetest CCLD viruritest CCLD virkeyfiletest CCLD viralloctest CCLD virauthconfigtest CCLD virbitmaptest CCLD vircgrouptest CCLD vircryptotest CCLD virpcitest CCLD virendiantest CCLD virfiletest CCLD virfilecachetest CCLD virfirewalltest CCLD viriscsitest CCLD virkeycodetest CCLD virlockspacetest CCLD virlogtest CCLD virrotatingfiletest CCLD virschematest CCLD virstringtest CCLD virportallocatortest CCLD sysinfotest CCLD virkmodtest CCLD vircapstest CCLD domaincapstest CCLD domainconftest CCLD virhostdevtest CCLD virnetdevtest CCLD virtypedparamtest CCLD vshtabletest CCLD virerrortest CCLD virnetmessagetest CCLD virnetsockettest CCLD virnetdaemontest CCLD virnetserverclienttest CCLD virnettlscontexttest CCLD virnettlssessiontest CCLD fdstreamtest CCLD virdbustest CCLD virsystemdtest CCLD virpolkittest CCLD qemuxml2argvtest CCLD qemuxml2xmltest CCLD qemuargv2xmltest CCLD domainsnapshotxml2xmltest CCLD libqemumonitortestutils.la CCLD qemucaps2xmltest CCLD qemumemlocktest CCLD qemucommandutiltest CCLD qemublocktest CCLD qemumigparamstest CCLD qemusecuritytest CCLD esxutilstest CCLD vboxsnapshotxmltest CCLD vmx2xmltest CCLD xml2vmxtest CCLD vmwarevertest CCLD bhyvexml2argvtest CCLD bhyvexml2xmltest CCLD bhyveargv2xmltest CCLD virjsontest CCLD networkxml2xmltest CCLD networkxml2xmlupdatetest CCLD networkxml2conftest CCLD networkxml2firewalltest CCLD nwfilterxml2xmltest CCLD virnwfilterbindingxml2xmltest CCLD storagevolxml2argvtest CCLD storagepoolxml2argvtest CCLD virstorageutiltest CCLD nsstest CCLD nssguesttest CCLD storagevolxml2xmltest CCLD storagepoolxml2xmltest CCLD nodedevxml2xmltest CCLD interfacexml2xmltest CCLD cputest CCLD metadatatest CCLD secretxml2xmltest CCLD genericxml2xmltest CCLD eventtest CCLD virdrivermoduletest CCLD objecteventtest CCLD virmacmaptest CCLD commandhelper CCLD ssh CCLD qemucapsprobe CCLD nsslinktest CCLD nssguestlinktest CCLD virportallocatormock.la CCLD virnetdaemonmock.la CCLD virnetserverclientmock.la CCLD vircgroupmock.la CCLD virpcimock.la CCLD virnetdevmock.la CCLD virrandommock.la CCLD virhostcpumock.la CCLD domaincapsmock.la CCLD virfilecachemock.la CCLD virdbusmock.la CCLD qemuxml2argvmock.la CCLD qemucaps2xmlmock.la CCLD qemucapsprobemock.la CCLD qemucpumock.la CCLD bhyvexml2argvmock.la CCLD bhyveargv2xmlmock.la CCLD nssmock.la CCLD virdeterministichashmock.la CCLD shunloadtest CCLD qemumonitorjsontest CCLD qemuhotplugtest CCLD qemuagenttest CCLD qemucapabilitiestest gmake[2]: Leaving directory '/usr<https://ci.centos.org/job/libvirt-build/systems=libvirt-freebsd-12/ws/build…'> Making all in po gmake[2]: Entering directory '/usr<https://ci.centos.org/job/libvirt-build/systems=libvirt-freebsd-12/ws/build…'> gmake[2]: Nothing to be done for 'all'. gmake[2]: Leaving directory '/usr<https://ci.centos.org/job/libvirt-build/systems=libvirt-freebsd-12/ws/build…'> Making all in examples gmake[2]: Entering directory '/usr<https://ci.centos.org/job/libvirt-build/systems=libvirt-freebsd-12/ws/build…'> CC dominfo/info1.o CC dommigrate/dommigrate.o CC domsuspend/suspend.o In file included from ../../examples/dommigrate/dommigrate.c:26: In file included from CC domtop/domtop.o ../gnulib/lib/stdlib.h:100: ../gnulib/lib/unistd.h:618:3: error: "Please include config.h first." #error "Please include config.h first." ^ ../gnulib/lib/unistd.h:620:1: error: unknown type name '_GL_INLINE_HEADER_BEGIN' _GL_INLINE_HEADER_BEGIN ^ ../gnulib/lib/unistd.h:762:1: error: expected identifier or '(' _GL_CXXALIAS_SYS (chown, int, (const char *file, uid_t uid, gid_t gid)); ^ ../gnulib/lib/time.h:247:5: note: expanded from macro '_GL_CXXALIAS_SYS' _GL_EXTERN_C int _gl_cxxalias_dummy ^ ../gnulib/lib/time.h:139:23: note: expanded from macro '_GL_EXTERN_C' # define _GL_EXTERN_C extern ^ In file included from ../../examples/dommigrate/dommigrate.c:26: In file included from ../gnulib/lib/stdlib.h:100: ../gnulib/lib/unistd.h:2138:1: error: unknown type name '_GL_INLINE_HEADER_END' _GL_INLINE_HEADER_END ^ In file included from ../../examples/dommigrate/dommigrate.c:26: ../gnulib/lib/stdlib.h:665:1: error: expected identifier or '(' _GL_CXXALIAS_SYS (calloc, void *, (size_t nmemb, size_t size)); ^ ../gnulib/lib/time.h:247:5: note: expanded from macro '_GL_CXXALIAS_SYS' _GL_EXTERN_C int _gl_cxxalias_dummy ^ ../gnulib/lib/time.h: CC hellolibvirt/hellolibvirt.o 139:23: note: expanded from macro '_GL_EXTERN_C' # define _GL_EXTERN_C extern ^ 5 errors generated. gmake[2]: *** [Makefile:2411: dommigrate/dommigrate.o] Error 1 gmake[2]: *** Waiting for unfinished jobs.... In file included from ../../examples/hellolibvirt/hellolibvirt.c:6: In file included from ../gnulib/lib/stdlib.h:100: ../gnulib/lib/unistd.h:618:3: error: "Please include config.h first." #error "Please include config.h first." ^ ../gnulib/lib/unistd.h:620:1: error: unknown type name '_GL_INLINE_HEADER_BEGIN' _GL_INLINE_HEADER_BEGIN ^ ../gnulib/lib/unistd.h:762:1: error: expected identifier or '(' _GL_CXXALIAS_SYS (chown, int, (const char *file, uid_t uid, gid_t gid)); ^ ../gnulib/lib/time.h:247:5: note: expanded from macro '_GL_CXXALIAS_SYS' _GL_EXTERN_C int _gl_cxxalias_dummy ^ ../gnulib/lib/time.h:139:23: note: expanded from macro '_GL_EXTERN_C' # define _GL_EXTERN_C extern ^ In file included from ../../examples/hellolibvirt/hellolibvirt.c:6: In file included from ../gnulib/lib/stdlib.h:100: ../gnulib/lib/unistd.h:2138:1: error: unknown type name '_GL_INLINE_HEADER_END' _GL_INLINE_HEADER_END ^ In file included from ../../examples/hellolibvirt/hellolibvirt.c:6: ../gnulib/lib/stdlib.h:665:1: error: expected identifier or '(' _GL_CXXALIAS_SYS (calloc, void *, (size_t nmemb, size_t size)); ^ ../gnulib/lib/time.h:247:5: note: expanded from macro '_GL_CXXALIAS_SYS' _GL_EXTERN_C int _gl_cxxalias_dummy ^ ../gnulib/lib/time.h:139:23: note: expanded from macro '_GL_EXTERN_C' # define _GL_EXTERN_C extern ^ 5 errors generated. gmake[2]: *** [Makefile:2411: hellolibvirt/hellolibvirt.o] Error 1 gmake[2]: Leaving directory '/usr<https://ci.centos.org/job/libvirt-build/systems=libvirt-freebsd-12/ws/build…'> gmake[1]: *** [Makefile:2130: all-recursive] Error 1 gmake[1]: Leaving directory '/usr<https://ci.centos.org/job/libvirt-build/systems=libvirt-freebsd-12/ws/build'> gmake: *** [Makefile:2023: all] Error 2 Build step 'Execute shell' marked build as failure
1 6
0 0
[Libvirt-ci] Fixed: libvirt/libvirt#1892 (master - b6f7825)
by Travis CI 07 Jan '19

07 Jan '19
Build Update for libvirt/libvirt ------------------------------------- Build: #1892 Status: Fixed Duration: 20 mins and 32 secs Commit: b6f7825 (master) Author: Ján Tomko Message: examples: include config.h Since gnulib commit 6954995d unistd.h is included via stdlib.h on BSD systems, which requires config.h to be included first. Add config.h to the files that use it. Part of this commit reverts commit 6ee918de7462a20947241ec817c4571d6b84a716 Signed-off-by: Ján Tomko <jtomko(a)redhat.com> Reviewed-by: Erik Skultety <eskultet(a)redhat.com> View the changeset: https://github.com/libvirt/libvirt/compare/99c33a7cbf7f...b6f7825992fc View the full build log and details: https://travis-ci.org/libvirt/libvirt/builds/476251089?utm_medium=notificat… -- You can unsubscribe from build emails from the libvirt/libvirt repository going to https://travis-ci.org/account/preferences/unsubscribe?repository=4872032&ut…. Or unsubscribe from *all* email updating your settings at https://travis-ci.org/account/preferences/unsubscribe?utm_medium=notificati…. Or configure specific recipients for build notifications in your .travis.yml file. See https://docs.travis-ci.com/user/notifications.
1 0
0 0
[Libvirt-ci] Still Failing: libvirt/libvirt#1891 (master - 99c33a7)
by Travis CI 04 Jan '19

04 Jan '19
Build Update for libvirt/libvirt ------------------------------------- Build: #1891 Status: Still Failing Duration: 20 mins and 42 secs Commit: 99c33a7 (master) Author: Eric Blake Message: maint: cfg.mk typo fix Signed-off-by: Eric Blake <eblake(a)redhat.com> View the changeset: https://github.com/libvirt/libvirt/compare/87b4e1cd7e7e...99c33a7cbf7f View the full build log and details: https://travis-ci.org/libvirt/libvirt/builds/475366430?utm_medium=notificat… -- You can unsubscribe from build emails from the libvirt/libvirt repository going to https://travis-ci.org/account/preferences/unsubscribe?repository=4872032&ut…. Or unsubscribe from *all* email updating your settings at https://travis-ci.org/account/preferences/unsubscribe?utm_medium=notificati…. Or configure specific recipients for build notifications in your .travis.yml file. See https://docs.travis-ci.com/user/notifications.
1 0
0 0
[Libvirt-ci] Still Failing: libvirt/libvirt#1890 (master - 87b4e1c)
by Travis CI 04 Jan '19

04 Jan '19
Build Update for libvirt/libvirt ------------------------------------- Build: #1890 Status: Still Failing Duration: 19 mins and 49 secs Commit: 87b4e1c (master) Author: Erik Skultety Message: docs: schemas: Decouple the virtio options from each other Currently, all of the VirtioOptions are under a single <optional> element, however, neither our parser/formatter or QEMU driver requires the presence of all the options if only a single one from the set has been specified, so fix it and silence the schema validator. Signed-off-by: Erik Skultety <eskultet(a)redhat.com> Reviewed-by: Ján Tomko <jtomko(a)redhat.com> View the changeset: https://github.com/libvirt/libvirt/compare/c99e954973ea...87b4e1cd7e7e View the full build log and details: https://travis-ci.org/libvirt/libvirt/builds/475314956?utm_medium=notificat… -- You can unsubscribe from build emails from the libvirt/libvirt repository going to https://travis-ci.org/account/preferences/unsubscribe?repository=4872032&ut…. Or unsubscribe from *all* email updating your settings at https://travis-ci.org/account/preferences/unsubscribe?utm_medium=notificati…. Or configure specific recipients for build notifications in your .travis.yml file. See https://docs.travis-ci.com/user/notifications.
1 0
0 0
[Libvirt-ci] Still Failing: libvirt/libvirt#1889 (master - c99e954)
by Travis CI 03 Jan '19

03 Jan '19
Build Update for libvirt/libvirt ------------------------------------- Build: #1889 Status: Still Failing Duration: 20 mins and 21 secs Commit: c99e954 (master) Author: Michal Privoznik Message: Remove even more Author(s): lines from source files In 600462834f4ec1955a9a4 we've tried to remove Author(s): lines from comments at the beginning of our source files. Well, in some files while we removed the "Author" line we did not remove the actual list of authors. Signed-off-by: Michal Privoznik <mprivozn(a)redhat.com> Reviewed-by: Erik Skultety <eskultet(a)redhat.com> View the changeset: https://github.com/libvirt/libvirt/compare/3af2c5ddad04...c99e954973ea View the full build log and details: https://travis-ci.org/libvirt/libvirt/builds/474832971?utm_medium=notificat… -- You can unsubscribe from build emails from the libvirt/libvirt repository going to https://travis-ci.org/account/preferences/unsubscribe?repository=4872032&ut…. Or unsubscribe from *all* email updating your settings at https://travis-ci.org/account/preferences/unsubscribe?utm_medium=notificati…. Or configure specific recipients for build notifications in your .travis.yml file. See https://docs.travis-ci.com/user/notifications.
1 0
0 0
  • ← Newer
  • 1
  • 2
  • 3
  • 4
  • 5
  • 6
  • 7
  • 8
  • 9
  • 10
  • Older →

HyperKitty Powered by HyperKitty version 1.3.12.