libvirt List Archives
Sign In Sign Up
Manage this list Sign In Sign Up

Keyboard Shortcuts

Thread View

  • j: Next unread message
  • k: Previous unread message
  • j a: Jump to all threads
  • j l: Jump to MailingList overview

CI

Thread Start a new thread
Download
Threads by month
  • ----- 2025 -----
  • August
  • July
  • June
  • May
  • April
  • March
  • February
  • January
  • ----- 2024 -----
  • December
  • November
  • October
  • September
  • August
  • July
  • June
  • May
  • April
  • March
  • February
  • January
  • ----- 2023 -----
  • December
  • November
  • October
  • September
  • August
  • July
  • June
  • May
  • April
  • March
  • February
  • January
  • ----- 2022 -----
  • December
  • November
  • October
  • September
  • August
  • July
  • June
  • May
  • April
  • March
  • February
  • January
  • ----- 2021 -----
  • December
  • November
  • October
  • September
  • August
  • July
  • June
  • May
  • April
  • March
  • February
  • January
  • ----- 2020 -----
  • December
  • November
  • October
  • September
  • August
  • July
  • June
  • May
  • April
  • March
  • February
  • January
  • ----- 2019 -----
  • December
  • November
  • October
  • September
  • August
  • July
  • June
  • May
  • April
  • March
  • February
  • January
  • ----- 2018 -----
  • December
  • November
  • October
  • September
  • August
  • July
  • June
  • May
  • April
  • March
  • February
  • January
  • ----- 2017 -----
  • December
  • November
  • October
  • September
  • August
  • July
  • June
  • May
  • April
  • March
  • February
  • January
  • ----- 2016 -----
  • December
  • November
  • October
  • September
  • August
  • July
ci@lists.libvirt.org

January 2019

  • 2 participants
  • 93 discussions
[Libvirt-ci] Build failed in Jenkins: libvirt-go-check » libvirt-freebsd-12 #211
by ci@centos.org 31 Jan '19

31 Jan '19
See <https://ci.centos.org/job/libvirt-go-check/systems=libvirt-freebsd-12/211/d…> ------------------------------------------ Started by upstream project "libvirt-go-check" build number 211 originally caused by: Started by upstream project "libvirt-go-build" build number 215 originally caused by: Started by an SCM change Started by an SCM change Started by upstream project "libvirt-build" build number 273 originally caused by: Started by an SCM change Started by an SCM change Started by an SCM change Started by an SCM change Started by an SCM change [EnvInject] - Loading node environment variables. Building remotely on libvirt-freebsd-12 (libvirt) in workspace <https://ci.centos.org/job/libvirt-go-check/systems=libvirt-freebsd-12/ws/> [libvirt-go] $ /bin/sh -xe /tmp/jenkins8929449891817639621.sh + export 'TEST_ARGS=-tags api' + go test -tags api Missing function 'virTypedParamsClear' Missing macro 'VIR_TYPED_PARAM_FIELD_LENGTH' Missing enum 'VIR_TYPED_PARAM_BOOLEAN' Missing enum 'VIR_TYPED_PARAM_DOUBLE' Missing enum 'VIR_TYPED_PARAM_INT' Missing enum 'VIR_TYPED_PARAM_LLONG' Missing enum 'VIR_TYPED_PARAM_STRING' Missing enum 'VIR_TYPED_PARAM_UINT' Missing enum 'VIR_TYPED_PARAM_ULLONG' --- FAIL: TestAPICoverage (1.04s) panic: Missing symbols found [recovered] panic: Missing symbols found goroutine 18 [running]: testing.tRunner.func1(0xc0000c8100) /usr/local/go/src/testing/testing.go:792 +0x387 panic(0x222880, 0x28f120) /usr/local/go/src/runtime/panic.go:513 +0x1b9 _/usr<https://ci.centos.org/job/libvirt-go-check/systems=libvirt-freebsd-12/ws/.T…> /usr<https://ci.centos.org/job/libvirt-go-check/systems=libvirt-freebsd-12/ws/ap…>:507 +0x554 testing.tRunner(0xc0000c8100, 0x270740) /usr/local/go/src/testing/testing.go:827 +0xbf created by testing.(*T).Run /usr/local/go/src/testing/testing.go:878 +0x35c exit status 2 FAIL _/usr<https://ci.centos.org/job/libvirt-go-check/systems=libvirt-freebsd-12/ws/> 1.228s Build step 'Execute shell' marked build as failure
1 1
0 0
[Libvirt-ci] Build failed in Jenkins: libvirt-go-xml-check » libvirt-fedora-rawhide #213
by ci@centos.org 31 Jan '19

31 Jan '19
See <https://ci.centos.org/job/libvirt-go-xml-check/systems=libvirt-fedora-rawhi…> ------------------------------------------ Started by upstream project "libvirt-go-xml-check" build number 213 originally caused by: Started by upstream project "libvirt-go-xml-build" build number 213 originally caused by: Started by upstream project "libvirt-build" build number 271 originally caused by: Started by user Libvirt [EnvInject] - Loading node environment variables. Building remotely on libvirt-fedora-rawhide (libvirt) in workspace <https://ci.centos.org/job/libvirt-go-xml-check/systems=libvirt-fedora-rawhi…> [libvirt-go-xml] $ /bin/sh -xe /tmp/jenkins2682425562486964009.sh + export 'TEST_ARGS=-tags xmlroundtrip' + TEST_ARGS='-tags xmlroundtrip' + go test -tags xmlroundtrip --- FAIL: TestRoundTrip (13.73s) xml_test.go:400: testdata/libvirt/tests/bhyvexml2argvdata/bhyvexml2argv-commandline.xml: /domain[0]/commandline(http://libvirt.org/schemas/domain/bhyve/1.0)[0]: element in expected XML missing in actual XML FAIL exit status 1 FAIL _<https://ci.centos.org/job/libvirt-go-xml-check/systems=libvirt-fedora-rawhi…> 14.020s Build step 'Execute shell' marked build as failure
1 2
0 0
[Libvirt-ci] Build failed in Jenkins: libvirt-go-xml-check » libvirt-freebsd-11 #213
by ci@centos.org 31 Jan '19

31 Jan '19
See <https://ci.centos.org/job/libvirt-go-xml-check/systems=libvirt-freebsd-11/2…> ------------------------------------------ Started by upstream project "libvirt-go-xml-check" build number 213 originally caused by: Started by upstream project "libvirt-go-xml-build" build number 213 originally caused by: Started by upstream project "libvirt-build" build number 271 originally caused by: Started by user Libvirt [EnvInject] - Loading node environment variables. Building remotely on libvirt-freebsd-11 (libvirt) in workspace <https://ci.centos.org/job/libvirt-go-xml-check/systems=libvirt-freebsd-11/w…> [libvirt-go-xml] $ /bin/sh -xe /tmp/jenkins3865902578682486248.sh + export 'TEST_ARGS=-tags xmlroundtrip' + go test -tags xmlroundtrip --- FAIL: TestRoundTrip (18.37s) xml_test.go:400: testdata/libvirt/tests/bhyvexml2argvdata/bhyvexml2argv-commandline.xml: /domain[0]/commandline(http://libvirt.org/schemas/domain/bhyve/1.0)[0]: element in expected XML missing in actual XML FAIL exit status 1 FAIL _/usr<https://ci.centos.org/job/libvirt-go-xml-check/systems=libvirt-freebsd-11/w…> 18.485s Build step 'Execute shell' marked build as failure
1 2
0 0
[Libvirt-ci] Build failed in Jenkins: libvirt-go-xml-check » libvirt-freebsd-12 #213
by ci@centos.org 31 Jan '19

31 Jan '19
See <https://ci.centos.org/job/libvirt-go-xml-check/systems=libvirt-freebsd-12/2…> ------------------------------------------ Started by upstream project "libvirt-go-xml-check" build number 213 originally caused by: Started by upstream project "libvirt-go-xml-build" build number 213 originally caused by: Started by upstream project "libvirt-build" build number 271 originally caused by: Started by user Libvirt [EnvInject] - Loading node environment variables. Building remotely on libvirt-freebsd-12 (libvirt) in workspace <https://ci.centos.org/job/libvirt-go-xml-check/systems=libvirt-freebsd-12/w…> [libvirt-go-xml] $ /bin/sh -xe /tmp/jenkins92320064805734336.sh + export 'TEST_ARGS=-tags xmlroundtrip' + go test -tags xmlroundtrip --- FAIL: TestRoundTrip (12.85s) xml_test.go:400: testdata/libvirt/tests/bhyvexml2argvdata/bhyvexml2argv-commandline.xml: /domain[0]/commandline(http://libvirt.org/schemas/domain/bhyve/1.0)[0]: element in expected XML missing in actual XML FAIL exit status 1 FAIL _/usr<https://ci.centos.org/job/libvirt-go-xml-check/systems=libvirt-freebsd-12/w…> 12.938s Build step 'Execute shell' marked build as failure
1 2
0 0
[Libvirt-ci] Build failed in Jenkins: libvirt-go-xml-check » libvirt-fedora-28 #213
by ci@centos.org 31 Jan '19

31 Jan '19
See <https://ci.centos.org/job/libvirt-go-xml-check/systems=libvirt-fedora-28/21…> ------------------------------------------ Started by upstream project "libvirt-go-xml-check" build number 213 originally caused by: Started by upstream project "libvirt-go-xml-build" build number 213 originally caused by: Started by upstream project "libvirt-build" build number 271 originally caused by: Started by user Libvirt [EnvInject] - Loading node environment variables. Building remotely on libvirt-fedora-28 (libvirt) in workspace <https://ci.centos.org/job/libvirt-go-xml-check/systems=libvirt-fedora-28/ws/> [libvirt-go-xml] $ /bin/sh -xe /tmp/jenkins7610820812962806812.sh + export 'TEST_ARGS=-tags xmlroundtrip' + TEST_ARGS='-tags xmlroundtrip' + go test -tags xmlroundtrip --- FAIL: TestRoundTrip (13.49s) xml_test.go:400: testdata/libvirt/tests/bhyvexml2argvdata/bhyvexml2argv-commandline.xml: /domain[0]/commandline(http://libvirt.org/schemas/domain/bhyve/1.0)[0]: element in expected XML missing in actual XML FAIL exit status 1 FAIL _<https://ci.centos.org/job/libvirt-go-xml-check/systems=libvirt-fedora-28/ws/> 13.704s Build step 'Execute shell' marked build as failure
1 2
0 0
[Libvirt-ci] Build failed in Jenkins: libvirt-go-xml-check » libvirt-debian-9 #213
by ci@centos.org 31 Jan '19

31 Jan '19
See <https://ci.centos.org/job/libvirt-go-xml-check/systems=libvirt-debian-9/213…> ------------------------------------------ Started by upstream project "libvirt-go-xml-check" build number 213 originally caused by: Started by upstream project "libvirt-go-xml-build" build number 213 originally caused by: Started by upstream project "libvirt-build" build number 271 originally caused by: Started by user Libvirt [EnvInject] - Loading node environment variables. Building remotely on libvirt-debian-9 (libvirt) in workspace <https://ci.centos.org/job/libvirt-go-xml-check/systems=libvirt-debian-9/ws/> [libvirt-go-xml] $ /bin/sh -xe /tmp/jenkins6683594154421397870.sh + export TEST_ARGS=-tags xmlroundtrip + go test -tags xmlroundtrip --- FAIL: TestRoundTrip (32.32s) xml_test.go:400: testdata/libvirt/tests/bhyvexml2argvdata/bhyvexml2argv-commandline.xml: /domain[0]/commandline(http://libvirt.org/schemas/domain/bhyve/1.0)[0]: element in expected XML missing in actual XML FAIL exit status 1 FAIL _<https://ci.centos.org/job/libvirt-go-xml-check/systems=libvirt-debian-9/ws/> 32.519s Build step 'Execute shell' marked build as failure
1 2
0 0
[Libvirt-ci] Build failed in Jenkins: libvirt-go-xml-check » libvirt-fedora-29 #213
by ci@centos.org 31 Jan '19

31 Jan '19
See <https://ci.centos.org/job/libvirt-go-xml-check/systems=libvirt-fedora-29/21…> ------------------------------------------ Started by upstream project "libvirt-go-xml-check" build number 213 originally caused by: Started by upstream project "libvirt-go-xml-build" build number 213 originally caused by: Started by upstream project "libvirt-build" build number 271 originally caused by: Started by user Libvirt [EnvInject] - Loading node environment variables. Building remotely on libvirt-fedora-29 (libvirt) in workspace <https://ci.centos.org/job/libvirt-go-xml-check/systems=libvirt-fedora-29/ws/> [libvirt-go-xml] $ /bin/sh -xe /tmp/jenkins8514743185859328974.sh + export 'TEST_ARGS=-tags xmlroundtrip' + TEST_ARGS='-tags xmlroundtrip' + go test -tags xmlroundtrip --- FAIL: TestRoundTrip (12.21s) xml_test.go:400: testdata/libvirt/tests/bhyvexml2argvdata/bhyvexml2argv-commandline.xml: /domain[0]/commandline(http://libvirt.org/schemas/domain/bhyve/1.0)[0]: element in expected XML missing in actual XML FAIL exit status 1 FAIL _<https://ci.centos.org/job/libvirt-go-xml-check/systems=libvirt-fedora-29/ws/> 12.328s Build step 'Execute shell' marked build as failure
1 2
0 0
[Libvirt-ci] Build failed in Jenkins: libvirt-go-xml-check » libvirt-debian-8 #213
by ci@centos.org 31 Jan '19

31 Jan '19
See <https://ci.centos.org/job/libvirt-go-xml-check/systems=libvirt-debian-8/213…> ------------------------------------------ Started by upstream project "libvirt-go-xml-check" build number 213 originally caused by: Started by upstream project "libvirt-go-xml-build" build number 213 originally caused by: Started by upstream project "libvirt-build" build number 271 originally caused by: Started by user Libvirt [EnvInject] - Loading node environment variables. Building remotely on libvirt-debian-8 (libvirt) in workspace <https://ci.centos.org/job/libvirt-go-xml-check/systems=libvirt-debian-8/ws/> [libvirt-go-xml] $ /bin/sh -xe /tmp/jenkins4807915870884113426.sh + export TEST_ARGS=-tags xmlroundtrip + go test -tags xmlroundtrip --- FAIL: TestRoundTrip (17.59s) xml_test.go:400: testdata/libvirt/tests/bhyvexml2argvdata/bhyvexml2argv-commandline.xml: /domain[0]/commandline(http://libvirt.org/schemas/domain/bhyve/1.0)[0]: element in expected XML missing in actual XML FAIL exit status 1 FAIL _<https://ci.centos.org/job/libvirt-go-xml-check/systems=libvirt-debian-8/ws/> 17.725s Build step 'Execute shell' marked build as failure
1 2
0 0
[Libvirt-ci] Build failed in Jenkins: virt-manager-build » libvirt-freebsd-11 #369
by ci@centos.org 30 Jan '19

30 Jan '19
See <https://ci.centos.org/job/virt-manager-build/systems=libvirt-freebsd-11/369…> Changes: [crobinso] Move tests/pylint.cfg to pylintrc [crobinso] Move tests.pycodestyle.cfg to setup.cfg [crobinso] pycodestyle: Only use format=pylint from setup.py ------------------------------------------ Started by upstream project "virt-manager-build" build number 369 originally caused by: Started by an SCM change [EnvInject] - Loading node environment variables. Building remotely on libvirt-freebsd-11 (libvirt) in workspace <https://ci.centos.org/job/virt-manager-build/systems=libvirt-freebsd-11/ws/> > git rev-parse --is-inside-work-tree # timeout=10 Fetching changes from the remote Git repository > git config remote.origin.url https://github.com/virt-manager/virt-manager.git # timeout=10 Fetching upstream changes from https://github.com/virt-manager/virt-manager.git > git --version # timeout=10 > git fetch --tags --progress https://github.com/virt-manager/virt-manager.git +refs/heads/*:refs/remotes/origin/* Checking out Revision a9f818b44b5066b918e2f90ff3027b3c8d7646cb (refs/remotes/origin/master) > git config core.sparsecheckout # timeout=10 > git checkout -f a9f818b44b5066b918e2f90ff3027b3c8d7646cb Commit message: "pycodestyle: Only use format=pylint from setup.py" > git rev-list --no-walk fe2564530a828dd8fef2ea9641c962b39f3713a2 # timeout=10 Cleaning workspace > git rev-parse --verify HEAD # timeout=10 Resetting working tree > git reset --hard # timeout=10 > git clean -fdx # timeout=10 [virt-manager] $ /bin/sh -xe /tmp/jenkins3548483970749401990.sh + /usr/local/bin/python3 ./setup.py configure '--prefix=/home/jenkins/build/libvirt' Traceback (most recent call last): File "./setup.py", line 713, in <module> distclass=VMMDistribution, File "/usr/local/lib/python3.6/distutils/core.py", line 121, in setup dist.parse_config_files() File "/usr/local/lib/python3.6/distutils/dist.py", line 395, in parse_config_files parser.read(filename) File "/usr/local/lib/python3.6/configparser.py", line 697, in read self._read(fp, filename) File "/usr/local/lib/python3.6/configparser.py", line 1015, in _read for lineno, line in enumerate(fp, start=1): File "/usr/local/lib/python3.6/encodings/ascii.py", line 26, in decode return codecs.ascii_decode(input, self.errors)[0] UnicodeDecodeError: 'ascii' codec can't decode byte 0xe2 in position 569: ordinal not in range(128) Build step 'Execute shell' marked build as failure
1 1
0 0
[Libvirt-ci] Build failed in Jenkins: virt-manager-build » libvirt-freebsd-12 #369
by ci@centos.org 30 Jan '19

30 Jan '19
See <https://ci.centos.org/job/virt-manager-build/systems=libvirt-freebsd-12/369…> Changes: [crobinso] Move tests/pylint.cfg to pylintrc [crobinso] Move tests.pycodestyle.cfg to setup.cfg [crobinso] pycodestyle: Only use format=pylint from setup.py ------------------------------------------ Started by upstream project "virt-manager-build" build number 369 originally caused by: Started by an SCM change [EnvInject] - Loading node environment variables. Building remotely on libvirt-freebsd-12 (libvirt) in workspace <https://ci.centos.org/job/virt-manager-build/systems=libvirt-freebsd-12/ws/> > git rev-parse --is-inside-work-tree # timeout=10 Fetching changes from the remote Git repository > git config remote.origin.url https://github.com/virt-manager/virt-manager.git # timeout=10 Fetching upstream changes from https://github.com/virt-manager/virt-manager.git > git --version # timeout=10 > git fetch --tags --progress https://github.com/virt-manager/virt-manager.git +refs/heads/*:refs/remotes/origin/* Checking out Revision a9f818b44b5066b918e2f90ff3027b3c8d7646cb (refs/remotes/origin/master) > git config core.sparsecheckout # timeout=10 > git checkout -f a9f818b44b5066b918e2f90ff3027b3c8d7646cb Commit message: "pycodestyle: Only use format=pylint from setup.py" > git rev-list --no-walk fe2564530a828dd8fef2ea9641c962b39f3713a2 # timeout=10 Cleaning workspace > git rev-parse --verify HEAD # timeout=10 Resetting working tree > git reset --hard # timeout=10 > git clean -fdx # timeout=10 [virt-manager] $ /bin/sh -xe /tmp/jenkins2267809265353908929.sh + /usr/local/bin/python3 ./setup.py configure '--prefix=/home/jenkins/build/libvirt' Traceback (most recent call last): File "./setup.py", line 713, in <module> distclass=VMMDistribution, File "/usr/local/lib/python3.6/distutils/core.py", line 121, in setup dist.parse_config_files() File "/usr/local/lib/python3.6/distutils/dist.py", line 395, in parse_config_files parser.read(filename) File "/usr/local/lib/python3.6/configparser.py", line 697, in read self._read(fp, filename) File "/usr/local/lib/python3.6/configparser.py", line 1015, in _read for lineno, line in enumerate(fp, start=1): File "/usr/local/lib/python3.6/encodings/ascii.py", line 26, in decode return codecs.ascii_decode(input, self.errors)[0] UnicodeDecodeError: 'ascii' codec can't decode byte 0xe2 in position 569: ordinal not in range(128) Build step 'Execute shell' marked build as failure
1 1
0 0
  • ← Newer
  • 1
  • 2
  • 3
  • 4
  • 5
  • 6
  • 7
  • 8
  • 9
  • 10
  • Older →

HyperKitty Powered by HyperKitty version 1.3.12.