libvirt List Archives
Sign In Sign Up
Manage this list Sign In Sign Up

Keyboard Shortcuts

Thread View

  • j: Next unread message
  • k: Previous unread message
  • j a: Jump to all threads
  • j l: Jump to MailingList overview

CI

Thread Start a new thread
Download
Threads by month
  • ----- 2025 -----
  • August
  • July
  • June
  • May
  • April
  • March
  • February
  • January
  • ----- 2024 -----
  • December
  • November
  • October
  • September
  • August
  • July
  • June
  • May
  • April
  • March
  • February
  • January
  • ----- 2023 -----
  • December
  • November
  • October
  • September
  • August
  • July
  • June
  • May
  • April
  • March
  • February
  • January
  • ----- 2022 -----
  • December
  • November
  • October
  • September
  • August
  • July
  • June
  • May
  • April
  • March
  • February
  • January
  • ----- 2021 -----
  • December
  • November
  • October
  • September
  • August
  • July
  • June
  • May
  • April
  • March
  • February
  • January
  • ----- 2020 -----
  • December
  • November
  • October
  • September
  • August
  • July
  • June
  • May
  • April
  • March
  • February
  • January
  • ----- 2019 -----
  • December
  • November
  • October
  • September
  • August
  • July
  • June
  • May
  • April
  • March
  • February
  • January
  • ----- 2018 -----
  • December
  • November
  • October
  • September
  • August
  • July
  • June
  • May
  • April
  • March
  • February
  • January
  • ----- 2017 -----
  • December
  • November
  • October
  • September
  • August
  • July
  • June
  • May
  • April
  • March
  • February
  • January
  • ----- 2016 -----
  • December
  • November
  • October
  • September
  • August
  • July
ci@lists.libvirt.org

June 2018

  • 2 participants
  • 248 discussions
[Libvirt-ci] Passed: libvirt/libvirt#1410 (v4.5.0-rc2 - cb7a4ac)
by Travis CI 29 Jun '18

29 Jun '18
Build Update for libvirt/libvirt ------------------------------------- Build: #1410 Status: Passed Duration: 20 mins and 13 secs Commit: cb7a4ac (v4.5.0-rc2) Author: Michal Privoznik Message: qemu: Allow cachetune only for KVM domains https://bugzilla.redhat.com/show_bug.cgi?id=1541921 In TCG mode, there are no vCPU threads and thus there's nothing to be placed into resctrl group. Forbid such configuration. Signed-off-by: Michal Privoznik <mprivozn(a)redhat.com> Reviewed-by: Daniel P. Berrangé <berrange(a)redhat.com> View the changeset: https://github.com/libvirt/libvirt/compare/v4.5.0-rc2 View the full build log and details: https://travis-ci.org/libvirt/libvirt/builds/398421027?utm_source=email&utm… -- You can configure recipients for build notifications in your .travis.yml file. See https://docs.travis-ci.com/user/notifications This email was sent to libvirt-ci(a)redhat.com (mailto:libvirt-ci@redhat.com) unsubscribe from this list (http://clicks.travis-ci.com/track/unsub.php?u=14313403&id=a4a115aec4014df2b…)
1 0
0 0
[Libvirt-ci] Build failed in Jenkins: libvirt-go-xml-master-check » libvirt-freebsd-10 #481
by ci@centos.org 29 Jun '18

29 Jun '18
See <https://ci.centos.org/job/libvirt-go-xml-master-check/systems=libvirt-freeb…> ------------------------------------------ Started by upstream project "libvirt-go-xml-master-check" build number 481 originally caused by: Started by upstream project "libvirt-go-xml-master-build" build number 490 originally caused by: Started by upstream project "libvirt-master-build" build number 1541 originally caused by: Started by an SCM change [EnvInject] - Loading node environment variables. Building remotely on libvirt-freebsd-10 (libvirt) in workspace <https://ci.centos.org/job/libvirt-go-xml-master-check/systems=libvirt-freeb…> [libvirt-go-xml-master] $ /bin/sh -xe /tmp/jenkins9014704720376830459.sh + export 'TEST_ARGS=-tags xmlroundtrip' + go test -tags xmlroundtrip --- FAIL: TestRoundTrip (12.13s) xml_test.go:383: testdata/libvirt/tests/storagevolxml2xmlin/vol-luks-convert.xml: /volume[0]/source[0]: element in expected XML missing in actual XML FAIL exit status 1 FAIL _/usr<https://ci.centos.org/job/libvirt-go-xml-master-check/systems=libvirt-freeb…> 12.214s Build step 'Execute shell' marked build as failure
1 9
0 0
[Libvirt-ci] Build failed in Jenkins: libvirt-go-xml-master-check » libvirt-freebsd-11 #481
by ci@centos.org 29 Jun '18

29 Jun '18
See <https://ci.centos.org/job/libvirt-go-xml-master-check/systems=libvirt-freeb…> ------------------------------------------ Started by upstream project "libvirt-go-xml-master-check" build number 481 originally caused by: Started by upstream project "libvirt-go-xml-master-build" build number 490 originally caused by: Started by upstream project "libvirt-master-build" build number 1541 originally caused by: Started by an SCM change [EnvInject] - Loading node environment variables. Building remotely on libvirt-freebsd-11 (libvirt) in workspace <https://ci.centos.org/job/libvirt-go-xml-master-check/systems=libvirt-freeb…> [libvirt-go-xml-master] $ /bin/sh -xe /tmp/jenkins4964880344260760465.sh + export 'TEST_ARGS=-tags xmlroundtrip' + go test -tags xmlroundtrip --- FAIL: TestRoundTrip (12.48s) xml_test.go:383: testdata/libvirt/tests/storagevolxml2xmlin/vol-luks-convert.xml: /volume[0]/source[0]: element in expected XML missing in actual XML FAIL exit status 1 FAIL _/usr<https://ci.centos.org/job/libvirt-go-xml-master-check/systems=libvirt-freeb…> 12.584s Build step 'Execute shell' marked build as failure
1 9
0 0
[Libvirt-ci] Build failed in Jenkins: libvirt-go-xml-master-check » libvirt-fedora-rawhide #481
by ci@centos.org 29 Jun '18

29 Jun '18
See <https://ci.centos.org/job/libvirt-go-xml-master-check/systems=libvirt-fedor…> ------------------------------------------ Started by upstream project "libvirt-go-xml-master-check" build number 481 originally caused by: Started by upstream project "libvirt-go-xml-master-build" build number 490 originally caused by: Started by upstream project "libvirt-master-build" build number 1541 originally caused by: Started by an SCM change [EnvInject] - Loading node environment variables. Building remotely on libvirt-fedora-rawhide (libvirt) in workspace <https://ci.centos.org/job/libvirt-go-xml-master-check/systems=libvirt-fedor…> [libvirt-go-xml-master] $ /bin/sh -xe /tmp/jenkins2553979069557758837.sh + export 'TEST_ARGS=-tags xmlroundtrip' + TEST_ARGS='-tags xmlroundtrip' + go test -tags xmlroundtrip --- FAIL: TestRoundTrip (8.29s) xml_test.go:383: testdata/libvirt/tests/storagevolxml2xmlin/vol-luks-convert.xml: /volume[0]/source[0]: element in expected XML missing in actual XML FAIL exit status 1 FAIL _<https://ci.centos.org/job/libvirt-go-xml-master-check/systems=libvirt-fedor…> 8.346s Build step 'Execute shell' marked build as failure
1 9
0 0
[Libvirt-ci] Build failed in Jenkins: libvirt-go-xml-master-check » libvirt-fedora-28 #481
by ci@centos.org 29 Jun '18

29 Jun '18
See <https://ci.centos.org/job/libvirt-go-xml-master-check/systems=libvirt-fedor…> ------------------------------------------ Started by upstream project "libvirt-go-xml-master-check" build number 481 originally caused by: Started by upstream project "libvirt-go-xml-master-build" build number 490 originally caused by: Started by upstream project "libvirt-master-build" build number 1541 originally caused by: Started by an SCM change [EnvInject] - Loading node environment variables. Building remotely on libvirt-fedora-28 (libvirt) in workspace <https://ci.centos.org/job/libvirt-go-xml-master-check/systems=libvirt-fedor…> [libvirt-go-xml-master] $ /bin/sh -xe /tmp/jenkins7462683230365891476.sh + export 'TEST_ARGS=-tags xmlroundtrip' + TEST_ARGS='-tags xmlroundtrip' + go test -tags xmlroundtrip --- FAIL: TestRoundTrip (30.53s) xml_test.go:383: testdata/libvirt/tests/storagevolxml2xmlin/vol-luks-convert.xml: /volume[0]/source[0]: element in expected XML missing in actual XML FAIL exit status 1 FAIL _<https://ci.centos.org/job/libvirt-go-xml-master-check/systems=libvirt-fedor…> 30.692s Build step 'Execute shell' marked build as failure
1 9
0 0
[Libvirt-ci] Build failed in Jenkins: libvirt-go-xml-master-check » libvirt-centos-7 #481
by ci@centos.org 29 Jun '18

29 Jun '18
See <https://ci.centos.org/job/libvirt-go-xml-master-check/systems=libvirt-cento…> ------------------------------------------ Started by upstream project "libvirt-go-xml-master-check" build number 481 originally caused by: Started by upstream project "libvirt-go-xml-master-build" build number 490 originally caused by: Started by upstream project "libvirt-master-build" build number 1541 originally caused by: Started by an SCM change [EnvInject] - Loading node environment variables. Building remotely on libvirt-centos-7 (libvirt) in workspace <https://ci.centos.org/job/libvirt-go-xml-master-check/systems=libvirt-cento…> [libvirt-go-xml-master] $ /bin/sh -xe /tmp/jenkins8812056205481219580.sh + export 'TEST_ARGS=-tags xmlroundtrip' + TEST_ARGS='-tags xmlroundtrip' + go test -tags xmlroundtrip --- FAIL: TestRoundTrip (42.59s) xml_test.go:383: testdata/libvirt/tests/storagevolxml2xmlin/vol-luks-convert.xml: /volume[0]/source[0]: element in expected XML missing in actual XML FAIL exit status 1 FAIL _<https://ci.centos.org/job/libvirt-go-xml-master-check/systems=libvirt-cento…> 42.739s Build step 'Execute shell' marked build as failure
1 9
0 0
[Libvirt-ci] Build failed in Jenkins: libvirt-go-xml-master-check » libvirt-debian-9 #481
by ci@centos.org 29 Jun '18

29 Jun '18
See <https://ci.centos.org/job/libvirt-go-xml-master-check/systems=libvirt-debia…> ------------------------------------------ Started by upstream project "libvirt-go-xml-master-check" build number 481 originally caused by: Started by upstream project "libvirt-go-xml-master-build" build number 490 originally caused by: Started by upstream project "libvirt-master-build" build number 1541 originally caused by: Started by an SCM change [EnvInject] - Loading node environment variables. Building remotely on libvirt-debian-9 (libvirt) in workspace <https://ci.centos.org/job/libvirt-go-xml-master-check/systems=libvirt-debia…> [libvirt-go-xml-master] $ /bin/sh -xe /tmp/jenkins6101205843944373965.sh + export TEST_ARGS=-tags xmlroundtrip + go test -tags xmlroundtrip --- FAIL: TestRoundTrip (29.76s) xml_test.go:383: testdata/libvirt/tests/storagevolxml2xmlin/vol-luks-convert.xml: /volume[0]/source[0]: element in expected XML missing in actual XML FAIL exit status 1 FAIL _<https://ci.centos.org/job/libvirt-go-xml-master-check/systems=libvirt-debia…> 29.965s Build step 'Execute shell' marked build as failure
1 9
0 0
[Libvirt-ci] Build failed in Jenkins: libvirt-go-xml-master-check » libvirt-debian-8 #481
by ci@centos.org 29 Jun '18

29 Jun '18
See <https://ci.centos.org/job/libvirt-go-xml-master-check/systems=libvirt-debia…> ------------------------------------------ Started by upstream project "libvirt-go-xml-master-check" build number 481 originally caused by: Started by upstream project "libvirt-go-xml-master-build" build number 490 originally caused by: Started by upstream project "libvirt-master-build" build number 1541 originally caused by: Started by an SCM change [EnvInject] - Loading node environment variables. Building remotely on libvirt-debian-8 (libvirt) in workspace <https://ci.centos.org/job/libvirt-go-xml-master-check/systems=libvirt-debia…> [libvirt-go-xml-master] $ /bin/sh -xe /tmp/jenkins273132993855198042.sh + export TEST_ARGS=-tags xmlroundtrip + go test -tags xmlroundtrip --- FAIL: TestRoundTrip (30.82 seconds) xml_test.go:383: testdata/libvirt/tests/storagevolxml2xmlin/vol-luks-convert.xml: /volume[0]/source[0]: element in expected XML missing in actual XML FAIL exit status 1 FAIL _<https://ci.centos.org/job/libvirt-go-xml-master-check/systems=libvirt-debia…> 31.014s Build step 'Execute shell' marked build as failure
1 9
0 0
[Libvirt-ci] Build failed in Jenkins: libvirt-go-xml-master-check » libvirt-fedora-27 #481
by ci@centos.org 29 Jun '18

29 Jun '18
See <https://ci.centos.org/job/libvirt-go-xml-master-check/systems=libvirt-fedor…> ------------------------------------------ Started by upstream project "libvirt-go-xml-master-check" build number 481 originally caused by: Started by upstream project "libvirt-go-xml-master-build" build number 490 originally caused by: Started by upstream project "libvirt-master-build" build number 1541 originally caused by: Started by an SCM change [EnvInject] - Loading node environment variables. Building remotely on libvirt-fedora-27 (libvirt) in workspace <https://ci.centos.org/job/libvirt-go-xml-master-check/systems=libvirt-fedor…> [libvirt-go-xml-master] $ /bin/sh -xe /tmp/jenkins6739341385447010131.sh + export 'TEST_ARGS=-tags xmlroundtrip' + TEST_ARGS='-tags xmlroundtrip' + go test -tags xmlroundtrip --- FAIL: TestRoundTrip (30.29s) xml_test.go:383: testdata/libvirt/tests/storagevolxml2xmlin/vol-luks-convert.xml: /volume[0]/source[0]: element in expected XML missing in actual XML FAIL exit status 1 FAIL _<https://ci.centos.org/job/libvirt-go-xml-master-check/systems=libvirt-fedor…> 30.567s Build step 'Execute shell' marked build as failure
1 9
0 0
[Libvirt-ci] Build failed in Jenkins: libvirt-master-check » libvirt-freebsd-11 #1191
by ci@centos.org 28 Jun '18

28 Jun '18
See <https://ci.centos.org/job/libvirt-master-check/systems=libvirt-freebsd-11/1…> ------------------------------------------ [...truncated 24.72 KB...] PASS: sockettest SKIP: virhostcputest PASS: virbuftest PASS: seclabeltest PASS: virhashtest PASS: virconftest PASS: commandtest PASS: utiltest SKIP: shunloadtest PASS: virtimetest PASS: viruritest PASS: virkeyfiletest PASS: viralloctest PASS: virauthconfigtest PASS: virbitmaptest SKIP: vircgrouptest PASS: vircryptotest SKIP: virpcitest PASS: virendiantest PASS: virfiletest PASS: virfilecachetest SKIP: virfirewalltest PASS: viriscsitest PASS: virkeycodetest PASS: virlockspacetest PASS: viratomictest PASS: virlogtest PASS: virrotatingfiletest PASS: virstringtest SKIP: virportallocatortest PASS: sysinfotest SKIP: virkmodtest PASS: vircapstest PASS: domaincapstest PASS: domainconftest SKIP: virhostdevtest SKIP: virnetdevtest PASS: virtypedparamtest PASS: virnetmessagetest PASS: virschematest PASS: virnetdaemontest FAIL: virnetsockettest PASS: virnetserverclienttest SKIP: virnettlscontexttest SKIP: virnettlssessiontest PASS: fdstreamtest PASS: virdbustest SKIP: virsystemdtest PASS: virpolkittest PASS: qemuxml2xmltest PASS: qemuargv2xmltest PASS: domainsnapshotxml2xmltest PASS: qemuxml2argvtest PASS: qemumonitorjsontest PASS: qemuagenttest PASS: qemuhotplugtest PASS: qemucaps2xmltest PASS: qemumemlocktest PASS: qemucommandutiltest PASS: qemublocktest PASS: qemumigparamstest PASS: esxutilstest PASS: vboxsnapshotxmltest PASS: vmx2xmltest PASS: xml2vmxtest PASS: vmwarevertest PASS: bhyvexml2argvtest PASS: bhyvexml2xmltest PASS: bhyveargv2xmltest PASS: virjsontest PASS: networkxml2xmltest PASS: networkxml2xmlupdatetest PASS: qemucapabilitiestest PASS: networkxml2conftest PASS: nwfilterxml2xmltest SKIP: networkxml2firewalltest PASS: virnwfilterbindingxml2xmltest PASS: storagevolxml2argvtest PASS: virstorageutiltest PASS: nsstest PASS: storagevolxml2xmltest PASS: nssguesttest PASS: storagepoolxml2xmltest PASS: interfacexml2xmltest PASS: nodedevxml2xmltest PASS: metadatatest PASS: secretxml2xmltest PASS: genericxml2xmltest PASS: eventtest PASS: virdrivermoduletest PASS: objecteventtest PASS: virmacmaptest PASS: libvirtd-fail PASS: cputest PASS: libvirtd-pool PASS: virsh-cpuset PASS: virsh-int-overflow PASS: virsh-define-dev-segfault SKIP: virsh-optparse PASS: virsh-read-bufsiz PASS: virsh-read-non-seekable PASS: virsh-schedinfo PASS: virt-admin-self-test PASS: virsh-self-test PASS: virsh-start PASS: virsh-undefine PASS: virsh-uriprecedence PASS: virsh-vcpupin PASS: virshtest ============================================================================ Testsuite summary for libvirt 4.5.0 ============================================================================ # TOTAL: 109 # PASS: 94 # SKIP: 14 # XFAIL: 0 # FAIL: 1 # XPASS: 0 # ERROR: 0 ============================================================================ See tests/test-suite.log Please report to libvir-list(a)redhat.com ============================================================================ gmake[3]: *** [Makefile:5694: test-suite.log] Error 1 gmake[3]: Leaving directory '/usr<https://ci.centos.org/job/libvirt-master-check/systems=libvirt-freebsd-11/w…'> gmake[2]: *** [Makefile:5802: check-TESTS] Error 2 gmake[2]: Leaving directory '/usr<https://ci.centos.org/job/libvirt-master-check/systems=libvirt-freebsd-11/w…'> gmake[1]: *** [Makefile:6797: check-am] Error 2 gmake[1]: Leaving directory '/usr<https://ci.centos.org/job/libvirt-master-check/systems=libvirt-freebsd-11/w…'> gmake: *** [Makefile:2104: check-recursive] Error 1 + cat tests/test-suite.log ========================================= libvirt 4.5.0: tests/test-suite.log ========================================= # TOTAL: 109 # PASS: 94 # SKIP: 14 # XFAIL: 0 # FAIL: 1 # XPASS: 0 # ERROR: 0 .. contents:: :depth: 2 SKIP: virhostcputest ==================== SKIP virhostcputest (exit status: 77) SKIP: shunloadtest ================== SKIP shunloadtest (exit status: 77) SKIP: vircgrouptest =================== SKIP vircgrouptest (exit status: 77) SKIP: virpcitest ================ SKIP virpcitest (exit status: 77) SKIP: virfirewalltest ===================== SKIP virfirewalltest (exit status: 77) SKIP: virportallocatortest ========================== SKIP virportallocatortest (exit status: 77) SKIP: virkmodtest ================= SKIP virkmodtest (exit status: 77) SKIP: virhostdevtest ==================== SKIP virhostdevtest (exit status: 77) SKIP: virnetdevtest =================== SKIP virnetdevtest (exit status: 77) FAIL: virnetsockettest ====================== TEST: virnetsockettest 1) Socket TCP/IPv4 Accept ... libvirt: XML-RPC error : End of file while reading data: Input/output error OK 2) Socket TCP/IPv6 Accept ... FAILED 3) Socket TCP/IPv4+IPv6 Accept ... libvirt: XML-RPC error : Cannot recv data: Connection reset by peer OK 4) Socket TCP/IPv4+IPv6 Accept ... libvirt: XML-RPC error : Cannot recv data: Connection reset by peer OK 5) Socket UNIX Accept ... libvirt: XML-RPC error : Cannot write data: Broken pipe OK 6) Socket UNIX Addrs ... OK 7) Socket External Command /dev/zero ... OK 8) Socket External Command /dev/does-not-exist ... libvirt: XML-RPC error : End of file while reading data: cat: /dev/does-not-exist: No such file or directory: Input/output error OK 9) SSH test 1 ... OK 10) SSH test 2 ... OK 11) SSH test 3 ... OK 12) SSH test 4 ... libvirt: XML-RPC error : End of file while reading data: Cannot connect to host nosuchhost: Input/output error OK 13) SSH test 5 ... libvirt: XML-RPC error : End of file while reading data: : Input/output error OK 14) SSH test 6 ... OK 15) SSH test 7 ... OK FAIL virnetsockettest (exit status: 1) SKIP: virnettlscontexttest ========================== SKIP virnettlscontexttest (exit status: 77) SKIP: virnettlssessiontest ========================== SKIP virnettlssessiontest (exit status: 77) SKIP: virsystemdtest ==================== SKIP virsystemdtest (exit status: 77) SKIP: networkxml2firewalltest ============================= SKIP networkxml2firewalltest (exit status: 77) SKIP: virsh-optparse ==================== ../../tests/virsh-optparse: skipping test: This test is very expensive, so it is disabled by default. To run it anyway, rerun: make check VIR_TEST_EXPENSIVE=1 SKIP virsh-optparse (exit status: 77) + exit 1 Build step 'Execute shell' marked build as failure
1 1
0 0
  • ← Newer
  • 1
  • 2
  • 3
  • 4
  • ...
  • 25
  • Older →

HyperKitty Powered by HyperKitty version 1.3.12.