libvirt List Archives
Sign In Sign Up
Manage this list Sign In Sign Up

Keyboard Shortcuts

Thread View

  • j: Next unread message
  • k: Previous unread message
  • j a: Jump to all threads
  • j l: Jump to MailingList overview

CI

Thread Start a new thread
Download
Threads by month
  • ----- 2025 -----
  • August
  • July
  • June
  • May
  • April
  • March
  • February
  • January
  • ----- 2024 -----
  • December
  • November
  • October
  • September
  • August
  • July
  • June
  • May
  • April
  • March
  • February
  • January
  • ----- 2023 -----
  • December
  • November
  • October
  • September
  • August
  • July
  • June
  • May
  • April
  • March
  • February
  • January
  • ----- 2022 -----
  • December
  • November
  • October
  • September
  • August
  • July
  • June
  • May
  • April
  • March
  • February
  • January
  • ----- 2021 -----
  • December
  • November
  • October
  • September
  • August
  • July
  • June
  • May
  • April
  • March
  • February
  • January
  • ----- 2020 -----
  • December
  • November
  • October
  • September
  • August
  • July
  • June
  • May
  • April
  • March
  • February
  • January
  • ----- 2019 -----
  • December
  • November
  • October
  • September
  • August
  • July
  • June
  • May
  • April
  • March
  • February
  • January
  • ----- 2018 -----
  • December
  • November
  • October
  • September
  • August
  • July
  • June
  • May
  • April
  • March
  • February
  • January
  • ----- 2017 -----
  • December
  • November
  • October
  • September
  • August
  • July
  • June
  • May
  • April
  • March
  • February
  • January
  • ----- 2016 -----
  • December
  • November
  • October
  • September
  • August
  • July
ci@lists.libvirt.org

October 2018

  • 2 participants
  • 91 discussions
[Libvirt-ci] Build failed in Jenkins: libosinfo-check » libvirt-freebsd-10 #17
by ci@centos.org 08 Oct '18

08 Oct '18
See <https://ci.centos.org/job/libosinfo-check/systems=libvirt-freebsd-10/17/dis…> ------------------------------------------ Started by upstream project "libosinfo-check" build number 17 originally caused by: Started by upstream project "libosinfo-syntax-check" build number 17 originally caused by: Started by upstream project "libosinfo-build" build number 17 originally caused by: Started by upstream project "osinfo-db-build" build number 12 originally caused by: Started by an SCM change [EnvInject] - Loading node environment variables. Building remotely on libvirt-freebsd-10 (libvirt) in workspace <https://ci.centos.org/job/libosinfo-check/systems=libvirt-freebsd-10/ws/> [libosinfo] $ /bin/sh -xe /tmp/jenkins892533460355101147.sh + export LIBOSINFO_NETWORK_TESTS=1 + cd build + /usr/local/bin/gmake check GEN public-submodule-commit Making check in osinfo gmake[1]: Entering directory '/usr<https://ci.centos.org/job/libosinfo-check/systems=libvirt-freebsd-10/ws/bui…'> /usr/local/bin/gmake check-am gmake[2]: Entering directory '/usr<https://ci.centos.org/job/libosinfo-check/systems=libvirt-freebsd-10/ws/bui…'> /usr/local/bin/gmake check-local gmake[3]: Entering directory '/usr<https://ci.centos.org/job/libosinfo-check/systems=libvirt-freebsd-10/ws/bui…'> GEN check-symsorting gmake[3]: Leaving directory '/usr<https://ci.centos.org/job/libosinfo-check/systems=libvirt-freebsd-10/ws/bui…'> gmake[2]: Leaving directory '/usr<https://ci.centos.org/job/libosinfo-check/systems=libvirt-freebsd-10/ws/bui…'> gmake[1]: Leaving directory '/usr<https://ci.centos.org/job/libosinfo-check/systems=libvirt-freebsd-10/ws/bui…'> Making check in tools gmake[1]: Entering directory '/usr<https://ci.centos.org/job/libosinfo-check/systems=libvirt-freebsd-10/ws/bui…'> gmake[1]: Nothing to be done for 'check'. gmake[1]: Leaving directory '/usr<https://ci.centos.org/job/libosinfo-check/systems=libvirt-freebsd-10/ws/bui…'> Making check in docs gmake[1]: Entering directory '/usr<https://ci.centos.org/job/libosinfo-check/systems=libvirt-freebsd-10/ws/bui…'> Making check in reference gmake[2]: Entering directory '/usr<https://ci.centos.org/job/libosinfo-check/systems=libvirt-freebsd-10/ws/bui…'> gmake[2]: Nothing to be done for 'check'. gmake[2]: Leaving directory '/usr<https://ci.centos.org/job/libosinfo-check/systems=libvirt-freebsd-10/ws/bui…'> gmake[2]: Entering directory '/usr<https://ci.centos.org/job/libosinfo-check/systems=libvirt-freebsd-10/ws/bui…'> gmake[2]: Nothing to be done for 'check-am'. gmake[2]: Leaving directory '/usr<https://ci.centos.org/job/libosinfo-check/systems=libvirt-freebsd-10/ws/bui…'> gmake[1]: Leaving directory '/usr<https://ci.centos.org/job/libosinfo-check/systems=libvirt-freebsd-10/ws/bui…'> Making check in po gmake[1]: Entering directory '/usr<https://ci.centos.org/job/libosinfo-check/systems=libvirt-freebsd-10/ws/bui…'> INTLTOOL_EXTRACT="/usr/local/bin/intltool-extract" XGETTEXT="/usr/local/bin/xgettext" srcdir=../../po /usr/local/bin/intltool-update --gettext-package libosinfo --pot rm -f missing notexist srcdir=../../po /usr/local/bin/intltool-update -m if [ -r missing -o -r notexist ]; then \ exit 1; \ fi gmake[1]: Leaving directory '/usr<https://ci.centos.org/job/libosinfo-check/systems=libvirt-freebsd-10/ws/bui…'> Making check in examples gmake[1]: Entering directory '/usr<https://ci.centos.org/job/libosinfo-check/systems=libvirt-freebsd-10/ws/bui…'> gmake[1]: Nothing to be done for 'check'. gmake[1]: Leaving directory '/usr<https://ci.centos.org/job/libosinfo-check/systems=libvirt-freebsd-10/ws/bui…'> Making check in tests gmake[1]: Entering directory '/usr<https://ci.centos.org/job/libosinfo-check/systems=libvirt-freebsd-10/ws/bui…'> /usr/local/bin/gmake test-entity test-device test-list test-devicelist test-filter test-product test-os test-oslist test-productfilter test-platform test-platformlist test-db test-loader test-isodetect test-install-script test-os-resources test-mediauris test-treeuris gmake[2]: Entering directory '/usr<https://ci.centos.org/job/libosinfo-check/systems=libvirt-freebsd-10/ws/bui…'> CC test_entity-test-entity.o CC test_device-test-device.o CC test_list-test-list.o CC test_devicelist-test-devicelist.o CC test_filter-test-filter.o CC test_product-test-product.o CC test_os-test-os.o CC test_oslist-test-oslist.o CC test_productfilter-test-productfilter.o CC test_platform-test-platform.o CC test_platformlist-test-platformlist.o CC test_db-test-db.o CC test_loader-test-loader.o CC test_isodetect-test-isodetect.o CC test_install_script-test-install-script.o CC test_os_resources-test-os-resources.o CC test_mediauris-test-mediauris.o CC test_treeuris-test-treeuris.o CCLD test-entity CCLD test-device CCLD test-list CCLD test-devicelist CCLD test-filter CCLD test-product CCLD test-os CCLD test-oslist CCLD test-productfilter CCLD test-platform CCLD test-platformlist CCLD test-db CCLD test-loader CCLD test-isodetect CCLD test-install-script CCLD test-os-resources CCLD test-mediauris CCLD test-treeuris gmake[2]: Leaving directory '/usr<https://ci.centos.org/job/libosinfo-check/systems=libvirt-freebsd-10/ws/bui…'> /usr/local/bin/gmake check-TESTS gmake[2]: Entering directory '/usr<https://ci.centos.org/job/libosinfo-check/systems=libvirt-freebsd-10/ws/bui…'> gmake[3]: Entering directory '/usr<https://ci.centos.org/job/libosinfo-check/systems=libvirt-freebsd-10/ws/bui…'> PASS: test-device PASS: test-entity PASS: test-list PASS: test-devicelist PASS: test-product PASS: test-filter PASS: test-oslist PASS: test-os PASS: test-productfilter PASS: test-platformlist PASS: test-platform PASS: test-db PASS: test-install-script PASS: test-loader PASS: test-os-resources PASS: test-treeuris PASS: test-isodetect Abort trap (core dumped) FAIL: test-mediauris ============================================================================ Testsuite summary for libosinfo 1.3.0 ============================================================================ # TOTAL: 18 # PASS: 17 # SKIP: 0 # XFAIL: 0 # FAIL: 1 # XPASS: 0 # ERROR: 0 ============================================================================ See tests/test-suite.log Please report to libosinfo(a)redhat.com ============================================================================ gmake[3]: *** [Makefile:1313: test-suite.log] Error 1 gmake[3]: Leaving directory '/usr<https://ci.centos.org/job/libosinfo-check/systems=libvirt-freebsd-10/ws/bui…'> gmake[2]: *** [Makefile:1421: check-TESTS] Error 2 gmake[2]: Leaving directory '/usr<https://ci.centos.org/job/libosinfo-check/systems=libvirt-freebsd-10/ws/bui…'> gmake[1]: *** [Makefile:1614: check-am] Error 2 gmake[1]: Leaving directory '/usr<https://ci.centos.org/job/libosinfo-check/systems=libvirt-freebsd-10/ws/bui…'> gmake: *** [Makefile:594: check-recursive] Error 1 + cat tests/test-suite.log =========================================== libosinfo 1.3.0: tests/test-suite.log =========================================== # TOTAL: 18 # PASS: 17 # SKIP: 0 # XFAIL: 0 # FAIL: 1 # XPASS: 0 # ERROR: 0 .. contents:: :depth: 2 FAIL: test-mediauris ==================== /mediauris/uris: ** ERROR:../../tests/test-mediauris.c:50:test_media: assertion failed (res == CURLE_OK): (28 == 0) FAIL test-mediauris (exit status: 134) + exit 1 Build step 'Execute shell' marked build as failure
1 2
0 0
[Libvirt-ci] Build failed in Jenkins: libosinfo-check » libvirt-freebsd-11 #17
by ci@centos.org 08 Oct '18

08 Oct '18
See <https://ci.centos.org/job/libosinfo-check/systems=libvirt-freebsd-11/17/dis…> ------------------------------------------ Started by upstream project "libosinfo-check" build number 17 originally caused by: Started by upstream project "libosinfo-syntax-check" build number 17 originally caused by: Started by upstream project "libosinfo-build" build number 17 originally caused by: Started by upstream project "osinfo-db-build" build number 12 originally caused by: Started by an SCM change [EnvInject] - Loading node environment variables. Building remotely on libvirt-freebsd-11 (libvirt) in workspace <https://ci.centos.org/job/libosinfo-check/systems=libvirt-freebsd-11/ws/> [libosinfo] $ /bin/sh -xe /tmp/jenkins8901675952703464945.sh + export 'LIBOSINFO_NETWORK_TESTS=1' + cd build + /usr/local/bin/gmake check GEN public-submodule-commit Making check in osinfo gmake[1]: Entering directory '/usr<https://ci.centos.org/job/libosinfo-check/systems=libvirt-freebsd-11/ws/bui…'> /usr/local/bin/gmake check-am gmake[2]: Entering directory '/usr<https://ci.centos.org/job/libosinfo-check/systems=libvirt-freebsd-11/ws/bui…'> /usr/local/bin/gmake check-local gmake[3]: Entering directory '/usr<https://ci.centos.org/job/libosinfo-check/systems=libvirt-freebsd-11/ws/bui…'> GEN check-symsorting gmake[3]: Leaving directory '/usr<https://ci.centos.org/job/libosinfo-check/systems=libvirt-freebsd-11/ws/bui…'> gmake[2]: Leaving directory '/usr<https://ci.centos.org/job/libosinfo-check/systems=libvirt-freebsd-11/ws/bui…'> gmake[1]: Leaving directory '/usr<https://ci.centos.org/job/libosinfo-check/systems=libvirt-freebsd-11/ws/bui…'> Making check in tools gmake[1]: Entering directory '/usr<https://ci.centos.org/job/libosinfo-check/systems=libvirt-freebsd-11/ws/bui…'> gmake[1]: Nothing to be done for 'check'. gmake[1]: Leaving directory '/usr<https://ci.centos.org/job/libosinfo-check/systems=libvirt-freebsd-11/ws/bui…'> Making check in docs gmake[1]: Entering directory '/usr<https://ci.centos.org/job/libosinfo-check/systems=libvirt-freebsd-11/ws/bui…'> Making check in reference gmake[2]: Entering directory '/usr<https://ci.centos.org/job/libosinfo-check/systems=libvirt-freebsd-11/ws/bui…'> gmake[2]: Nothing to be done for 'check'. gmake[2]: Leaving directory '/usr<https://ci.centos.org/job/libosinfo-check/systems=libvirt-freebsd-11/ws/bui…'> gmake[2]: Entering directory '/usr<https://ci.centos.org/job/libosinfo-check/systems=libvirt-freebsd-11/ws/bui…'> gmake[2]: Nothing to be done for 'check-am'. gmake[2]: Leaving directory '/usr<https://ci.centos.org/job/libosinfo-check/systems=libvirt-freebsd-11/ws/bui…'> gmake[1]: Leaving directory '/usr<https://ci.centos.org/job/libosinfo-check/systems=libvirt-freebsd-11/ws/bui…'> Making check in po gmake[1]: Entering directory '/usr<https://ci.centos.org/job/libosinfo-check/systems=libvirt-freebsd-11/ws/bui…'> INTLTOOL_EXTRACT="/usr/local/bin/intltool-extract" XGETTEXT="/usr/local/bin/xgettext" srcdir=../../po /usr/local/bin/intltool-update --gettext-package libosinfo --pot rm -f missing notexist srcdir=../../po /usr/local/bin/intltool-update -m if [ -r missing -o -r notexist ]; then \ exit 1; \ fi gmake[1]: Leaving directory '/usr<https://ci.centos.org/job/libosinfo-check/systems=libvirt-freebsd-11/ws/bui…'> Making check in examples gmake[1]: Entering directory '/usr<https://ci.centos.org/job/libosinfo-check/systems=libvirt-freebsd-11/ws/bui…'> gmake[1]: Nothing to be done for 'check'. gmake[1]: Leaving directory '/usr<https://ci.centos.org/job/libosinfo-check/systems=libvirt-freebsd-11/ws/bui…'> Making check in tests gmake[1]: Entering directory '/usr<https://ci.centos.org/job/libosinfo-check/systems=libvirt-freebsd-11/ws/bui…'> /usr/local/bin/gmake test-entity test-device test-list test-devicelist test-filter test-product test-os test-oslist test-productfilter test-platform test-platformlist test-db test-loader test-isodetect test-install-script test-os-resources test-mediauris test-treeuris gmake[2]: Entering directory '/usr<https://ci.centos.org/job/libosinfo-check/systems=libvirt-freebsd-11/ws/bui…'> CC test_entity-test-entity.o CC test_device-test-device.o CC test_list-test-list.o CC test_devicelist-test-devicelist.o CC test_filter-test-filter.o CC test_product-test-product.o CC test_os-test-os.o CC test_oslist-test-oslist.o CC test_productfilter-test-productfilter.o CC test_platform-test-platform.o CC test_platformlist-test-platformlist.o CC test_loader-test-loader.o CC test_db-test-db.o CC test_isodetect-test-isodetect.o CC test_install_script-test-install-script.o CC test_os_resources-test-os-resources.o CC test_mediauris-test-mediauris.o CC test_treeuris-test-treeuris.o CCLD test-entity CCLD test-device CCLD test-list CCLD test-devicelist CCLD test-filter CCLD test-product CCLD test-os CCLD test-oslist CCLD test-productfilter CCLD test-platform CCLD test-platformlist CCLD test-db CCLD test-loader CCLD test-isodetect CCLD test-install-script CCLD test-os-resources CCLD test-mediauris CCLD test-treeuris gmake[2]: Leaving directory '/usr<https://ci.centos.org/job/libosinfo-check/systems=libvirt-freebsd-11/ws/bui…'> /usr/local/bin/gmake check-TESTS gmake[2]: Entering directory '/usr<https://ci.centos.org/job/libosinfo-check/systems=libvirt-freebsd-11/ws/bui…'> gmake[3]: Entering directory '/usr<https://ci.centos.org/job/libosinfo-check/systems=libvirt-freebsd-11/ws/bui…'> PASS: test-list PASS: test-device PASS: test-entity PASS: test-devicelist PASS: test-product PASS: test-filter PASS: test-oslist PASS: test-productfilter PASS: test-os PASS: test-platform PASS: test-db PASS: test-platformlist PASS: test-install-script PASS: test-os-resources PASS: test-loader PASS: test-treeuris PASS: test-isodetect Abort trap (core dumped) FAIL: test-mediauris ============================================================================ Testsuite summary for libosinfo 1.3.0 ============================================================================ # TOTAL: 18 # PASS: 17 # SKIP: 0 # XFAIL: 0 # FAIL: 1 # XPASS: 0 # ERROR: 0 ============================================================================ See tests/test-suite.log Please report to libosinfo(a)redhat.com ============================================================================ gmake[3]: *** [Makefile:1313: test-suite.log] Error 1 gmake[3]: Leaving directory '/usr<https://ci.centos.org/job/libosinfo-check/systems=libvirt-freebsd-11/ws/bui…'> gmake[2]: *** [Makefile:1421: check-TESTS] Error 2 gmake[2]: Leaving directory '/usr<https://ci.centos.org/job/libosinfo-check/systems=libvirt-freebsd-11/ws/bui…'> gmake[1]: *** [Makefile:1614: check-am] Error 2 gmake[1]: Leaving directory '/usr<https://ci.centos.org/job/libosinfo-check/systems=libvirt-freebsd-11/ws/bui…'> gmake: *** [Makefile:594: check-recursive] Error 1 + cat tests/test-suite.log =========================================== libosinfo 1.3.0: tests/test-suite.log =========================================== # TOTAL: 18 # PASS: 17 # SKIP: 0 # XFAIL: 0 # FAIL: 1 # XPASS: 0 # ERROR: 0 .. contents:: :depth: 2 FAIL: test-mediauris ==================== /mediauris/uris: ** ERROR:../../tests/test-mediauris.c:50:test_media: assertion failed (res == CURLE_OK): (28 == 0) FAIL test-mediauris (exit status: 134) + exit 1 Build step 'Execute shell' marked build as failure
1 2
0 0
[Libvirt-ci] Build failed in Jenkins: libosinfo-check » libvirt-centos-7 #18
by ci@centos.org 08 Oct '18

08 Oct '18
See <https://ci.centos.org/job/libosinfo-check/systems=libvirt-centos-7/18/displ…> ------------------------------------------ Started by upstream project "libosinfo-check" build number 18 originally caused by: Started by upstream project "libosinfo-syntax-check" build number 18 originally caused by: Started by upstream project "libosinfo-build" build number 18 originally caused by: Started by an SCM change [EnvInject] - Loading node environment variables. Building remotely on libvirt-centos-7 (libvirt) in workspace <https://ci.centos.org/job/libosinfo-check/systems=libvirt-centos-7/ws/> [libosinfo] $ /bin/sh -xe /tmp/jenkins1932390277350809733.sh + export LIBOSINFO_NETWORK_TESTS=1 + LIBOSINFO_NETWORK_TESTS=1 + cd build + /usr/bin/gmake check GEN public-submodule-commit Making check in osinfo gmake[1]: Entering directory `<https://ci.centos.org/job/libosinfo-check/systems=libvirt-centos-7/ws/build…'> /usr/bin/gmake check-am gmake[2]: Entering directory `<https://ci.centos.org/job/libosinfo-check/systems=libvirt-centos-7/ws/build…'> /usr/bin/gmake check-local gmake[3]: Entering directory `<https://ci.centos.org/job/libosinfo-check/systems=libvirt-centos-7/ws/build…'> GEN check-symfile GEN check-symsorting gmake[3]: Leaving directory `<https://ci.centos.org/job/libosinfo-check/systems=libvirt-centos-7/ws/build…'> gmake[2]: Leaving directory `<https://ci.centos.org/job/libosinfo-check/systems=libvirt-centos-7/ws/build…'> gmake[1]: Leaving directory `<https://ci.centos.org/job/libosinfo-check/systems=libvirt-centos-7/ws/build…'> Making check in tools gmake[1]: Entering directory `<https://ci.centos.org/job/libosinfo-check/systems=libvirt-centos-7/ws/build…'> gmake[1]: Nothing to be done for `check'. gmake[1]: Leaving directory `<https://ci.centos.org/job/libosinfo-check/systems=libvirt-centos-7/ws/build…'> Making check in docs gmake[1]: Entering directory `<https://ci.centos.org/job/libosinfo-check/systems=libvirt-centos-7/ws/build…'> Making check in reference gmake[2]: Entering directory `<https://ci.centos.org/job/libosinfo-check/systems=libvirt-centos-7/ws/build…'> gmake[2]: Nothing to be done for `check'. gmake[2]: Leaving directory `<https://ci.centos.org/job/libosinfo-check/systems=libvirt-centos-7/ws/build…'> gmake[2]: Entering directory `<https://ci.centos.org/job/libosinfo-check/systems=libvirt-centos-7/ws/build…'> gmake[2]: Nothing to be done for `check-am'. gmake[2]: Leaving directory `<https://ci.centos.org/job/libosinfo-check/systems=libvirt-centos-7/ws/build…'> gmake[1]: Leaving directory `<https://ci.centos.org/job/libosinfo-check/systems=libvirt-centos-7/ws/build…'> Making check in po gmake[1]: Entering directory `<https://ci.centos.org/job/libosinfo-check/systems=libvirt-centos-7/ws/build…'> INTLTOOL_EXTRACT="/usr/bin/intltool-extract" XGETTEXT="/usr/bin/xgettext" srcdir=../../po /usr/bin/intltool-update --gettext-package libosinfo --pot rm -f missing notexist srcdir=../../po /usr/bin/intltool-update -m if [ -r missing -o -r notexist ]; then \ exit 1; \ fi gmake[1]: Leaving directory `<https://ci.centos.org/job/libosinfo-check/systems=libvirt-centos-7/ws/build…'> Making check in examples gmake[1]: Entering directory `<https://ci.centos.org/job/libosinfo-check/systems=libvirt-centos-7/ws/build…'> gmake[1]: Nothing to be done for `check'. gmake[1]: Leaving directory `<https://ci.centos.org/job/libosinfo-check/systems=libvirt-centos-7/ws/build…'> Making check in tests gmake[1]: Entering directory `<https://ci.centos.org/job/libosinfo-check/systems=libvirt-centos-7/ws/build…'> /usr/bin/gmake test-entity test-device test-list test-devicelist test-filter test-product test-os test-oslist test-productfilter test-platform test-platformlist test-db test-loader test-isodetect test-install-script test-os-resources test-mediauris test-treeuris gmake[2]: Entering directory `<https://ci.centos.org/job/libosinfo-check/systems=libvirt-centos-7/ws/build…'> CC test_entity-test-entity.o CC test_device-test-device.o CC test_list-test-list.o CC test_devicelist-test-devicelist.o CC test_filter-test-filter.o CC test_product-test-product.o CC test_os-test-os.o CC test_oslist-test-oslist.o CC test_productfilter-test-productfilter.o CC test_platform-test-platform.o CC test_platformlist-test-platformlist.o CC test_db-test-db.o CC test_loader-test-loader.o CC test_isodetect-test-isodetect.o CC test_install_script-test-install-script.o CC test_os_resources-test-os-resources.o CC test_mediauris-test-mediauris.o CC test_treeuris-test-treeuris.o CCLD test-entity CCLD test-device CCLD test-list CCLD test-devicelist CCLD test-filter CCLD test-product CCLD test-os CCLD test-oslist CCLD test-productfilter CCLD test-platform CCLD test-platformlist CCLD test-db CCLD test-loader CCLD test-isodetect CCLD test-install-script CCLD test-os-resources CCLD test-mediauris CCLD test-treeuris gmake[2]: Leaving directory `<https://ci.centos.org/job/libosinfo-check/systems=libvirt-centos-7/ws/build…'> /usr/bin/gmake check-TESTS gmake[2]: Entering directory `<https://ci.centos.org/job/libosinfo-check/systems=libvirt-centos-7/ws/build…'> gmake[3]: Entering directory `<https://ci.centos.org/job/libosinfo-check/systems=libvirt-centos-7/ws/build…'> PASS: test-list PASS: test-device PASS: test-entity PASS: test-devicelist PASS: test-filter PASS: test-product PASS: test-productfilter PASS: test-os PASS: test-platform PASS: test-oslist PASS: test-db PASS: test-platformlist PASS: test-install-script PASS: test-loader PASS: test-os-resources ../../build-aux/test-driver: line 95: 27566 Aborted "$@" > $log_file 2>&1 FAIL: test-isodetect ../../build-aux/test-driver: line 95: 27693 Aborted "$@" > $log_file 2>&1 FAIL: test-treeuris PASS: test-mediauris gmake[4]: Entering directory `<https://ci.centos.org/job/libosinfo-check/systems=libvirt-centos-7/ws/build…'> gmake[4]: Nothing to be done for `all'. gmake[4]: Leaving directory `<https://ci.centos.org/job/libosinfo-check/systems=libvirt-centos-7/ws/build…'> ============================================================================ Testsuite summary for libosinfo 1.3.0 ============================================================================ # TOTAL: 18 # PASS: 16 # SKIP: 0 # XFAIL: 0 # FAIL: 2 # XPASS: 0 # ERROR: 0 ============================================================================ See tests/test-suite.log Please report to libosinfo(a)redhat.com ============================================================================ gmake[3]: *** [test-suite.log] Error 1 gmake[3]: Leaving directory `<https://ci.centos.org/job/libosinfo-check/systems=libvirt-centos-7/ws/build…'> gmake[2]: *** [check-TESTS] Error 2 gmake[2]: Leaving directory `<https://ci.centos.org/job/libosinfo-check/systems=libvirt-centos-7/ws/build…'> gmake[1]: *** [check-am] Error 2 gmake[1]: Leaving directory `<https://ci.centos.org/job/libosinfo-check/systems=libvirt-centos-7/ws/build…'> gmake: *** [check-recursive] Error 1 + cat tests/test-suite.log =========================================== libosinfo 1.3.0: tests/test-suite.log =========================================== # TOTAL: 18 # PASS: 16 # SKIP: 0 # XFAIL: 0 # FAIL: 2 # XPASS: 0 # ERROR: 0 .. contents:: :depth: 2 FAIL: test-isodetect ==================== /isodetect/dragonflybsd: OK /isodetect/haiku: OK /isodetect/windows: ** ERROR:../../tests/test-isodetect.c:408:test_one: assertion failed (shortid == info->shortid): ("win10" == "win8") FAIL: test-treeuris =================== /treeuris/uris: ** ERROR:../../tests/test-treeuris.c:50:test_tree: assertion failed (res == CURLE_OK): (28 == 0) + exit 1 Build step 'Execute shell' marked build as failure
1 1
0 0
[Libvirt-ci] Build failed in Jenkins: libosinfo-check » libvirt-debian-8 #18
by ci@centos.org 08 Oct '18

08 Oct '18
See <https://ci.centos.org/job/libosinfo-check/systems=libvirt-debian-8/18/displ…> ------------------------------------------ Started by upstream project "libosinfo-check" build number 18 originally caused by: Started by upstream project "libosinfo-syntax-check" build number 18 originally caused by: Started by upstream project "libosinfo-build" build number 18 originally caused by: Started by an SCM change [EnvInject] - Loading node environment variables. Building remotely on libvirt-debian-8 (libvirt) in workspace <https://ci.centos.org/job/libosinfo-check/systems=libvirt-debian-8/ws/> [libosinfo] $ /bin/sh -xe /tmp/jenkins1387774841789737602.sh + export LIBOSINFO_NETWORK_TESTS=1 + cd build + /usr/bin/make check GEN public-submodule-commit Making check in osinfo make[1]: Entering directory '<https://ci.centos.org/job/libosinfo-check/systems=libvirt-debian-8/ws/build…'> /usr/bin/make check-am make[2]: Entering directory '<https://ci.centos.org/job/libosinfo-check/systems=libvirt-debian-8/ws/build…'> /usr/bin/make check-local make[3]: Entering directory '<https://ci.centos.org/job/libosinfo-check/systems=libvirt-debian-8/ws/build…'> GEN check-symfile GEN check-symsorting make[3]: Leaving directory '<https://ci.centos.org/job/libosinfo-check/systems=libvirt-debian-8/ws/build…'> make[2]: Leaving directory '<https://ci.centos.org/job/libosinfo-check/systems=libvirt-debian-8/ws/build…'> make[1]: Leaving directory '<https://ci.centos.org/job/libosinfo-check/systems=libvirt-debian-8/ws/build…'> Making check in tools make[1]: Entering directory '<https://ci.centos.org/job/libosinfo-check/systems=libvirt-debian-8/ws/build…'> make[1]: Nothing to be done for 'check'. make[1]: Leaving directory '<https://ci.centos.org/job/libosinfo-check/systems=libvirt-debian-8/ws/build…'> Making check in docs make[1]: Entering directory '<https://ci.centos.org/job/libosinfo-check/systems=libvirt-debian-8/ws/build…'> Making check in reference make[2]: Entering directory '<https://ci.centos.org/job/libosinfo-check/systems=libvirt-debian-8/ws/build…'> make[2]: Nothing to be done for 'check'. make[2]: Leaving directory '<https://ci.centos.org/job/libosinfo-check/systems=libvirt-debian-8/ws/build…'> make[2]: Entering directory '<https://ci.centos.org/job/libosinfo-check/systems=libvirt-debian-8/ws/build…'> make[2]: Nothing to be done for 'check-am'. make[2]: Leaving directory '<https://ci.centos.org/job/libosinfo-check/systems=libvirt-debian-8/ws/build…'> make[1]: Leaving directory '<https://ci.centos.org/job/libosinfo-check/systems=libvirt-debian-8/ws/build…'> Making check in po make[1]: Entering directory '<https://ci.centos.org/job/libosinfo-check/systems=libvirt-debian-8/ws/build…'> INTLTOOL_EXTRACT="/usr/bin/intltool-extract" XGETTEXT="/usr/bin/xgettext" srcdir=../../po /usr/bin/intltool-update --gettext-package libosinfo --pot rm -f missing notexist srcdir=../../po /usr/bin/intltool-update -m if [ -r missing -o -r notexist ]; then \ exit 1; \ fi make[1]: Leaving directory '<https://ci.centos.org/job/libosinfo-check/systems=libvirt-debian-8/ws/build…'> Making check in examples make[1]: Entering directory '<https://ci.centos.org/job/libosinfo-check/systems=libvirt-debian-8/ws/build…'> make[1]: Nothing to be done for 'check'. make[1]: Leaving directory '<https://ci.centos.org/job/libosinfo-check/systems=libvirt-debian-8/ws/build…'> Making check in tests make[1]: Entering directory '<https://ci.centos.org/job/libosinfo-check/systems=libvirt-debian-8/ws/build…'> /usr/bin/make test-entity test-device test-list test-devicelist test-filter test-product test-os test-oslist test-productfilter test-platform test-platformlist test-db test-loader test-isodetect test-install-script test-os-resources test-mediauris test-treeuris make[2]: Entering directory '<https://ci.centos.org/job/libosinfo-check/systems=libvirt-debian-8/ws/build…'> CC test_device-test-device.o CC test_entity-test-entity.o CC test_list-test-list.o CC test_devicelist-test-devicelist.o CC test_filter-test-filter.o CC test_product-test-product.o CC test_oslist-test-oslist.o CC test_os-test-os.o CC test_platform-test-platform.o CC test_productfilter-test-productfilter.o CC test_platformlist-test-platformlist.o CC test_db-test-db.o CC test_loader-test-loader.o CC test_isodetect-test-isodetect.o CC test_install_script-test-install-script.o CC test_os_resources-test-os-resources.o CC test_mediauris-test-mediauris.o CC test_treeuris-test-treeuris.o CCLD test-entity CCLD test-device CCLD test-list CCLD test-devicelist CCLD test-filter CCLD test-product CCLD test-os CCLD test-oslist CCLD test-productfilter CCLD test-platform CCLD test-platformlist CCLD test-db CCLD test-loader CCLD test-isodetect CCLD test-install-script CCLD test-os-resources CCLD test-mediauris CCLD test-treeuris make[2]: Leaving directory '<https://ci.centos.org/job/libosinfo-check/systems=libvirt-debian-8/ws/build…'> /usr/bin/make check-TESTS make[2]: Entering directory '<https://ci.centos.org/job/libosinfo-check/systems=libvirt-debian-8/ws/build…'> make[3]: Entering directory '<https://ci.centos.org/job/libosinfo-check/systems=libvirt-debian-8/ws/build…'> PASS: test-device PASS: test-list PASS: test-filter PASS: test-entity PASS: test-devicelist PASS: test-product PASS: test-oslist PASS: test-os PASS: test-platform PASS: test-productfilter PASS: test-platformlist PASS: test-db PASS: test-install-script PASS: test-loader PASS: test-os-resources ../../build-aux/test-driver: line 107: 13907 Aborted "$@" > $log_file 2>&1 FAIL: test-isodetect PASS: test-treeuris ../../build-aux/test-driver: line 107: 14007 Aborted "$@" > $log_file 2>&1 FAIL: test-mediauris make[4]: Entering directory '<https://ci.centos.org/job/libosinfo-check/systems=libvirt-debian-8/ws/build…'> make[4]: Nothing to be done for 'all'. make[4]: Leaving directory '<https://ci.centos.org/job/libosinfo-check/systems=libvirt-debian-8/ws/build…'> ============================================================================ Testsuite summary for libosinfo 1.3.0 ============================================================================ # TOTAL: 18 # PASS: 16 # SKIP: 0 # XFAIL: 0 # FAIL: 2 # XPASS: 0 # ERROR: 0 ============================================================================ See tests/test-suite.log Please report to libosinfo(a)redhat.com ============================================================================ Makefile:1278: recipe for target 'test-suite.log' failed make[3]: *** [test-suite.log] Error 1 make[3]: Leaving directory '<https://ci.centos.org/job/libosinfo-check/systems=libvirt-debian-8/ws/build…'> Makefile:1384: recipe for target 'check-TESTS' failed make[2]: *** [check-TESTS] Error 2 make[2]: Leaving directory '<https://ci.centos.org/job/libosinfo-check/systems=libvirt-debian-8/ws/build…'> Makefile:1576: recipe for target 'check-am' failed make[1]: *** [check-am] Error 2 make[1]: Leaving directory '<https://ci.centos.org/job/libosinfo-check/systems=libvirt-debian-8/ws/build…'> Makefile:584: recipe for target 'check-recursive' failed make: *** [check-recursive] Error 1 + cat tests/test-suite.log =========================================== libosinfo 1.3.0: tests/test-suite.log =========================================== # TOTAL: 18 # PASS: 16 # SKIP: 0 # XFAIL: 0 # FAIL: 2 # XPASS: 0 # ERROR: 0 .. contents:: :depth: 2 FAIL: test-isodetect ==================== /isodetect/haiku: OK /isodetect/dragonflybsd: OK /isodetect/windows: ** ERROR:../../tests/test-isodetect.c:408:test_one: assertion failed (shortid == info->shortid): ("win10" == "win8") FAIL: test-mediauris ==================== /mediauris/uris: ** ERROR:../../tests/test-mediauris.c:50:test_media: assertion failed (res == CURLE_OK): (28 == 0) + exit 1 Build step 'Execute shell' marked build as failure
1 1
0 0
[Libvirt-ci] Build failed in Jenkins: libvirt-build » libvirt-freebsd-10 #83
by ci@centos.org 08 Oct '18

08 Oct '18
See <https://ci.centos.org/job/libvirt-build/systems=libvirt-freebsd-10/83/displ…> Changes: [phrdina] util: introduce cgroup v2 files [phrdina] vircgroup: introduce virCgroupV2Available [phrdina] vircgroup: introduce virCgroupV2ValidateMachineGroup [phrdina] vircgroup: introduce virCgroupV2CopyMounts [phrdina] vircgroup: introduce virCgroupV2CopyPlacement [phrdina] vircgroup: introduce virCgroupV2DetectMounts [phrdina] vircgroup: introduce virCgroupV2DetectPlacement [phrdina] vircgroup: introduce virCgroupV2ValidatePlacement [phrdina] vircgroup: introduce virCgroupV2StealPlacement [phrdina] vircgroup: introduce virCgroupV2DetectControllers [phrdina] vircgroup: introduce virCgroupV2HasController [phrdina] vircgroup: introduce virCgroupV2GetAnyController [phrdina] vircgroup: introduce virCgroupV2PathOfController [phrdina] vircgroup: introduce virCgroupV2MakeGroup [phrdina] vircgroup: introduce virCgroupV2Remove [phrdina] vircgroup: introduce virCgroupV2AddTask [phrdina] vircgroup: introduce virCgroupV2HasEmptyTasks [phrdina] vircgroup: introduce virCgroupV2BindMount [phrdina] vircgroup: introduce virCgroupV2SetOwner [phrdina] vircgroup: introduce virCgroupV2(Set|Get)BlkioWeight [phrdina] vircgroup: introduce virCgroupV2GetBlkioIoServiced [phrdina] vircgroup: introduce virCgroupV2GetBlkioIoDeviceServiced [phrdina] vircgroup: introduce virCgroupV2(Set|Get)BlkioDeviceWeight [phrdina] vircgroup: introduce virCgroupV2(Set|Get)BlkioDeviceReadIops [phrdina] vircgroup: introduce virCgroupV2(Set|Get)BlkioDeviceWriteIops [phrdina] vircgroup: introduce virCgroupV2(Set|Get)BlkioDeviceReadBps [phrdina] vircgroup: introduce virCgroupV2(Set|Get)BlkioDeviceWriteBps [phrdina] vircgroup: introduce virCgroupV2SetMemory [phrdina] vircgroup: introduce virCgroupV2GetMemoryStat [phrdina] vircgroup: introduce virCgroupV2GetMemoryUsage [phrdina] vircgroup: introduce virCgroupV2(Set|Get)MemoryHardLimit [phrdina] vircgroup: introduce virCgroupV2(Set|Get)MemorySoftLimit [phrdina] vircgroup: introduce virCgroupV2(Set|Get)MemSwapHardLimit [phrdina] vircgroup: introduce virCgroupV2GetMemSwapUsage [phrdina] vircgroup: introduce virCgroupV2(Set|Get)CpuShares [phrdina] vircgroup: introduce virCgroupV2(Set|Get)CpuCfsPeriod [phrdina] vircgroup: introduce virCgroupV2(Set|Get)CpuCfsQuota [phrdina] vircgroup: introduce virCgroupV2SupportsCpuBW [phrdina] vircgroup: introduce virCgroupV2GetCpuacctUsage [phrdina] vircgroup: introduce virCgroupV2GetCpuacctStat [phrdina] vircgroup: register cgroup v2 backend [phrdina] vircgroup: add support for hybrid configuration [phrdina] vircgroupmock: change cgroup prefix [phrdina] vircgroupmock: add support to test cgroup v2 [phrdina] vircgrouptest: introduce initFakeFS and cleanupFakeFS helpers [phrdina] vircgrouptest: prepare testCgroupDetectMounts for cgroup v2 [phrdina] vircgrouptest: add detect mounts test for cgroup v2 [phrdina] vircgrouptest: add detect mounts test for hybrid cgroups [phrdina] vircgrouptest: prepare validateCgroup for cgroupv2 [phrdina] vircgrouptest: add cgroup v2 tests [phrdina] vircgrouptest: add hybrid tests [phrdina] virt-host-validate: rewrite cgroup detection to use util/vircgroup [phrdina] virt-host-validate: require freezer for LXC ------------------------------------------ [...truncated 141.25 KB...] CC rpc/libvirt_net_rpc_la-virkeepaliveprotocol.lo CC rpc/libvirt_net_rpc_la-virnetsshsession.lo CC rpc/libvirt_net_rpc_la-virnetsaslcontext.lo CC rpc/libvirt_net_rpc_la-virnetlibsshsession.lo CC locking/virtlockd-lock_daemon.o CC locking/virtlockd-lock_daemon_config.o CC locking/virtlockd-lock_daemon_dispatch.o CC locking/virtlockd-lock_protocol.o CC remote/libvirtd-remote_daemon.o CC remote/libvirtd-remote_daemon_config.o CC remote/libvirtd-remote_daemon_dispatch.o CC remote/libvirtd-remote_daemon_stream.o CC conf/libvirt_conf_la-netdev_vport_profile_conf.lo CC conf/libvirt_conf_la-netdev_bandwidth_conf.lo CC conf/libvirt_conf_la-netdev_vlan_conf.lo CC conf/libvirt_conf_la-capabilities.lo CC conf/libvirt_conf_la-domain_addr.lo CC conf/libvirt_conf_la-domain_capabilities.lo CC conf/libvirt_conf_la-domain_conf.lo CC conf/libvirt_conf_la-domain_audit.lo CC conf/libvirt_conf_la-domain_nwfilter.lo CC conf/libvirt_conf_la-virsavecookie.lo CC conf/libvirt_conf_la-snapshot_conf.lo CC conf/libvirt_conf_la-numa_conf.lo CC conf/libvirt_conf_la-virdomainobjlist.lo CC conf/libvirt_conf_la-object_event.lo CC conf/libvirt_conf_la-domain_event.lo CC conf/libvirt_conf_la-network_event.lo CC conf/libvirt_conf_la-storage_event.lo CC conf/libvirt_conf_la-node_device_event.lo CC conf/libvirt_conf_la-secret_event.lo CC conf/libvirt_conf_la-network_conf.lo CC conf/libvirt_conf_la-virnetworkobj.lo CC conf/libvirt_conf_la-networkcommon_conf.lo CC conf/libvirt_conf_la-nwfilter_params.lo CC conf/libvirt_conf_la-nwfilter_ipaddrmap.lo CC conf/libvirt_conf_la-nwfilter_conf.lo CC conf/libvirt_conf_la-virnwfilterobj.lo CC conf/libvirt_conf_la-virnwfilterbindingdef.lo CC conf/libvirt_conf_la-virnwfilterbindingobj.lo CC conf/libvirt_conf_la-virnwfilterbindingobjlist.lo CC conf/libvirt_conf_la-node_device_conf.lo CC conf/libvirt_conf_la-virnodedeviceobj.lo CC conf/libvirt_conf_la-storage_adapter_conf.lo CC conf/libvirt_conf_la-storage_conf.lo CC conf/libvirt_conf_la-virstorageobj.lo CC conf/libvirt_conf_la-interface_conf.lo CC conf/libvirt_conf_la-virinterfaceobj.lo CC conf/libvirt_conf_la-secret_conf.lo CC conf/libvirt_conf_la-virsecretobj.lo CC conf/libvirt_conf_la-cpu_conf.lo CC conf/libvirt_conf_la-virchrdev.lo CC conf/libvirt_conf_la-device_conf.lo CC cpu/libvirt_cpu_la-cpu.lo CC cpu/libvirt_cpu_la-cpu_x86.lo CC cpu/libvirt_cpu_la-cpu_s390.lo CC cpu/libvirt_cpu_la-cpu_arm.lo CC cpu/libvirt_cpu_la-cpu_ppc64.lo CC cpu/libvirt_cpu_la-cpu_map.lo CC security/libvirt_security_manager_la-security_driver.lo CC security/libvirt_security_manager_la-security_nop.lo CC security/libvirt_security_manager_la-security_stack.lo CC security/libvirt_security_manager_la-security_dac.lo CC security/libvirt_security_manager_la-security_manager.lo CC access/libvirt_driver_access_la-viraccessperm.lo CC access/libvirt_driver_access_la-viraccessmanager.lo CC access/libvirt_driver_access_la-viraccessdrivernop.lo CC access/libvirt_driver_access_la-viraccessdriverstack.lo CC access/libvirt_driver_access_la-viraccessapicheck.lo CC access/libvirt_driver_access_la-viraccessapicheckqemu.lo CC access/libvirt_driver_access_la-viraccessapichecklxc.lo CC access/libvirt_driver_access_la-viraccessdriverpolkit.lo CCLD libvirt-net-rpc-client.la CC phyp/libvirt_driver_phyp_la-phyp_driver.lo CC test/libvirt_driver_test_la-test_driver.lo CC esx/libvirt_driver_esx_la-esx_driver.lo CC esx/libvirt_driver_esx_la-esx_interface_driver.lo CC esx/libvirt_driver_esx_la-esx_network_driver.lo CC esx/libvirt_driver_esx_la-esx_storage_driver.lo CC esx/libvirt_driver_esx_la-esx_storage_backend_vmfs.lo CC esx/libvirt_driver_esx_la-esx_storage_backend_iscsi.lo CC esx/libvirt_driver_esx_la-esx_stream.lo CC esx/libvirt_driver_esx_la-esx_util.lo CC esx/libvirt_driver_esx_la-esx_vi.lo CC esx/libvirt_driver_esx_la-esx_vi_methods.lo CC esx/libvirt_driver_esx_la-esx_vi_types.lo CC vmx/libvirt_vmx_la-vmx.lo CC vmware/libvirt_driver_vmware_la-vmware_driver.lo CC vmware/libvirt_driver_vmware_la-vmware_conf.lo CC secret/libvirt_secret_la-secret_util.lo CCLD libvirt_driver_remote.la CCLD libvirt_driver.la CC vbox/libvirt_driver_vbox_impl_la-vbox_glue.lo CC vbox/libvirt_driver_vbox_impl_la-vbox_driver.lo CC vbox/libvirt_driver_vbox_impl_la-vbox_snapshot_conf.lo CC vbox/libvirt_driver_vbox_impl_la-vbox_V4_0.lo CC vbox/libvirt_driver_vbox_impl_la-vbox_V4_1.lo CC vbox/libvirt_driver_vbox_impl_la-vbox_V4_2.lo CC vbox/libvirt_driver_vbox_impl_la-vbox_V4_2_20.lo CC vbox/libvirt_driver_vbox_impl_la-vbox_V4_3.lo CC vbox/libvirt_driver_vbox_impl_la-vbox_V4_3_4.lo CC vbox/libvirt_driver_vbox_impl_la-vbox_V5_0.lo CC vbox/libvirt_driver_vbox_impl_la-vbox_V5_1.lo CC vbox/libvirt_driver_vbox_impl_la-vbox_V5_2.lo CC vbox/libvirt_driver_vbox_impl_la-vbox_common.lo CC vbox/libvirt_driver_vbox_impl_la-vbox_network.lo CC vbox/libvirt_driver_vbox_impl_la-vbox_storage.lo CC qemu/libvirt_driver_qemu_impl_la-qemu_agent.lo CC qemu/libvirt_driver_qemu_impl_la-qemu_alias.lo CC qemu/libvirt_driver_qemu_impl_la-qemu_block.lo CC qemu/libvirt_driver_qemu_impl_la-qemu_blockjob.lo CC qemu/libvirt_driver_qemu_impl_la-qemu_capabilities.lo CC qemu/libvirt_driver_qemu_impl_la-qemu_command.lo CC qemu/libvirt_driver_qemu_impl_la-qemu_parse_command.lo CC qemu/libvirt_driver_qemu_impl_la-qemu_domain.lo CC qemu/libvirt_driver_qemu_impl_la-qemu_domain_address.lo CC qemu/libvirt_driver_qemu_impl_la-qemu_cgroup.lo CC qemu/libvirt_driver_qemu_impl_la-qemu_extdevice.lo CC qemu/libvirt_driver_qemu_impl_la-qemu_hostdev.lo CC qemu/libvirt_driver_qemu_impl_la-qemu_hotplug.lo CC qemu/libvirt_driver_qemu_impl_la-qemu_conf.lo CC qemu/libvirt_driver_qemu_impl_la-qemu_process.lo CC qemu/libvirt_driver_qemu_impl_la-qemu_migration.lo CC qemu/libvirt_driver_qemu_impl_la-qemu_migration_cookie.lo CC qemu/libvirt_driver_qemu_impl_la-qemu_migration_params.lo CC qemu/libvirt_driver_qemu_impl_la-qemu_monitor.lo CC qemu/libvirt_driver_qemu_impl_la-qemu_monitor_text.lo CC qemu/libvirt_driver_qemu_impl_la-qemu_monitor_json.lo CC qemu/libvirt_driver_qemu_impl_la-qemu_driver.lo CC qemu/libvirt_driver_qemu_impl_la-qemu_interface.lo CC qemu/libvirt_driver_qemu_impl_la-qemu_security.lo CC qemu/libvirt_driver_qemu_impl_la-qemu_qapi.lo CC qemu/libvirt_driver_qemu_impl_la-qemu_tpm.lo CC bhyve/libvirt_driver_bhyve_impl_la-bhyve_capabilities.lo CC bhyve/libvirt_driver_bhyve_impl_la-bhyve_command.lo CC bhyve/libvirt_driver_bhyve_impl_la-bhyve_conf.lo CC bhyve/libvirt_driver_bhyve_impl_la-bhyve_parse_command.lo CC bhyve/libvirt_driver_bhyve_impl_la-bhyve_device.lo CC bhyve/libvirt_driver_bhyve_impl_la-bhyve_domain.lo CC bhyve/libvirt_driver_bhyve_impl_la-bhyve_driver.lo CC bhyve/libvirt_driver_bhyve_impl_la-bhyve_monitor.lo CC bhyve/libvirt_driver_bhyve_impl_la-bhyve_process.lo CCLD libvirt_driver_network_impl.la CC node_device/libvirt_driver_nodedev_la-node_device_driver.lo CC node_device/libvirt_driver_nodedev_la-node_device_hal.lo CC storage/libvirt_driver_storage_impl_la-storage_driver.lo CC storage/libvirt_driver_storage_impl_la-storage_backend.lo CC storage/libvirt_driver_storage_impl_la-storage_util.lo CCLD libvirt-nss.la GEN util/virkeycode-linux.7 GEN util/virkeycode-osx.7 GEN util/virkeycode-atset1.7 GEN util/virkeycode-atset2.7 GEN util/virkeycode-atset3.7 GEN util/virkeycode-xtkbd.7 GEN util/virkeycode-usb.7 GEN util/virkeycode-win32.7 GEN util/virkeycode-qnum.7 GEN util/virkeyname-linux.7 GEN util/virkeyname-osx.7 GEN util/virkeyname-win32.7 GEN virtlogd.8 GEN virtlockd.8 GEN libvirtd.8 CCLD libvirt_util.la CCLD libvirt_driver_admin.la CCLD libvirt-net-rpc-server.la CCLD libvirt-net-rpc.la CCLD libvirt_conf.la CCLD libvirt_cpu.la CCLD libvirt_security_manager.la CCLD libvirt_driver_access.la CCLD libvirt_driver_phyp.la CCLD libvirt_driver_test.la CCLD libvirt_driver_esx.la CCLD libvirt_vmx.la CCLD libvirt_driver_vmware.la CCLD libvirt_secret.la CCLD libvirt_driver_vbox_impl.la CCLD libvirt_driver_qemu_impl.la CCLD libvirt_driver_bhyve_impl.la CCLD libvirt_driver_storage_impl.la CCLD libvirt_leaseshelper CCLD libvirt_iohelper CCLD virtlogd CCLD virtlockd CCLD libvirt.la CCLD libvirt-lxc.la CCLD libvirt-qemu.la CCLD libvirt-admin.la CCLD lockd.la CCLD libvirt_driver_vbox.la CCLD libvirt_driver_qemu.la CCLD libvirt_driver_bhyve.la CCLD libvirt_driver_network.la CCLD libvirt_driver_nodedev.la CCLD libvirt_driver_secret.la CCLD libvirt_driver_storage.la CCLD libvirt_storage_backend_fs.la CCLD libvirt_storage_backend_zfs.la CCLD libvirt_storage_file_fs.la CCLD libvirtd rm util/virkeycode-xtkbd.pod util/virkeycode-atset3.pod util/virkeycode-usb.pod util/virkeycode-qnum.pod util/virkeyname-linux.pod util/virkeycode-osx.pod util/virkeycode-linux.pod util/virkeyname-osx.pod util/virkeycode-atset1.pod util/virkeyname-win32.pod util/virkeycode-atset2.pod util/virkeycode-win32.pod gmake[3]: Leaving directory '/usr<https://ci.centos.org/job/libvirt-build/systems=libvirt-freebsd-10/ws/build…'> gmake[2]: Leaving directory '/usr<https://ci.centos.org/job/libvirt-build/systems=libvirt-freebsd-10/ws/build…'> Making all in tools gmake[2]: Entering directory '/usr<https://ci.centos.org/job/libvirt-build/systems=libvirt-freebsd-10/ws/build…'> GEN libvirt-guests.sh /usr/local/bin/gmake all-am gmake[3]: Entering directory '/usr<https://ci.centos.org/job/libvirt-build/systems=libvirt-freebsd-10/ws/build…'> CC virsh-virsh.o CC virsh-virsh-completer.o CC virsh-virsh-console.o CC virsh-virsh-domain.o CC virsh-virsh-host.o CC virsh-virsh-domain-monitor.o CC virsh-virsh-interface.o CC virsh-virsh-network.o CC virsh-virsh-nodedev.o CC virsh-virsh-nwfilter.o CC virsh-virsh-pool.o CC virsh-virsh-secret.o CC virsh-virsh-snapshot.o CC virsh-virsh-util.o CC virsh-virsh-volume.o CC libvirt_shell_la-vsh.lo CC libvirt_shell_la-vsh-table.lo CC virt_admin-virt-admin.o CC virt_admin-virt-admin-completer.o CC virt_host_validate-virt-host-validate.o CC virt_host_validate-virt-host-validate-common.o CC virt_host_validate-virt-host-validate-qemu.o CC virt_host_validate-virt-host-validate-bhyve.o ../../tools/virt-host-validate-common.c:325:50: error: unused parameter 'hvname' [-Werror,-Wunused-parameter] int virHostValidateCGroupControllers(const char *hvname, ^ ../../tools/virt-host-validate-common.c:326:42: error: unused parameter 'controllers' [-Werror,-Wunused-parameter] int controllers, ^ 2 errors generated. gmake[3]: *** [Makefile:3119: virt_host_validate-virt-host-validate-common.o] Error 1 gmake[3]: *** Waiting for unfinished jobs.... gmake[3]: Leaving directory '/usr<https://ci.centos.org/job/libvirt-build/systems=libvirt-freebsd-10/ws/build…'> gmake[2]: *** [Makefile:2430: all] Error 2 gmake[2]: Leaving directory '/usr<https://ci.centos.org/job/libvirt-build/systems=libvirt-freebsd-10/ws/build…'> gmake[1]: *** [Makefile:2111: all-recursive] Error 1 gmake[1]: Leaving directory '/usr<https://ci.centos.org/job/libvirt-build/systems=libvirt-freebsd-10/ws/build'> gmake: *** [Makefile:2004: all] Error 2 Build step 'Execute shell' marked build as failure
1 1
0 0
[Libvirt-ci] Build failed in Jenkins: libvirt-build » libvirt-freebsd-11 #83
by ci@centos.org 08 Oct '18

08 Oct '18
See <https://ci.centos.org/job/libvirt-build/systems=libvirt-freebsd-11/83/displ…> Changes: [phrdina] util: introduce cgroup v2 files [phrdina] vircgroup: introduce virCgroupV2Available [phrdina] vircgroup: introduce virCgroupV2ValidateMachineGroup [phrdina] vircgroup: introduce virCgroupV2CopyMounts [phrdina] vircgroup: introduce virCgroupV2CopyPlacement [phrdina] vircgroup: introduce virCgroupV2DetectMounts [phrdina] vircgroup: introduce virCgroupV2DetectPlacement [phrdina] vircgroup: introduce virCgroupV2ValidatePlacement [phrdina] vircgroup: introduce virCgroupV2StealPlacement [phrdina] vircgroup: introduce virCgroupV2DetectControllers [phrdina] vircgroup: introduce virCgroupV2HasController [phrdina] vircgroup: introduce virCgroupV2GetAnyController [phrdina] vircgroup: introduce virCgroupV2PathOfController [phrdina] vircgroup: introduce virCgroupV2MakeGroup [phrdina] vircgroup: introduce virCgroupV2Remove [phrdina] vircgroup: introduce virCgroupV2AddTask [phrdina] vircgroup: introduce virCgroupV2HasEmptyTasks [phrdina] vircgroup: introduce virCgroupV2BindMount [phrdina] vircgroup: introduce virCgroupV2SetOwner [phrdina] vircgroup: introduce virCgroupV2(Set|Get)BlkioWeight [phrdina] vircgroup: introduce virCgroupV2GetBlkioIoServiced [phrdina] vircgroup: introduce virCgroupV2GetBlkioIoDeviceServiced [phrdina] vircgroup: introduce virCgroupV2(Set|Get)BlkioDeviceWeight [phrdina] vircgroup: introduce virCgroupV2(Set|Get)BlkioDeviceReadIops [phrdina] vircgroup: introduce virCgroupV2(Set|Get)BlkioDeviceWriteIops [phrdina] vircgroup: introduce virCgroupV2(Set|Get)BlkioDeviceReadBps [phrdina] vircgroup: introduce virCgroupV2(Set|Get)BlkioDeviceWriteBps [phrdina] vircgroup: introduce virCgroupV2SetMemory [phrdina] vircgroup: introduce virCgroupV2GetMemoryStat [phrdina] vircgroup: introduce virCgroupV2GetMemoryUsage [phrdina] vircgroup: introduce virCgroupV2(Set|Get)MemoryHardLimit [phrdina] vircgroup: introduce virCgroupV2(Set|Get)MemorySoftLimit [phrdina] vircgroup: introduce virCgroupV2(Set|Get)MemSwapHardLimit [phrdina] vircgroup: introduce virCgroupV2GetMemSwapUsage [phrdina] vircgroup: introduce virCgroupV2(Set|Get)CpuShares [phrdina] vircgroup: introduce virCgroupV2(Set|Get)CpuCfsPeriod [phrdina] vircgroup: introduce virCgroupV2(Set|Get)CpuCfsQuota [phrdina] vircgroup: introduce virCgroupV2SupportsCpuBW [phrdina] vircgroup: introduce virCgroupV2GetCpuacctUsage [phrdina] vircgroup: introduce virCgroupV2GetCpuacctStat [phrdina] vircgroup: register cgroup v2 backend [phrdina] vircgroup: add support for hybrid configuration [phrdina] vircgroupmock: change cgroup prefix [phrdina] vircgroupmock: add support to test cgroup v2 [phrdina] vircgrouptest: introduce initFakeFS and cleanupFakeFS helpers [phrdina] vircgrouptest: prepare testCgroupDetectMounts for cgroup v2 [phrdina] vircgrouptest: add detect mounts test for cgroup v2 [phrdina] vircgrouptest: add detect mounts test for hybrid cgroups [phrdina] vircgrouptest: prepare validateCgroup for cgroupv2 [phrdina] vircgrouptest: add cgroup v2 tests [phrdina] vircgrouptest: add hybrid tests [phrdina] virt-host-validate: rewrite cgroup detection to use util/vircgroup [phrdina] virt-host-validate: require freezer for LXC ------------------------------------------ [...truncated 141.10 KB...] CC locking/virtlockd-lock_daemon_dispatch.o CC locking/virtlockd-lock_protocol.o CC remote/libvirtd-remote_daemon.o CC remote/libvirtd-remote_daemon_config.o CC remote/libvirtd-remote_daemon_dispatch.o CC remote/libvirtd-remote_daemon_stream.o CC conf/libvirt_conf_la-netdev_bandwidth_conf.lo CC conf/libvirt_conf_la-netdev_vport_profile_conf.lo CC conf/libvirt_conf_la-netdev_vlan_conf.lo CC conf/libvirt_conf_la-capabilities.lo CC conf/libvirt_conf_la-domain_addr.lo CC conf/libvirt_conf_la-domain_capabilities.lo CC conf/libvirt_conf_la-domain_conf.lo CC conf/libvirt_conf_la-domain_audit.lo CC conf/libvirt_conf_la-domain_nwfilter.lo CC conf/libvirt_conf_la-virsavecookie.lo CC conf/libvirt_conf_la-snapshot_conf.lo CC conf/libvirt_conf_la-numa_conf.lo CC conf/libvirt_conf_la-virdomainobjlist.lo CC conf/libvirt_conf_la-object_event.lo CC conf/libvirt_conf_la-domain_event.lo CC conf/libvirt_conf_la-network_event.lo CC conf/libvirt_conf_la-storage_event.lo CC conf/libvirt_conf_la-node_device_event.lo CC conf/libvirt_conf_la-secret_event.lo CC conf/libvirt_conf_la-network_conf.lo CC conf/libvirt_conf_la-virnetworkobj.lo CC conf/libvirt_conf_la-networkcommon_conf.lo CC conf/libvirt_conf_la-nwfilter_params.lo CC conf/libvirt_conf_la-nwfilter_ipaddrmap.lo CC conf/libvirt_conf_la-nwfilter_conf.lo CC conf/libvirt_conf_la-virnwfilterobj.lo CC conf/libvirt_conf_la-virnwfilterbindingdef.lo CC conf/libvirt_conf_la-virnwfilterbindingobj.lo CC conf/libvirt_conf_la-virnwfilterbindingobjlist.lo CC conf/libvirt_conf_la-node_device_conf.lo CC conf/libvirt_conf_la-virnodedeviceobj.lo CC conf/libvirt_conf_la-storage_adapter_conf.lo CC conf/libvirt_conf_la-storage_conf.lo CC conf/libvirt_conf_la-virstorageobj.lo CC conf/libvirt_conf_la-interface_conf.lo CC conf/libvirt_conf_la-virinterfaceobj.lo CC conf/libvirt_conf_la-secret_conf.lo CC conf/libvirt_conf_la-virsecretobj.lo CC conf/libvirt_conf_la-cpu_conf.lo CC conf/libvirt_conf_la-virchrdev.lo CC conf/libvirt_conf_la-device_conf.lo CC cpu/libvirt_cpu_la-cpu.lo CC cpu/libvirt_cpu_la-cpu_x86.lo CC cpu/libvirt_cpu_la-cpu_s390.lo CC cpu/libvirt_cpu_la-cpu_arm.lo CC cpu/libvirt_cpu_la-cpu_ppc64.lo CC cpu/libvirt_cpu_la-cpu_map.lo CC security/libvirt_security_manager_la-security_driver.lo CC security/libvirt_security_manager_la-security_nop.lo CC security/libvirt_security_manager_la-security_stack.lo CC security/libvirt_security_manager_la-security_dac.lo CC security/libvirt_security_manager_la-security_manager.lo CC access/libvirt_driver_access_la-viraccessperm.lo CC access/libvirt_driver_access_la-viraccessmanager.lo CC access/libvirt_driver_access_la-viraccessdrivernop.lo CC access/libvirt_driver_access_la-viraccessdriverstack.lo CC access/libvirt_driver_access_la-viraccessapicheck.lo CC access/libvirt_driver_access_la-viraccessapicheckqemu.lo CC access/libvirt_driver_access_la-viraccessapichecklxc.lo CC access/libvirt_driver_access_la-viraccessdriverpolkit.lo CCLD libvirt-net-rpc-client.la CC phyp/libvirt_driver_phyp_la-phyp_driver.lo CC test/libvirt_driver_test_la-test_driver.lo CC esx/libvirt_driver_esx_la-esx_driver.lo CC esx/libvirt_driver_esx_la-esx_interface_driver.lo CC esx/libvirt_driver_esx_la-esx_network_driver.lo CC esx/libvirt_driver_esx_la-esx_storage_driver.lo CC esx/libvirt_driver_esx_la-esx_storage_backend_vmfs.lo CC esx/libvirt_driver_esx_la-esx_storage_backend_iscsi.lo CC esx/libvirt_driver_esx_la-esx_stream.lo CC esx/libvirt_driver_esx_la-esx_util.lo CC esx/libvirt_driver_esx_la-esx_vi.lo CC esx/libvirt_driver_esx_la-esx_vi_methods.lo CC esx/libvirt_driver_esx_la-esx_vi_types.lo CC vmx/libvirt_vmx_la-vmx.lo CC vmware/libvirt_driver_vmware_la-vmware_driver.lo CC vmware/libvirt_driver_vmware_la-vmware_conf.lo CC secret/libvirt_secret_la-secret_util.lo CCLD libvirt_driver_remote.la CCLD libvirt_driver.la CC vbox/libvirt_driver_vbox_impl_la-vbox_glue.lo CC vbox/libvirt_driver_vbox_impl_la-vbox_driver.lo CC vbox/libvirt_driver_vbox_impl_la-vbox_snapshot_conf.lo CC vbox/libvirt_driver_vbox_impl_la-vbox_V4_0.lo CC vbox/libvirt_driver_vbox_impl_la-vbox_V4_1.lo CC vbox/libvirt_driver_vbox_impl_la-vbox_V4_2.lo CC vbox/libvirt_driver_vbox_impl_la-vbox_V4_2_20.lo CC vbox/libvirt_driver_vbox_impl_la-vbox_V4_3.lo CC vbox/libvirt_driver_vbox_impl_la-vbox_V4_3_4.lo CC vbox/libvirt_driver_vbox_impl_la-vbox_V5_0.lo CC vbox/libvirt_driver_vbox_impl_la-vbox_V5_1.lo CC vbox/libvirt_driver_vbox_impl_la-vbox_V5_2.lo CC vbox/libvirt_driver_vbox_impl_la-vbox_common.lo CC vbox/libvirt_driver_vbox_impl_la-vbox_network.lo CC vbox/libvirt_driver_vbox_impl_la-vbox_storage.lo CC qemu/libvirt_driver_qemu_impl_la-qemu_agent.lo CC qemu/libvirt_driver_qemu_impl_la-qemu_alias.lo CC qemu/libvirt_driver_qemu_impl_la-qemu_block.lo CC qemu/libvirt_driver_qemu_impl_la-qemu_blockjob.lo CC qemu/libvirt_driver_qemu_impl_la-qemu_capabilities.lo CC qemu/libvirt_driver_qemu_impl_la-qemu_command.lo CC qemu/libvirt_driver_qemu_impl_la-qemu_parse_command.lo CC qemu/libvirt_driver_qemu_impl_la-qemu_domain.lo CC qemu/libvirt_driver_qemu_impl_la-qemu_domain_address.lo CC qemu/libvirt_driver_qemu_impl_la-qemu_cgroup.lo CC qemu/libvirt_driver_qemu_impl_la-qemu_extdevice.lo CC qemu/libvirt_driver_qemu_impl_la-qemu_hostdev.lo CC qemu/libvirt_driver_qemu_impl_la-qemu_hotplug.lo CC qemu/libvirt_driver_qemu_impl_la-qemu_conf.lo CC qemu/libvirt_driver_qemu_impl_la-qemu_process.lo CC qemu/libvirt_driver_qemu_impl_la-qemu_migration.lo CC qemu/libvirt_driver_qemu_impl_la-qemu_migration_cookie.lo CC qemu/libvirt_driver_qemu_impl_la-qemu_migration_params.lo CC qemu/libvirt_driver_qemu_impl_la-qemu_monitor.lo CC qemu/libvirt_driver_qemu_impl_la-qemu_monitor_text.lo CC qemu/libvirt_driver_qemu_impl_la-qemu_monitor_json.lo CC qemu/libvirt_driver_qemu_impl_la-qemu_driver.lo CC qemu/libvirt_driver_qemu_impl_la-qemu_interface.lo CC qemu/libvirt_driver_qemu_impl_la-qemu_security.lo CC qemu/libvirt_driver_qemu_impl_la-qemu_qapi.lo CC qemu/libvirt_driver_qemu_impl_la-qemu_tpm.lo CC bhyve/libvirt_driver_bhyve_impl_la-bhyve_capabilities.lo CC bhyve/libvirt_driver_bhyve_impl_la-bhyve_command.lo CC bhyve/libvirt_driver_bhyve_impl_la-bhyve_conf.lo CC bhyve/libvirt_driver_bhyve_impl_la-bhyve_parse_command.lo CC bhyve/libvirt_driver_bhyve_impl_la-bhyve_device.lo CC bhyve/libvirt_driver_bhyve_impl_la-bhyve_domain.lo CC bhyve/libvirt_driver_bhyve_impl_la-bhyve_driver.lo CC bhyve/libvirt_driver_bhyve_impl_la-bhyve_monitor.lo CC bhyve/libvirt_driver_bhyve_impl_la-bhyve_process.lo CCLD libvirt_driver_network_impl.la CC node_device/libvirt_driver_nodedev_la-node_device_driver.lo CC node_device/libvirt_driver_nodedev_la-node_device_hal.lo CC storage/libvirt_driver_storage_impl_la-storage_driver.lo CC storage/libvirt_driver_storage_impl_la-storage_backend.lo CC storage/libvirt_driver_storage_impl_la-storage_util.lo CCLD libvirt-nss.la GEN util/virkeycode-linux.7 GEN util/virkeycode-osx.7 GEN util/virkeycode-atset1.7 GEN util/virkeycode-atset2.7 GEN util/virkeycode-atset3.7 GEN util/virkeycode-xtkbd.7 GEN util/virkeycode-usb.7 GEN util/virkeycode-win32.7 GEN util/virkeycode-qnum.7 GEN util/virkeyname-linux.7 GEN util/virkeyname-osx.7 GEN util/virkeyname-win32.7 GEN virtlogd.8 GEN virtlockd.8 GEN libvirtd.8 CCLD libvirt_util.la CCLD libvirt_driver_admin.la CCLD libvirt-net-rpc-server.la CCLD libvirt-net-rpc.la CCLD libvirt_conf.la CCLD libvirt_cpu.la CCLD libvirt_security_manager.la CCLD libvirt_driver_access.la CCLD libvirt_driver_phyp.la CCLD libvirt_driver_test.la CCLD libvirt_driver_esx.la CCLD libvirt_vmx.la CCLD libvirt_driver_vmware.la CCLD libvirt_secret.la CCLD libvirt_driver_vbox_impl.la CCLD libvirt_driver_qemu_impl.la CCLD libvirt_driver_bhyve_impl.la CCLD libvirt_driver_storage_impl.la CCLD libvirt_leaseshelper CCLD libvirt_iohelper CCLD virtlogd CCLD virtlockd CCLD libvirt.la CCLD libvirt-lxc.la CCLD libvirt-qemu.la CCLD libvirt-admin.la CCLD lockd.la CCLD libvirt_driver_vbox.la CCLD libvirt_driver_qemu.la CCLD libvirt_driver_bhyve.la CCLD libvirt_driver_network.la CCLD libvirt_driver_nodedev.la CCLD libvirt_driver_secret.la CCLD libvirt_driver_storage.la CCLD libvirt_storage_backend_fs.la CCLD libvirt_storage_backend_zfs.la CCLD libvirt_storage_file_fs.la CCLD libvirtd rm util/virkeycode-xtkbd.pod util/virkeycode-atset3.pod util/virkeycode-usb.pod util/virkeycode-qnum.pod util/virkeyname-linux.pod util/virkeycode-osx.pod util/virkeycode-linux.pod util/virkeyname-osx.pod util/virkeycode-atset1.pod util/virkeyname-win32.pod util/virkeycode-atset2.pod util/virkeycode-win32.pod gmake[3]: Leaving directory '/usr<https://ci.centos.org/job/libvirt-build/systems=libvirt-freebsd-11/ws/build…'> gmake[2]: Leaving directory '/usr<https://ci.centos.org/job/libvirt-build/systems=libvirt-freebsd-11/ws/build…'> Making all in tools gmake[2]: Entering directory '/usr<https://ci.centos.org/job/libvirt-build/systems=libvirt-freebsd-11/ws/build…'> GEN libvirt-guests.sh /usr/local/bin/gmake all-am gmake[3]: Entering directory '/usr<https://ci.centos.org/job/libvirt-build/systems=libvirt-freebsd-11/ws/build…'> CC virsh-virsh-completer.o CC virsh-virsh.o CC virsh-virsh-console.o CC virsh-virsh-domain.o CC virsh-virsh-domain-monitor.o CC virsh-virsh-host.o CC virsh-virsh-interface.o CC virsh-virsh-network.o CC virsh-virsh-nodedev.o CC virsh-virsh-nwfilter.o CC virsh-virsh-pool.o CC virsh-virsh-secret.o CC virsh-virsh-snapshot.o CC virsh-virsh-util.o CC virsh-virsh-volume.o CC libvirt_shell_la-vsh.lo CC libvirt_shell_la-vsh-table.lo CC virt_admin-virt-admin.o CC virt_admin-virt-admin-completer.o CC virt_host_validate-virt-host-validate.o CC virt_host_validate-virt-host-validate-common.o CC virt_host_validate-virt-host-validate-qemu.o CC virt_host_validate-virt-host-validate-bhyve.o GEN virt-xml-validate GEN virt-pki-validate GEN virt-pki-validate.1.in GEN virt-xml-validate.1.in GEN virsh.1.in GEN virt-admin.1.in ../../tools/virt-host-validate-common.c:325:50: error: unused parameter 'hvname' [-Werror,-Wunused-parameter] int virHostValidateCGroupControllers(const char *hvname, ^ ../../tools/virt-host-validate-common.c:326:42: error: unused parameter 'controllers' [-Werror,-Wunused-parameter] int controllers, ^ 2 errors generated. gmake[3]: *** [Makefile:3119: virt_host_validate-virt-host-validate-common.o] Error 1 gmake[3]: *** Waiting for unfinished jobs.... gmake[3]: Leaving directory '/usr<https://ci.centos.org/job/libvirt-build/systems=libvirt-freebsd-11/ws/build…'> gmake[2]: *** [Makefile:2430: all] Error 2 gmake[2]: Leaving directory '/usr<https://ci.centos.org/job/libvirt-build/systems=libvirt-freebsd-11/ws/build…'> gmake[1]: *** [Makefile:2111: all-recursive] Error 1 gmake[1]: Leaving directory '/usr<https://ci.centos.org/job/libvirt-build/systems=libvirt-freebsd-11/ws/build'> gmake: *** [Makefile:2004: all] Error 2 Build step 'Execute shell' marked build as failure
1 1
0 0
[Libvirt-ci] Fixed: libvirt/libvirt#1747 (master - 8524faf)
by Travis CI 08 Oct '18

08 Oct '18
Build Update for libvirt/libvirt ------------------------------------- Build: #1747 Status: Fixed Duration: 21 mins and 14 secs Commit: 8524faf (master) Author: Michal Privoznik Message: virt-host-validate: Fix build on non-Linux For non-Linux platforms we have virHostValidateCGroupControllers() stub which only reports an error. But we are not marking the ignored arguments the way we should. Signed-off-by: Michal Privoznik <mprivozn(a)redhat.com> Reviewed-by: Pavel Hrdina <phrdina(a)redhat.com> View the changeset: https://github.com/libvirt/libvirt/compare/0a7101c89b78...8524faf8c400 View the full build log and details: https://travis-ci.org/libvirt/libvirt/builds/438500530?utm_medium=notificat… -- You can unsubscribe from build emails from the libvirt/libvirt repository going to https://travis-ci.org/account/preferences/unsubscribe?repository=4872032&ut…. Or unsubscribe from *all* email updating your settings at https://travis-ci.org/account/preferences/unsubscribe?utm_medium=notificati…. Or configure specific recipients for build notifications in your .travis.yml file. See https://docs.travis-ci.com/user/notifications.
1 0
0 0
[Libvirt-ci] Build failed in Jenkins: virt-manager-build » libvirt-freebsd-11 #95
by ci@centos.org 05 Oct '18

05 Oct '18
See <https://ci.centos.org/job/virt-manager-build/systems=libvirt-freebsd-11/95/…> Changes: [crobinso] support: Limit qemu-xhci check to qemu 2.9.0 ------------------------------------------ Started by upstream project "virt-manager-build" build number 95 originally caused by: Started by an SCM change [EnvInject] - Loading node environment variables. Building remotely on libvirt-freebsd-11 (libvirt) in workspace <https://ci.centos.org/job/virt-manager-build/systems=libvirt-freebsd-11/ws/> > git rev-parse --is-inside-work-tree # timeout=10 Fetching changes from the remote Git repository > git config remote.origin.url https://github.com/virt-manager/virt-manager.git # timeout=10 Fetching upstream changes from https://github.com/virt-manager/virt-manager.git > git --version # timeout=10 > git fetch --tags --progress https://github.com/virt-manager/virt-manager.git +refs/heads/*:refs/remotes/origin/* Checking out Revision 40dc4b11313812749b402b3784308040af405c31 (refs/remotes/origin/master) > git config core.sparsecheckout # timeout=10 > git checkout -f 40dc4b11313812749b402b3784308040af405c31 Commit message: "support: Limit qemu-xhci check to qemu 2.9.0" > git rev-list --no-walk 945c0125db87760679251f641932d45d2260f542 # timeout=10 Cleaning workspace > git rev-parse --verify HEAD # timeout=10 Resetting working tree > git reset --hard # timeout=10 > git clean -fdx # timeout=10 [virt-manager] $ /bin/sh -xe /tmp/jenkins515389818338991626.sh + /usr/local/bin/python3 ./setup.py configure '--prefix=/home/jenkins/build/libvirt' Shared object "libdl.so.1" not found, required by "python3" Build step 'Execute shell' marked build as failure
1 1
0 0
[Libvirt-ci] Build failed in Jenkins: libvirt-go-check » libvirt-freebsd-11 #59
by ci@centos.org 05 Oct '18

05 Oct '18
See <https://ci.centos.org/job/libvirt-go-check/systems=libvirt-freebsd-11/59/di…> ------------------------------------------ Started by upstream project "libvirt-go-check" build number 59 originally caused by: Started by upstream project "libvirt-go-build" build number 59 originally caused by: Started by an SCM change [EnvInject] - Loading node environment variables. Building remotely on libvirt-freebsd-11 (libvirt) in workspace <https://ci.centos.org/job/libvirt-go-check/systems=libvirt-freebsd-11/ws/> [libvirt-go] $ /bin/sh -xe /tmp/jenkins3507720557404559190.sh + export 'TEST_ARGS=-tags api' + go test -tags api # _/usr<https://ci.centos.org/job/libvirt-go-check/systems=libvirt-freebsd-11/ws/> /usr/bin/ld: warning: libdl.so.1, needed by //usr/local/lib/libgnutls.so.30, not found (try using -rpath or -rpath-link) # _/usr<https://ci.centos.org/job/libvirt-go-check/systems=libvirt-freebsd-11/ws/.t…> /usr/bin/ld: warning: libdl.so.1, needed by //usr/local/lib/libgnutls.so.30, not found (try using -rpath or -rpath-link) Shared object "libdl.so.1" not found, required by "libgnutls.so.30" exit status 1 FAIL _/usr<https://ci.centos.org/job/libvirt-go-check/systems=libvirt-freebsd-11/ws/> 0.014s Build step 'Execute shell' marked build as failure
1 1
0 0
[Libvirt-ci] Broken: libvirt/libvirt#1746 (master - 0a7101c)
by Travis CI 05 Oct '18

05 Oct '18
Build Update for libvirt/libvirt ------------------------------------- Build: #1746 Status: Broken Duration: 29 mins and 52 secs Commit: 0a7101c (master) Author: Pavel Hrdina Message: virt-host-validate: require freezer for LXC Cgroup freezer support for LXC was added in libvirt-0.7.2. Signed-off-by: Pavel Hrdina <phrdina(a)redhat.com> View the changeset: https://github.com/libvirt/libvirt/compare/87f71398fe6c...0a7101c89b78 View the full build log and details: https://travis-ci.org/libvirt/libvirt/builds/437639913?utm_medium=notificat… -- You can unsubscribe from build emails from the libvirt/libvirt repository going to https://travis-ci.org/account/preferences/unsubscribe?repository=4872032&ut…. Or unsubscribe from *all* email updating your settings at https://travis-ci.org/account/preferences/unsubscribe?utm_medium=notificati…. Or configure specific recipients for build notifications in your .travis.yml file. See https://docs.travis-ci.com/user/notifications.
1 0
0 0
  • ← Newer
  • 1
  • 2
  • 3
  • 4
  • 5
  • 6
  • 7
  • 8
  • 9
  • 10
  • Older →

HyperKitty Powered by HyperKitty version 1.3.12.