libvirt List Archives
Sign In Sign Up
Manage this list Sign In Sign Up

Keyboard Shortcuts

Thread View

  • j: Next unread message
  • k: Previous unread message
  • j a: Jump to all threads
  • j l: Jump to MailingList overview

CI

Thread Start a new thread
Download
Threads by month
  • ----- 2025 -----
  • August
  • July
  • June
  • May
  • April
  • March
  • February
  • January
  • ----- 2024 -----
  • December
  • November
  • October
  • September
  • August
  • July
  • June
  • May
  • April
  • March
  • February
  • January
  • ----- 2023 -----
  • December
  • November
  • October
  • September
  • August
  • July
  • June
  • May
  • April
  • March
  • February
  • January
  • ----- 2022 -----
  • December
  • November
  • October
  • September
  • August
  • July
  • June
  • May
  • April
  • March
  • February
  • January
  • ----- 2021 -----
  • December
  • November
  • October
  • September
  • August
  • July
  • June
  • May
  • April
  • March
  • February
  • January
  • ----- 2020 -----
  • December
  • November
  • October
  • September
  • August
  • July
  • June
  • May
  • April
  • March
  • February
  • January
  • ----- 2019 -----
  • December
  • November
  • October
  • September
  • August
  • July
  • June
  • May
  • April
  • March
  • February
  • January
  • ----- 2018 -----
  • December
  • November
  • October
  • September
  • August
  • July
  • June
  • May
  • April
  • March
  • February
  • January
  • ----- 2017 -----
  • December
  • November
  • October
  • September
  • August
  • July
  • June
  • May
  • April
  • March
  • February
  • January
  • ----- 2016 -----
  • December
  • November
  • October
  • September
  • August
  • July
ci@lists.libvirt.org

October 2018

  • 2 participants
  • 91 discussions
[Libvirt-ci] Build failed in Jenkins: libosinfo-check » libvirt-fedora-rawhide #29
by ci@centos.org 19 Oct '18

19 Oct '18
See <https://ci.centos.org/job/libosinfo-check/systems=libvirt-fedora-rawhide/29…> ------------------------------------------ [...truncated 3.17 KB...] gmake[1]: Leaving directory '<https://ci.centos.org/job/libosinfo-check/systems=libvirt-fedora-rawhide/ws…'> Making check in docs gmake[1]: Entering directory '<https://ci.centos.org/job/libosinfo-check/systems=libvirt-fedora-rawhide/ws…'> Making check in reference gmake[2]: Entering directory '<https://ci.centos.org/job/libosinfo-check/systems=libvirt-fedora-rawhide/ws…'> gmake[2]: Nothing to be done for 'check'. gmake[2]: Leaving directory '<https://ci.centos.org/job/libosinfo-check/systems=libvirt-fedora-rawhide/ws…'> gmake[2]: Entering directory '<https://ci.centos.org/job/libosinfo-check/systems=libvirt-fedora-rawhide/ws…'> gmake[2]: Nothing to be done for 'check-am'. gmake[2]: Leaving directory '<https://ci.centos.org/job/libosinfo-check/systems=libvirt-fedora-rawhide/ws…'> gmake[1]: Leaving directory '<https://ci.centos.org/job/libosinfo-check/systems=libvirt-fedora-rawhide/ws…'> Making check in po gmake[1]: Entering directory '<https://ci.centos.org/job/libosinfo-check/systems=libvirt-fedora-rawhide/ws…'> INTLTOOL_EXTRACT="/usr/bin/intltool-extract" XGETTEXT="/usr/bin/xgettext" srcdir=../../po /usr/bin/intltool-update --gettext-package libosinfo --pot rm -f missing notexist srcdir=../../po /usr/bin/intltool-update -m if [ -r missing -o -r notexist ]; then \ exit 1; \ fi gmake[1]: Leaving directory '<https://ci.centos.org/job/libosinfo-check/systems=libvirt-fedora-rawhide/ws…'> Making check in examples gmake[1]: Entering directory '<https://ci.centos.org/job/libosinfo-check/systems=libvirt-fedora-rawhide/ws…'> gmake[1]: Nothing to be done for 'check'. gmake[1]: Leaving directory '<https://ci.centos.org/job/libosinfo-check/systems=libvirt-fedora-rawhide/ws…'> Making check in tests gmake[1]: Entering directory '<https://ci.centos.org/job/libosinfo-check/systems=libvirt-fedora-rawhide/ws…'> /usr/bin/gmake test-entity test-device test-list test-devicelist test-filter test-product test-os test-oslist test-productfilter test-platform test-platformlist test-db test-loader test-isodetect test-install-script test-os-resources test-mediauris test-treeuris gmake[2]: Entering directory '<https://ci.centos.org/job/libosinfo-check/systems=libvirt-fedora-rawhide/ws…'> CC test_entity-test-entity.o CC test_device-test-device.o CC test_list-test-list.o CC test_devicelist-test-devicelist.o CC test_product-test-product.o CC test_filter-test-filter.o CC test_os-test-os.o CC test_oslist-test-oslist.o CC test_productfilter-test-productfilter.o CC test_platform-test-platform.o CC test_platformlist-test-platformlist.o CC test_db-test-db.o CC test_loader-test-loader.o CC test_isodetect-test-isodetect.o CC test_install_script-test-install-script.o CC test_os_resources-test-os-resources.o CC test_treeuris-test-treeuris.o CC test_mediauris-test-mediauris.o CCLD test-entity CCLD test-device CCLD test-list CCLD test-devicelist CCLD test-filter CCLD test-product CCLD test-os CCLD test-oslist CCLD test-productfilter CCLD test-platform CCLD test-platformlist CCLD test-db CCLD test-loader CCLD test-isodetect CCLD test-install-script CCLD test-os-resources CCLD test-mediauris CCLD test-treeuris gmake[2]: Leaving directory '<https://ci.centos.org/job/libosinfo-check/systems=libvirt-fedora-rawhide/ws…'> /usr/bin/gmake check-TESTS gmake[2]: Entering directory '<https://ci.centos.org/job/libosinfo-check/systems=libvirt-fedora-rawhide/ws…'> gmake[3]: Entering directory '<https://ci.centos.org/job/libosinfo-check/systems=libvirt-fedora-rawhide/ws…'> PASS: test-device PASS: test-list PASS: test-entity PASS: test-filter PASS: test-devicelist PASS: test-product PASS: test-oslist PASS: test-productfilter PASS: test-os PASS: test-platform PASS: test-db PASS: test-platformlist PASS: test-install-script PASS: test-loader PASS: test-os-resources ../../build-aux/test-driver: line 107: 18545 Aborted (core dumped) "$@" > $log_file 2>&1 FAIL: test-treeuris ../../build-aux/test-driver: line 107: 18442 Aborted (core dumped) "$@" > $log_file 2>&1 FAIL: test-mediauris FAIL: test-isodetect ============================================================================ Testsuite summary for libosinfo 1.3.0 ============================================================================ # TOTAL: 18 # PASS: 15 # SKIP: 0 # XFAIL: 0 # FAIL: 3 # XPASS: 0 # ERROR: 0 ============================================================================ See tests/test-suite.log Please report to libosinfo(a)redhat.com ============================================================================ gmake[3]: *** [Makefile:1313: test-suite.log] Error 1 gmake[3]: Leaving directory '<https://ci.centos.org/job/libosinfo-check/systems=libvirt-fedora-rawhide/ws…'> gmake[2]: *** [Makefile:1421: check-TESTS] Error 2 gmake[2]: Leaving directory '<https://ci.centos.org/job/libosinfo-check/systems=libvirt-fedora-rawhide/ws…'> gmake[1]: *** [Makefile:1614: check-am] Error 2 gmake[1]: Leaving directory '<https://ci.centos.org/job/libosinfo-check/systems=libvirt-fedora-rawhide/ws…'> gmake: *** [Makefile:594: check-recursive] Error 1 + cat tests/test-suite.log =========================================== libosinfo 1.3.0: tests/test-suite.log =========================================== # TOTAL: 18 # PASS: 15 # SKIP: 0 # XFAIL: 0 # FAIL: 3 # XPASS: 0 # ERROR: 0 .. contents:: :depth: 2 FAIL: test-isodetect ==================== /isodetect/haiku: OK /isodetect/alpinelinux: OK /isodetect/dragonflybsd: OK /isodetect/windows: OK /isodetect/ubuntu: OK /isodetect/sles: OK /isodetect/sled: OK /isodetect/rhel: OK /isodetect/popos: OK /isodetect/opensuse: OK /isodetect/openbsd: OK /isodetect/netbsd: OK /isodetect/mageia: OK /isodetect/gnome: OK /isodetect/freedos: OK /isodetect/freebsd: OK /isodetect/fedora: OK /isodetect/debian: OK /isodetect/centos: OK /isodetect/asianux: OK /isodetect/altlinux: ISO alt-p8-builder-20180912-i586.iso.txt was not matched by OS alt.p8 /isodetect/altlinux: ISO alt-p8-builder-20180912-x86_64.iso.txt was not matched by OS alt.p8 /isodetect/altlinux: ISO alt-p8-cinnamon-20180912-i586.iso.txt was not matched by OS alt.p8 /isodetect/altlinux: ISO alt-p8-cinnamon-20180912-x86_64.iso.txt was not matched by OS alt.p8 /isodetect/altlinux: ISO alt-p8-enlightenment-20180912-i586.iso.txt was not matched by OS alt.p8 /isodetect/altlinux: ISO alt-p8-enlightenment-20180912-x86_64.iso.txt was not matched by OS alt.p8 /isodetect/altlinux: ISO alt-p8-gnome3-20180912-i586.iso.txt was not matched by OS alt.p8 /isodetect/altlinux: ISO alt-p8-gnome3-20180912-x86_64.iso.txt was not matched by OS alt.p8 /isodetect/altlinux: ISO alt-p8-gnustep-20180912-i586.iso.txt was not matched by OS alt.p8 /isodetect/altlinux: ISO alt-p8-gnustep-20180912-x86_64.iso.txt was not matched by OS alt.p8 /isodetect/altlinux: ISO alt-p8-icewm-20180912-i586.iso.txt was not matched by OS alt.p8 /isodetect/altlinux: ISO alt-p8-icewm-20180912-x86_64.iso.txt was not matched by OS alt.p8 /isodetect/altlinux: ISO alt-p8-jeos-20180912-i586.iso.txt was not matched by OS alt.p8 /isodetect/altlinux: ISO alt-p8-jeos-20180912-x86_64.iso.txt was not matched by OS alt.p8 /isodetect/altlinux: ISO alt-p8-kde4-20180912-i586.iso.txt was not matched by OS alt.p8 /isodetect/altlinux: ISO alt-p8-kde4-20180912-x86_64.iso.txt was not matched by OS alt.p8 /isodetect/altlinux: ISO alt-p8-kde5-20180912-i586.iso.txt was not matched by OS alt.p8 /isodetect/altlinux: ISO alt-p8-kde5-20180912-x86_64.iso.txt was not matched by OS alt.p8 /isodetect/altlinux: ISO alt-p8-lxde-20180912-i586.iso.txt was not matched by OS alt.p8 /isodetect/altlinux: ISO alt-p8-lxde-20180912-x86_64.iso.txt was not matched by OS alt.p8 /isodetect/altlinux: ISO alt-p8-lxqt-20180912-i586.iso.txt was not matched by OS alt.p8 /isodetect/altlinux: ISO alt-p8-lxqt-20180912-x86_64.iso.txt was not matched by OS alt.p8 /isodetect/altlinux: ISO alt-p8-mate-20180913-i586.iso.txt was not matched by OS alt.p8 /isodetect/altlinux: ISO alt-p8-mate-20180913-x86_64.iso.txt was not matched by OS alt.p8 /isodetect/altlinux: ISO alt-p8-rescue-20180912-i586.iso.txt was not matched by OS alt.p8 /isodetect/altlinux: ISO alt-p8-rescue-20180912-x86_64.iso.txt was not matched by OS alt.p8 /isodetect/altlinux: ISO alt-p8-server-20180913-i586.iso.txt was not matched by OS alt.p8 /isodetect/altlinux: ISO alt-p8-server-20180913-x86_64.iso.txt was not matched by OS alt.p8 /isodetect/altlinux: ISO alt-p8-server-pve-20180912-x86_64.iso.txt was not matched by OS alt.p8 /isodetect/altlinux: ISO alt-p8-sysv-tde-20180912-i586.iso.txt was not matched by OS alt.p8 /isodetect/altlinux: ISO alt-p8-sysv-tde-20180912-x86_64.iso.txt was not matched by OS alt.p8 /isodetect/altlinux: ISO alt-p8-sysv-xfce-20180912-i586.iso.txt was not matched by OS alt.p8 /isodetect/altlinux: ISO alt-p8-sysv-xfce-20180912-x86_64.iso.txt was not matched by OS alt.p8 /isodetect/altlinux: ISO alt-p8-wmaker-20180912-i586.iso.txt was not matched by OS alt.p8 /isodetect/altlinux: ISO alt-p8-wmaker-20180912-x86_64.iso.txt was not matched by OS alt.p8 /isodetect/altlinux: ISO alt-p8-xfce-20180912-i586.iso.txt was not matched by OS alt.p8 /isodetect/altlinux: ISO alt-p8-xfce-20180912-x86_64.iso.txt was not matched by OS alt.p8 /isodetect/altlinux: ISO regular-cinnamon-20181017-i586.iso.txt was not matched by OS alt.sisyphus /isodetect/altlinux: ISO regular-cinnamon-20181017-x86_64.iso.txt was not matched by OS alt.sisyphus /isodetect/altlinux: ISO regular-enlightenment-20181017-i586.iso.txt was not matched by OS alt.sisyphus /isodetect/altlinux: ISO regular-enlightenment-20181017-x86_64.iso.txt was not matched by OS alt.sisyphus /isodetect/altlinux: ISO regular-gnome3-20181017-i586.iso.txt was not matched by OS alt.sisyphus /isodetect/altlinux: ISO regular-gnome3-20181017-x86_64.iso.txt was not matched by OS alt.sisyphus /isodetect/altlinux: ISO regular-gnustep-20181017-i586.iso.txt was not matched by OS alt.sisyphus /isodetect/altlinux: ISO regular-gnustep-20181017-x86_64.iso.txt was not matched by OS alt.sisyphus /isodetect/altlinux: ISO regular-icewm-20181017-i586.iso.txt was not matched by OS alt.sisyphus /isodetect/altlinux: ISO regular-icewm-20181017-x86_64.iso.txt was not matched by OS alt.sisyphus /isodetect/altlinux: ISO regular-jeos-20181017-i586.iso.txt was not matched by OS alt.sisyphus /isodetect/altlinux: ISO regular-jeos-20181017-x86_64.iso.txt was not matched by OS alt.sisyphus /isodetect/altlinux: ISO regular-kde5-20181017-i586.iso.txt was not matched by OS alt.sisyphus /isodetect/altlinux: ISO regular-kde5-20181017-x86_64.iso.txt was not matched by OS alt.sisyphus /isodetect/altlinux: ISO regular-lxde-20181017-i586.iso.txt was not matched by OS alt.sisyphus /isodetect/altlinux: ISO regular-lxde-20181017-x86_64.iso.txt was not matched by OS alt.sisyphus /isodetect/altlinux: ISO regular-lxqt-20181017-i586.iso.txt was not matched by OS alt.sisyphus /isodetect/altlinux: ISO regular-lxqt-20181017-x86_64.iso.txt was not matched by OS alt.sisyphus /isodetect/altlinux: ISO regular-mate-20181017-i586.iso.txt was not matched by OS alt.sisyphus /isodetect/altlinux: ISO regular-mate-20181017-x86_64.iso.txt was not matched by OS alt.sisyphus /isodetect/altlinux: ISO regular-rescue-20181017-i586.iso.txt was not matched by OS alt.sisyphus /isodetect/altlinux: ISO regular-rescue-20181017-x86_64.iso.txt was not matched by OS alt.sisyphus /isodetect/altlinux: ISO regular-wmaker-20181017-i586.iso.txt was not matched by OS alt.sisyphus /isodetect/altlinux: ISO regular-wmaker-20181017-x86_64.iso.txt was not matched by OS alt.sisyphus /isodetect/altlinux: ISO regular-xfce-20181017-i586.iso.txt was not matched by OS alt.sisyphus /isodetect/altlinux: ISO regular-xfce-20181017-x86_64.iso.txt was not matched by OS alt.sisyphus /isodetect/altlinux: ISO alt-education-8.0-i586.iso.txt was not matched by OS alt8.0 /isodetect/altlinux: ISO alt-education-8.0-x86_64.iso.txt was not matched by OS alt8.0 /isodetect/altlinux: ISO alt-kworkstation-8.1-install-i586.iso.txt was not matched by OS alt8.1 /isodetect/altlinux: ISO alt-kworkstation-8.1-install-x86_64.iso.txt was not matched by OS alt8.1 /isodetect/altlinux: ISO alt-kworkstation-8.1-live-i586.iso.txt was not matched by OS alt8.1 /isodetect/altlinux: ISO alt-kworkstation-8.1-live-x86_64.iso.txt was not matched by OS alt8.1 /isodetect/altlinux: ISO alt-workstation-8.1-i586.iso.txt was not matched by OS alt8.1 /isodetect/altlinux: ISO alt-workstation-8.1-x86_64.iso.txt was not matched by OS alt8.1 /isodetect/altlinux: ISO alt-kworkstation-8.2-install-i586.iso.txt was not matched by OS alt8.2 /isodetect/altlinux: ISO alt-kworkstation-8.2-install-x86_64.iso.txt was not matched by OS alt8.2 /isodetect/altlinux: ISO alt-kworkstation-8.2-live-i586.iso.txt was not matched by OS alt8.2 /isodetect/altlinux: ISO alt-kworkstation-8.2-live-x86_64.iso.txt was not matched by OS alt8.2 /isodetect/altlinux: ISO alt-server-8.2-i586.iso.txt was not matched by OS alt8.2 /isodetect/altlinux: ISO alt-server-8.2-x86_64.iso.txt was not matched by OS alt8.2 /isodetect/altlinux: ISO alt-simply-8.2.0-i586.iso.txt was not matched by OS alt8.2 /isodetect/altlinux: ISO alt-simply-8.2.0-live-i586.iso.txt was not matched by OS alt8.2 /isodetect/altlinux: ISO alt-simply-8.2.0-live-x86_64.iso.txt was not matched by OS alt8.2 /isodetect/altlinux: ISO alt-simply-8.2.0-x86_64.iso.txt was not matched by OS alt8.2 /isodetect/altlinux: ISO alt-workstation-8.2-i586.iso.txt was not matched by OS alt8.2 /isodetect/altlinux: ISO alt-workstation-8.2-x86_64.iso.txt was not matched by OS alt8.2 /isodetect/altlinux: FAIL FAIL test-isodetect (exit status: 1) FAIL: test-mediauris ==================== /mediauris/uris: ** ERROR:../../tests/test-mediauris.c:49:test_media: assertion failed (res == CURLE_OK): (22 == 0) FAIL test-mediauris (exit status: 134) FAIL: test-treeuris =================== /treeuris/uris: ** ERROR:../../tests/test-treeuris.c:49:test_tree: assertion failed (res == CURLE_OK): (22 == 0) FAIL test-treeuris (exit status: 134) + exit 1 Build step 'Execute shell' marked build as failure
1 1
0 0
[Libvirt-ci] Build failed in Jenkins: libosinfo-check » libvirt-freebsd-10 #29
by ci@centos.org 19 Oct '18

19 Oct '18
See <https://ci.centos.org/job/libosinfo-check/systems=libvirt-freebsd-10/29/dis…> ------------------------------------------ [...truncated 3.16 KB...] gmake[1]: Leaving directory '/usr<https://ci.centos.org/job/libosinfo-check/systems=libvirt-freebsd-10/ws/bui…'> Making check in docs gmake[1]: Entering directory '/usr<https://ci.centos.org/job/libosinfo-check/systems=libvirt-freebsd-10/ws/bui…'> Making check in reference gmake[2]: Entering directory '/usr<https://ci.centos.org/job/libosinfo-check/systems=libvirt-freebsd-10/ws/bui…'> gmake[2]: Nothing to be done for 'check'. gmake[2]: Leaving directory '/usr<https://ci.centos.org/job/libosinfo-check/systems=libvirt-freebsd-10/ws/bui…'> gmake[2]: Entering directory '/usr<https://ci.centos.org/job/libosinfo-check/systems=libvirt-freebsd-10/ws/bui…'> gmake[2]: Nothing to be done for 'check-am'. gmake[2]: Leaving directory '/usr<https://ci.centos.org/job/libosinfo-check/systems=libvirt-freebsd-10/ws/bui…'> gmake[1]: Leaving directory '/usr<https://ci.centos.org/job/libosinfo-check/systems=libvirt-freebsd-10/ws/bui…'> Making check in po gmake[1]: Entering directory '/usr<https://ci.centos.org/job/libosinfo-check/systems=libvirt-freebsd-10/ws/bui…'> INTLTOOL_EXTRACT="/usr/local/bin/intltool-extract" XGETTEXT="/usr/local/bin/xgettext" srcdir=../../po /usr/local/bin/intltool-update --gettext-package libosinfo --pot rm -f missing notexist srcdir=../../po /usr/local/bin/intltool-update -m if [ -r missing -o -r notexist ]; then \ exit 1; \ fi gmake[1]: Leaving directory '/usr<https://ci.centos.org/job/libosinfo-check/systems=libvirt-freebsd-10/ws/bui…'> Making check in examples gmake[1]: Entering directory '/usr<https://ci.centos.org/job/libosinfo-check/systems=libvirt-freebsd-10/ws/bui…'> gmake[1]: Nothing to be done for 'check'. gmake[1]: Leaving directory '/usr<https://ci.centos.org/job/libosinfo-check/systems=libvirt-freebsd-10/ws/bui…'> Making check in tests gmake[1]: Entering directory '/usr<https://ci.centos.org/job/libosinfo-check/systems=libvirt-freebsd-10/ws/bui…'> /usr/local/bin/gmake test-entity test-device test-list test-devicelist test-filter test-product test-os test-oslist test-productfilter test-platform test-platformlist test-db test-loader test-isodetect test-install-script test-os-resources test-mediauris test-treeuris gmake[2]: Entering directory '/usr<https://ci.centos.org/job/libosinfo-check/systems=libvirt-freebsd-10/ws/bui…'> CC test_entity-test-entity.o CC test_device-test-device.o CC test_list-test-list.o CC test_devicelist-test-devicelist.o CC test_filter-test-filter.o CC test_product-test-product.o CC test_os-test-os.o CC test_oslist-test-oslist.o CC test_productfilter-test-productfilter.o CC test_platform-test-platform.o CC test_platformlist-test-platformlist.o CC test_db-test-db.o CC test_loader-test-loader.o CC test_isodetect-test-isodetect.o CC test_install_script-test-install-script.o CC test_os_resources-test-os-resources.o CC test_mediauris-test-mediauris.o CC test_treeuris-test-treeuris.o CCLD test-entity CCLD test-device CCLD test-list CCLD test-devicelist CCLD test-filter CCLD test-product CCLD test-os CCLD test-oslist CCLD test-productfilter CCLD test-platform CCLD test-platformlist CCLD test-db CCLD test-loader CCLD test-isodetect CCLD test-install-script CCLD test-os-resources CCLD test-mediauris CCLD test-treeuris gmake[2]: Leaving directory '/usr<https://ci.centos.org/job/libosinfo-check/systems=libvirt-freebsd-10/ws/bui…'> /usr/local/bin/gmake check-TESTS gmake[2]: Entering directory '/usr<https://ci.centos.org/job/libosinfo-check/systems=libvirt-freebsd-10/ws/bui…'> gmake[3]: Entering directory '/usr<https://ci.centos.org/job/libosinfo-check/systems=libvirt-freebsd-10/ws/bui…'> PASS: test-device PASS: test-entity PASS: test-list PASS: test-filter PASS: test-devicelist PASS: test-product PASS: test-oslist PASS: test-os PASS: test-productfilter PASS: test-platform PASS: test-db PASS: test-platformlist PASS: test-install-script PASS: test-os-resources PASS: test-loader Abort trap (core dumped) FAIL: test-treeuris Abort trap (core dumped) FAIL: test-mediauris FAIL: test-isodetect ============================================================================ Testsuite summary for libosinfo 1.3.0 ============================================================================ # TOTAL: 18 # PASS: 15 # SKIP: 0 # XFAIL: 0 # FAIL: 3 # XPASS: 0 # ERROR: 0 ============================================================================ See tests/test-suite.log Please report to libosinfo(a)redhat.com ============================================================================ gmake[3]: *** [Makefile:1313: test-suite.log] Error 1 gmake[3]: Leaving directory '/usr<https://ci.centos.org/job/libosinfo-check/systems=libvirt-freebsd-10/ws/bui…'> gmake[2]: *** [Makefile:1421: check-TESTS] Error 2 gmake[2]: Leaving directory '/usr<https://ci.centos.org/job/libosinfo-check/systems=libvirt-freebsd-10/ws/bui…'> gmake[1]: *** [Makefile:1614: check-am] Error 2 gmake[1]: Leaving directory '/usr<https://ci.centos.org/job/libosinfo-check/systems=libvirt-freebsd-10/ws/bui…'> gmake: *** [Makefile:594: check-recursive] Error 1 + cat tests/test-suite.log =========================================== libosinfo 1.3.0: tests/test-suite.log =========================================== # TOTAL: 18 # PASS: 15 # SKIP: 0 # XFAIL: 0 # FAIL: 3 # XPASS: 0 # ERROR: 0 .. contents:: :depth: 2 FAIL: test-isodetect ==================== /isodetect/windows: OK /isodetect/ubuntu: OK /isodetect/sles: OK /isodetect/sled: OK /isodetect/rhel: OK /isodetect/popos: OK /isodetect/opensuse: OK /isodetect/openbsd: OK /isodetect/netbsd: OK /isodetect/mageia: OK /isodetect/gnome: OK /isodetect/freedos: OK /isodetect/freebsd: OK /isodetect/fedora: OK /isodetect/debian: OK /isodetect/centos: OK /isodetect/asianux: OK /isodetect/altlinux: ISO alt-p8-builder-20180912-i586.iso.txt was not matched by OS alt.p8 /isodetect/altlinux: ISO alt-p8-builder-20180912-x86_64.iso.txt was not matched by OS alt.p8 /isodetect/altlinux: ISO alt-p8-cinnamon-20180912-i586.iso.txt was not matched by OS alt.p8 /isodetect/altlinux: ISO alt-p8-cinnamon-20180912-x86_64.iso.txt was not matched by OS alt.p8 /isodetect/altlinux: ISO alt-p8-enlightenment-20180912-i586.iso.txt was not matched by OS alt.p8 /isodetect/altlinux: ISO alt-p8-enlightenment-20180912-x86_64.iso.txt was not matched by OS alt.p8 /isodetect/altlinux: ISO alt-p8-gnome3-20180912-i586.iso.txt was not matched by OS alt.p8 /isodetect/altlinux: ISO alt-p8-gnome3-20180912-x86_64.iso.txt was not matched by OS alt.p8 /isodetect/altlinux: ISO alt-p8-gnustep-20180912-i586.iso.txt was not matched by OS alt.p8 /isodetect/altlinux: ISO alt-p8-gnustep-20180912-x86_64.iso.txt was not matched by OS alt.p8 /isodetect/altlinux: ISO alt-p8-icewm-20180912-i586.iso.txt was not matched by OS alt.p8 /isodetect/altlinux: ISO alt-p8-icewm-20180912-x86_64.iso.txt was not matched by OS alt.p8 /isodetect/altlinux: ISO alt-p8-jeos-20180912-i586.iso.txt was not matched by OS alt.p8 /isodetect/altlinux: ISO alt-p8-jeos-20180912-x86_64.iso.txt was not matched by OS alt.p8 /isodetect/altlinux: ISO alt-p8-kde4-20180912-i586.iso.txt was not matched by OS alt.p8 /isodetect/altlinux: ISO alt-p8-kde4-20180912-x86_64.iso.txt was not matched by OS alt.p8 /isodetect/altlinux: ISO alt-p8-kde5-20180912-i586.iso.txt was not matched by OS alt.p8 /isodetect/altlinux: ISO alt-p8-kde5-20180912-x86_64.iso.txt was not matched by OS alt.p8 /isodetect/altlinux: ISO alt-p8-lxde-20180912-i586.iso.txt was not matched by OS alt.p8 /isodetect/altlinux: ISO alt-p8-lxde-20180912-x86_64.iso.txt was not matched by OS alt.p8 /isodetect/altlinux: ISO alt-p8-lxqt-20180912-i586.iso.txt was not matched by OS alt.p8 /isodetect/altlinux: ISO alt-p8-lxqt-20180912-x86_64.iso.txt was not matched by OS alt.p8 /isodetect/altlinux: ISO alt-p8-mate-20180913-i586.iso.txt was not matched by OS alt.p8 /isodetect/altlinux: ISO alt-p8-mate-20180913-x86_64.iso.txt was not matched by OS alt.p8 /isodetect/altlinux: ISO alt-p8-rescue-20180912-i586.iso.txt was not matched by OS alt.p8 /isodetect/altlinux: ISO alt-p8-rescue-20180912-x86_64.iso.txt was not matched by OS alt.p8 /isodetect/altlinux: ISO alt-p8-server-20180913-i586.iso.txt was not matched by OS alt.p8 /isodetect/altlinux: ISO alt-p8-server-20180913-x86_64.iso.txt was not matched by OS alt.p8 /isodetect/altlinux: ISO alt-p8-server-pve-20180912-x86_64.iso.txt was not matched by OS alt.p8 /isodetect/altlinux: ISO alt-p8-sysv-tde-20180912-i586.iso.txt was not matched by OS alt.p8 /isodetect/altlinux: ISO alt-p8-sysv-tde-20180912-x86_64.iso.txt was not matched by OS alt.p8 /isodetect/altlinux: ISO alt-p8-sysv-xfce-20180912-i586.iso.txt was not matched by OS alt.p8 /isodetect/altlinux: ISO alt-p8-sysv-xfce-20180912-x86_64.iso.txt was not matched by OS alt.p8 /isodetect/altlinux: ISO alt-p8-wmaker-20180912-i586.iso.txt was not matched by OS alt.p8 /isodetect/altlinux: ISO alt-p8-wmaker-20180912-x86_64.iso.txt was not matched by OS alt.p8 /isodetect/altlinux: ISO alt-p8-xfce-20180912-i586.iso.txt was not matched by OS alt.p8 /isodetect/altlinux: ISO alt-p8-xfce-20180912-x86_64.iso.txt was not matched by OS alt.p8 /isodetect/altlinux: ISO regular-cinnamon-20181017-i586.iso.txt was not matched by OS alt.sisyphus /isodetect/altlinux: ISO regular-cinnamon-20181017-x86_64.iso.txt was not matched by OS alt.sisyphus /isodetect/altlinux: ISO regular-enlightenment-20181017-i586.iso.txt was not matched by OS alt.sisyphus /isodetect/altlinux: ISO regular-enlightenment-20181017-x86_64.iso.txt was not matched by OS alt.sisyphus /isodetect/altlinux: ISO regular-gnome3-20181017-i586.iso.txt was not matched by OS alt.sisyphus /isodetect/altlinux: ISO regular-gnome3-20181017-x86_64.iso.txt was not matched by OS alt.sisyphus /isodetect/altlinux: ISO regular-gnustep-20181017-i586.iso.txt was not matched by OS alt.sisyphus /isodetect/altlinux: ISO regular-gnustep-20181017-x86_64.iso.txt was not matched by OS alt.sisyphus /isodetect/altlinux: ISO regular-icewm-20181017-i586.iso.txt was not matched by OS alt.sisyphus /isodetect/altlinux: ISO regular-icewm-20181017-x86_64.iso.txt was not matched by OS alt.sisyphus /isodetect/altlinux: ISO regular-jeos-20181017-i586.iso.txt was not matched by OS alt.sisyphus /isodetect/altlinux: ISO regular-jeos-20181017-x86_64.iso.txt was not matched by OS alt.sisyphus /isodetect/altlinux: ISO regular-kde5-20181017-i586.iso.txt was not matched by OS alt.sisyphus /isodetect/altlinux: ISO regular-kde5-20181017-x86_64.iso.txt was not matched by OS alt.sisyphus /isodetect/altlinux: ISO regular-lxde-20181017-i586.iso.txt was not matched by OS alt.sisyphus /isodetect/altlinux: ISO regular-lxde-20181017-x86_64.iso.txt was not matched by OS alt.sisyphus /isodetect/altlinux: ISO regular-lxqt-20181017-i586.iso.txt was not matched by OS alt.sisyphus /isodetect/altlinux: ISO regular-lxqt-20181017-x86_64.iso.txt was not matched by OS alt.sisyphus /isodetect/altlinux: ISO regular-mate-20181017-i586.iso.txt was not matched by OS alt.sisyphus /isodetect/altlinux: ISO regular-mate-20181017-x86_64.iso.txt was not matched by OS alt.sisyphus /isodetect/altlinux: ISO regular-rescue-20181017-i586.iso.txt was not matched by OS alt.sisyphus /isodetect/altlinux: ISO regular-rescue-20181017-x86_64.iso.txt was not matched by OS alt.sisyphus /isodetect/altlinux: ISO regular-wmaker-20181017-i586.iso.txt was not matched by OS alt.sisyphus /isodetect/altlinux: ISO regular-wmaker-20181017-x86_64.iso.txt was not matched by OS alt.sisyphus /isodetect/altlinux: ISO regular-xfce-20181017-i586.iso.txt was not matched by OS alt.sisyphus /isodetect/altlinux: ISO regular-xfce-20181017-x86_64.iso.txt was not matched by OS alt.sisyphus /isodetect/altlinux: ISO alt-education-8.0-i586.iso.txt was not matched by OS alt8.0 /isodetect/altlinux: ISO alt-education-8.0-x86_64.iso.txt was not matched by OS alt8.0 /isodetect/altlinux: ISO alt-kworkstation-8.1-install-i586.iso.txt was not matched by OS alt8.1 /isodetect/altlinux: ISO alt-kworkstation-8.1-install-x86_64.iso.txt was not matched by OS alt8.1 /isodetect/altlinux: ISO alt-kworkstation-8.1-live-i586.iso.txt was not matched by OS alt8.1 /isodetect/altlinux: ISO alt-kworkstation-8.1-live-x86_64.iso.txt was not matched by OS alt8.1 /isodetect/altlinux: ISO alt-workstation-8.1-i586.iso.txt was not matched by OS alt8.1 /isodetect/altlinux: ISO alt-workstation-8.1-x86_64.iso.txt was not matched by OS alt8.1 /isodetect/altlinux: ISO alt-kworkstation-8.2-install-i586.iso.txt was not matched by OS alt8.2 /isodetect/altlinux: ISO alt-kworkstation-8.2-install-x86_64.iso.txt was not matched by OS alt8.2 /isodetect/altlinux: ISO alt-kworkstation-8.2-live-i586.iso.txt was not matched by OS alt8.2 /isodetect/altlinux: ISO alt-kworkstation-8.2-live-x86_64.iso.txt was not matched by OS alt8.2 /isodetect/altlinux: ISO alt-server-8.2-i586.iso.txt was not matched by OS alt8.2 /isodetect/altlinux: ISO alt-server-8.2-x86_64.iso.txt was not matched by OS alt8.2 /isodetect/altlinux: ISO alt-simply-8.2.0-i586.iso.txt was not matched by OS alt8.2 /isodetect/altlinux: ISO alt-simply-8.2.0-live-i586.iso.txt was not matched by OS alt8.2 /isodetect/altlinux: ISO alt-simply-8.2.0-live-x86_64.iso.txt was not matched by OS alt8.2 /isodetect/altlinux: ISO alt-simply-8.2.0-x86_64.iso.txt was not matched by OS alt8.2 /isodetect/altlinux: ISO alt-workstation-8.2-i586.iso.txt was not matched by OS alt8.2 /isodetect/altlinux: ISO alt-workstation-8.2-x86_64.iso.txt was not matched by OS alt8.2 /isodetect/altlinux: FAIL /isodetect/alpinelinux: OK /isodetect/dragonflybsd: OK /isodetect/haiku: OK FAIL test-isodetect (exit status: 1) FAIL: test-mediauris ==================== /mediauris/uris: ** ERROR:../../tests/test-mediauris.c:49:test_media: assertion failed (res == CURLE_OK): (22 == 0) FAIL test-mediauris (exit status: 134) FAIL: test-treeuris =================== /treeuris/uris: ** ERROR:../../tests/test-treeuris.c:49:test_tree: assertion failed (res == CURLE_OK): (22 == 0) FAIL test-treeuris (exit status: 134) + exit 1 Build step 'Execute shell' marked build as failure
1 1
0 0
[Libvirt-ci] Build failed in Jenkins: libosinfo-check » libvirt-fedora-rawhide #27
by ci@centos.org 19 Oct '18

19 Oct '18
See <https://ci.centos.org/job/libosinfo-check/systems=libvirt-fedora-rawhide/27…> ------------------------------------------ Started by upstream project "libosinfo-check" build number 27 originally caused by: Started by upstream project "libosinfo-syntax-check" build number 27 originally caused by: Started by upstream project "libosinfo-build" build number 27 originally caused by: Started by an SCM change [EnvInject] - Loading node environment variables. Building remotely on libvirt-fedora-rawhide (libvirt) in workspace <https://ci.centos.org/job/libosinfo-check/systems=libvirt-fedora-rawhide/ws/> [libosinfo] $ /bin/sh -xe /tmp/jenkins1614923157525502045.sh + export LIBOSINFO_NETWORK_TESTS=1 + LIBOSINFO_NETWORK_TESTS=1 + cd build + /usr/bin/gmake check GEN public-submodule-commit Making check in osinfo gmake[1]: Entering directory '<https://ci.centos.org/job/libosinfo-check/systems=libvirt-fedora-rawhide/ws…'> /usr/bin/gmake check-am gmake[2]: Entering directory '<https://ci.centos.org/job/libosinfo-check/systems=libvirt-fedora-rawhide/ws…'> /usr/bin/gmake check-local gmake[3]: Entering directory '<https://ci.centos.org/job/libosinfo-check/systems=libvirt-fedora-rawhide/ws…'> GEN check-symfile GEN check-symsorting gmake[3]: Leaving directory '<https://ci.centos.org/job/libosinfo-check/systems=libvirt-fedora-rawhide/ws…'> gmake[2]: Leaving directory '<https://ci.centos.org/job/libosinfo-check/systems=libvirt-fedora-rawhide/ws…'> gmake[1]: Leaving directory '<https://ci.centos.org/job/libosinfo-check/systems=libvirt-fedora-rawhide/ws…'> Making check in tools gmake[1]: Entering directory '<https://ci.centos.org/job/libosinfo-check/systems=libvirt-fedora-rawhide/ws…'> gmake[1]: Nothing to be done for 'check'. gmake[1]: Leaving directory '<https://ci.centos.org/job/libosinfo-check/systems=libvirt-fedora-rawhide/ws…'> Making check in docs gmake[1]: Entering directory '<https://ci.centos.org/job/libosinfo-check/systems=libvirt-fedora-rawhide/ws…'> Making check in reference gmake[2]: Entering directory '<https://ci.centos.org/job/libosinfo-check/systems=libvirt-fedora-rawhide/ws…'> gmake[2]: Nothing to be done for 'check'. gmake[2]: Leaving directory '<https://ci.centos.org/job/libosinfo-check/systems=libvirt-fedora-rawhide/ws…'> gmake[2]: Entering directory '<https://ci.centos.org/job/libosinfo-check/systems=libvirt-fedora-rawhide/ws…'> gmake[2]: Nothing to be done for 'check-am'. gmake[2]: Leaving directory '<https://ci.centos.org/job/libosinfo-check/systems=libvirt-fedora-rawhide/ws…'> gmake[1]: Leaving directory '<https://ci.centos.org/job/libosinfo-check/systems=libvirt-fedora-rawhide/ws…'> Making check in po gmake[1]: Entering directory '<https://ci.centos.org/job/libosinfo-check/systems=libvirt-fedora-rawhide/ws…'> INTLTOOL_EXTRACT="/usr/bin/intltool-extract" XGETTEXT="/usr/bin/xgettext" srcdir=../../po /usr/bin/intltool-update --gettext-package libosinfo --pot rm -f missing notexist srcdir=../../po /usr/bin/intltool-update -m if [ -r missing -o -r notexist ]; then \ exit 1; \ fi gmake[1]: Leaving directory '<https://ci.centos.org/job/libosinfo-check/systems=libvirt-fedora-rawhide/ws…'> Making check in examples gmake[1]: Entering directory '<https://ci.centos.org/job/libosinfo-check/systems=libvirt-fedora-rawhide/ws…'> gmake[1]: Nothing to be done for 'check'. gmake[1]: Leaving directory '<https://ci.centos.org/job/libosinfo-check/systems=libvirt-fedora-rawhide/ws…'> Making check in tests gmake[1]: Entering directory '<https://ci.centos.org/job/libosinfo-check/systems=libvirt-fedora-rawhide/ws…'> /usr/bin/gmake test-entity test-device test-list test-devicelist test-filter test-product test-os test-oslist test-productfilter test-platform test-platformlist test-db test-loader test-isodetect test-install-script test-os-resources test-mediauris test-treeuris gmake[2]: Entering directory '<https://ci.centos.org/job/libosinfo-check/systems=libvirt-fedora-rawhide/ws…'> CC test_entity-test-entity.o CC test_device-test-device.o CC test_list-test-list.o CC test_devicelist-test-devicelist.o CC test_filter-test-filter.o CC test_product-test-product.o CC test_os-test-os.o CC test_oslist-test-oslist.o CC test_productfilter-test-productfilter.o CC test_platform-test-platform.o CC test_platformlist-test-platformlist.o CC test_db-test-db.o CC test_loader-test-loader.o CC test_isodetect-test-isodetect.o CC test_install_script-test-install-script.o CC test_os_resources-test-os-resources.o CC test_mediauris-test-mediauris.o CC test_treeuris-test-treeuris.o CCLD test-entity CCLD test-device CCLD test-list CCLD test-devicelist CCLD test-filter CCLD test-product CCLD test-os CCLD test-oslist CCLD test-productfilter CCLD test-platform CCLD test-platformlist CCLD test-db CCLD test-loader CCLD test-isodetect CCLD test-install-script CCLD test-os-resources CCLD test-mediauris CCLD test-treeuris gmake[2]: Leaving directory '<https://ci.centos.org/job/libosinfo-check/systems=libvirt-fedora-rawhide/ws…'> /usr/bin/gmake check-TESTS gmake[2]: Entering directory '<https://ci.centos.org/job/libosinfo-check/systems=libvirt-fedora-rawhide/ws…'> gmake[3]: Entering directory '<https://ci.centos.org/job/libosinfo-check/systems=libvirt-fedora-rawhide/ws…'> PASS: test-list PASS: test-device PASS: test-entity PASS: test-devicelist PASS: test-filter PASS: test-product PASS: test-os PASS: test-oslist PASS: test-productfilter PASS: test-platform PASS: test-platformlist PASS: test-db PASS: test-install-script PASS: test-loader PASS: test-os-resources PASS: test-treeuris PASS: test-isodetect ../../build-aux/test-driver: line 107: 13692 Aborted (core dumped) "$@" > $log_file 2>&1 FAIL: test-mediauris ============================================================================ Testsuite summary for libosinfo 1.3.0 ============================================================================ # TOTAL: 18 # PASS: 17 # SKIP: 0 # XFAIL: 0 # FAIL: 1 # XPASS: 0 # ERROR: 0 ============================================================================ See tests/test-suite.log Please report to libosinfo(a)redhat.com ============================================================================ gmake[3]: *** [Makefile:1313: test-suite.log] Error 1 gmake[3]: Leaving directory '<https://ci.centos.org/job/libosinfo-check/systems=libvirt-fedora-rawhide/ws…'> gmake[2]: *** [Makefile:1421: check-TESTS] Error 2 gmake[2]: Leaving directory '<https://ci.centos.org/job/libosinfo-check/systems=libvirt-fedora-rawhide/ws…'> gmake[1]: *** [Makefile:1614: check-am] Error 2 gmake[1]: Leaving directory '<https://ci.centos.org/job/libosinfo-check/systems=libvirt-fedora-rawhide/ws…'> gmake: *** [Makefile:594: check-recursive] Error 1 + cat tests/test-suite.log =========================================== libosinfo 1.3.0: tests/test-suite.log =========================================== # TOTAL: 18 # PASS: 17 # SKIP: 0 # XFAIL: 0 # FAIL: 1 # XPASS: 0 # ERROR: 0 .. contents:: :depth: 2 FAIL: test-mediauris ==================== /mediauris/uris: ** ERROR:../../tests/test-mediauris.c:49:test_media: assertion failed (res == CURLE_OK): (28 == 0) FAIL test-mediauris (exit status: 134) + exit 1 Build step 'Execute shell' marked build as failure
1 1
0 0
[Libvirt-ci] Build failed in Jenkins: libosinfo-check » libvirt-debian-8 #24
by ci@centos.org 19 Oct '18

19 Oct '18
See <https://ci.centos.org/job/libosinfo-check/systems=libvirt-debian-8/24/displ…> ------------------------------------------ Started by upstream project "libosinfo-check" build number 24 originally caused by: Started by upstream project "libosinfo-syntax-check" build number 24 originally caused by: Started by upstream project "libosinfo-build" build number 24 originally caused by: Started by upstream project "osinfo-db-build" build number 17 originally caused by: Started by an SCM change [EnvInject] - Loading node environment variables. Building remotely on libvirt-debian-8 (libvirt) in workspace <https://ci.centos.org/job/libosinfo-check/systems=libvirt-debian-8/ws/> [libosinfo] $ /bin/sh -xe /tmp/jenkins6604986849126485950.sh + export LIBOSINFO_NETWORK_TESTS=1 + cd build + /usr/bin/make check GEN public-submodule-commit Making check in osinfo make[1]: Entering directory '<https://ci.centos.org/job/libosinfo-check/systems=libvirt-debian-8/ws/build…'> /usr/bin/make check-am make[2]: Entering directory '<https://ci.centos.org/job/libosinfo-check/systems=libvirt-debian-8/ws/build…'> /usr/bin/make check-local make[3]: Entering directory '<https://ci.centos.org/job/libosinfo-check/systems=libvirt-debian-8/ws/build…'> GEN check-symfile GEN check-symsorting make[3]: Leaving directory '<https://ci.centos.org/job/libosinfo-check/systems=libvirt-debian-8/ws/build…'> make[2]: Leaving directory '<https://ci.centos.org/job/libosinfo-check/systems=libvirt-debian-8/ws/build…'> make[1]: Leaving directory '<https://ci.centos.org/job/libosinfo-check/systems=libvirt-debian-8/ws/build…'> Making check in tools make[1]: Entering directory '<https://ci.centos.org/job/libosinfo-check/systems=libvirt-debian-8/ws/build…'> make[1]: Nothing to be done for 'check'. make[1]: Leaving directory '<https://ci.centos.org/job/libosinfo-check/systems=libvirt-debian-8/ws/build…'> Making check in docs make[1]: Entering directory '<https://ci.centos.org/job/libosinfo-check/systems=libvirt-debian-8/ws/build…'> Making check in reference make[2]: Entering directory '<https://ci.centos.org/job/libosinfo-check/systems=libvirt-debian-8/ws/build…'> make[2]: Nothing to be done for 'check'. make[2]: Leaving directory '<https://ci.centos.org/job/libosinfo-check/systems=libvirt-debian-8/ws/build…'> make[2]: Entering directory '<https://ci.centos.org/job/libosinfo-check/systems=libvirt-debian-8/ws/build…'> make[2]: Nothing to be done for 'check-am'. make[2]: Leaving directory '<https://ci.centos.org/job/libosinfo-check/systems=libvirt-debian-8/ws/build…'> make[1]: Leaving directory '<https://ci.centos.org/job/libosinfo-check/systems=libvirt-debian-8/ws/build…'> Making check in po make[1]: Entering directory '<https://ci.centos.org/job/libosinfo-check/systems=libvirt-debian-8/ws/build…'> INTLTOOL_EXTRACT="/usr/bin/intltool-extract" XGETTEXT="/usr/bin/xgettext" srcdir=../../po /usr/bin/intltool-update --gettext-package libosinfo --pot rm -f missing notexist srcdir=../../po /usr/bin/intltool-update -m if [ -r missing -o -r notexist ]; then \ exit 1; \ fi make[1]: Leaving directory '<https://ci.centos.org/job/libosinfo-check/systems=libvirt-debian-8/ws/build…'> Making check in examples make[1]: Entering directory '<https://ci.centos.org/job/libosinfo-check/systems=libvirt-debian-8/ws/build…'> make[1]: Nothing to be done for 'check'. make[1]: Leaving directory '<https://ci.centos.org/job/libosinfo-check/systems=libvirt-debian-8/ws/build…'> Making check in tests make[1]: Entering directory '<https://ci.centos.org/job/libosinfo-check/systems=libvirt-debian-8/ws/build…'> /usr/bin/make test-entity test-device test-list test-devicelist test-filter test-product test-os test-oslist test-productfilter test-platform test-platformlist test-db test-loader test-isodetect test-install-script test-os-resources test-mediauris test-treeuris make[2]: Entering directory '<https://ci.centos.org/job/libosinfo-check/systems=libvirt-debian-8/ws/build…'> CC test_entity-test-entity.o CC test_list-test-list.o CC test_device-test-device.o CC test_devicelist-test-devicelist.o CC test_filter-test-filter.o CC test_product-test-product.o CC test_os-test-os.o CC test_oslist-test-oslist.o CC test_productfilter-test-productfilter.o CC test_platform-test-platform.o CC test_platformlist-test-platformlist.o CC test_db-test-db.o CC test_loader-test-loader.o CC test_install_script-test-install-script.o CC test_isodetect-test-isodetect.o CC test_os_resources-test-os-resources.o CC test_mediauris-test-mediauris.o CC test_treeuris-test-treeuris.o CCLD test-entity CCLD test-device CCLD test-list CCLD test-devicelist CCLD test-filter CCLD test-product CCLD test-os CCLD test-oslist CCLD test-productfilter CCLD test-platformlist CCLD test-platform CCLD test-db CCLD test-loader CCLD test-isodetect CCLD test-install-script CCLD test-os-resources CCLD test-mediauris CCLD test-treeuris make[2]: Leaving directory '<https://ci.centos.org/job/libosinfo-check/systems=libvirt-debian-8/ws/build…'> /usr/bin/make check-TESTS make[2]: Entering directory '<https://ci.centos.org/job/libosinfo-check/systems=libvirt-debian-8/ws/build…'> make[3]: Entering directory '<https://ci.centos.org/job/libosinfo-check/systems=libvirt-debian-8/ws/build…'> PASS: test-entity PASS: test-device PASS: test-devicelist PASS: test-list PASS: test-filter PASS: test-product PASS: test-os PASS: test-oslist PASS: test-productfilter PASS: test-platform PASS: test-platformlist PASS: test-db PASS: test-install-script PASS: test-loader PASS: test-os-resources PASS: test-treeuris PASS: test-isodetect ../../build-aux/test-driver: line 107: 1035 Aborted "$@" > $log_file 2>&1 FAIL: test-mediauris make[4]: Entering directory '<https://ci.centos.org/job/libosinfo-check/systems=libvirt-debian-8/ws/build…'> make[4]: Nothing to be done for 'all'. make[4]: Leaving directory '<https://ci.centos.org/job/libosinfo-check/systems=libvirt-debian-8/ws/build…'> ============================================================================ Testsuite summary for libosinfo 1.3.0 ============================================================================ # TOTAL: 18 # PASS: 17 # SKIP: 0 # XFAIL: 0 # FAIL: 1 # XPASS: 0 # ERROR: 0 ============================================================================ See tests/test-suite.log Please report to libosinfo(a)redhat.com ============================================================================ Makefile:1278: recipe for target 'test-suite.log' failed make[3]: *** [test-suite.log] Error 1 make[3]: Leaving directory '<https://ci.centos.org/job/libosinfo-check/systems=libvirt-debian-8/ws/build…'> Makefile:1384: recipe for target 'check-TESTS' failed make[2]: *** [check-TESTS] Error 2 make[2]: Leaving directory '<https://ci.centos.org/job/libosinfo-check/systems=libvirt-debian-8/ws/build…'> Makefile:1576: recipe for target 'check-am' failed make[1]: *** [check-am] Error 2 make[1]: Leaving directory '<https://ci.centos.org/job/libosinfo-check/systems=libvirt-debian-8/ws/build…'> Makefile:584: recipe for target 'check-recursive' failed make: *** [check-recursive] Error 1 + cat tests/test-suite.log =========================================== libosinfo 1.3.0: tests/test-suite.log =========================================== # TOTAL: 18 # PASS: 17 # SKIP: 0 # XFAIL: 0 # FAIL: 1 # XPASS: 0 # ERROR: 0 .. contents:: :depth: 2 FAIL: test-mediauris ==================== /mediauris/uris: ** ERROR:../../tests/test-mediauris.c:50:test_media: assertion failed (res == CURLE_OK): (28 == 0) + exit 1 Build step 'Execute shell' marked build as failure
1 4
0 0
[Libvirt-ci] Build failed in Jenkins: libosinfo-check » libvirt-debian-9 #26
by ci@centos.org 19 Oct '18

19 Oct '18
See <https://ci.centos.org/job/libosinfo-check/systems=libvirt-debian-9/26/displ…> ------------------------------------------ Started by upstream project "libosinfo-check" build number 26 originally caused by: Started by upstream project "libosinfo-syntax-check" build number 26 originally caused by: Started by upstream project "libosinfo-build" build number 26 originally caused by: Started by an SCM change [EnvInject] - Loading node environment variables. Building remotely on libvirt-debian-9 (libvirt) in workspace <https://ci.centos.org/job/libosinfo-check/systems=libvirt-debian-9/ws/> [libosinfo] $ /bin/sh -xe /tmp/jenkins7477166413384805525.sh + export LIBOSINFO_NETWORK_TESTS=1 + cd build + /usr/bin/make check GEN public-submodule-commit Making check in osinfo make[1]: Entering directory '<https://ci.centos.org/job/libosinfo-check/systems=libvirt-debian-9/ws/build…'> /usr/bin/make check-am make[2]: Entering directory '<https://ci.centos.org/job/libosinfo-check/systems=libvirt-debian-9/ws/build…'> /usr/bin/make check-local make[3]: Entering directory '<https://ci.centos.org/job/libosinfo-check/systems=libvirt-debian-9/ws/build…'> GEN check-symsorting GEN check-symfile make[3]: Leaving directory '<https://ci.centos.org/job/libosinfo-check/systems=libvirt-debian-9/ws/build…'> make[2]: Leaving directory '<https://ci.centos.org/job/libosinfo-check/systems=libvirt-debian-9/ws/build…'> make[1]: Leaving directory '<https://ci.centos.org/job/libosinfo-check/systems=libvirt-debian-9/ws/build…'> Making check in tools make[1]: Entering directory '<https://ci.centos.org/job/libosinfo-check/systems=libvirt-debian-9/ws/build…'> make[1]: Nothing to be done for 'check'. make[1]: Leaving directory '<https://ci.centos.org/job/libosinfo-check/systems=libvirt-debian-9/ws/build…'> Making check in docs make[1]: Entering directory '<https://ci.centos.org/job/libosinfo-check/systems=libvirt-debian-9/ws/build…'> Making check in reference make[2]: Entering directory '<https://ci.centos.org/job/libosinfo-check/systems=libvirt-debian-9/ws/build…'> make[2]: Nothing to be done for 'check'. make[2]: Leaving directory '<https://ci.centos.org/job/libosinfo-check/systems=libvirt-debian-9/ws/build…'> make[2]: Entering directory '<https://ci.centos.org/job/libosinfo-check/systems=libvirt-debian-9/ws/build…'> make[2]: Nothing to be done for 'check-am'. make[2]: Leaving directory '<https://ci.centos.org/job/libosinfo-check/systems=libvirt-debian-9/ws/build…'> make[1]: Leaving directory '<https://ci.centos.org/job/libosinfo-check/systems=libvirt-debian-9/ws/build…'> Making check in po make[1]: Entering directory '<https://ci.centos.org/job/libosinfo-check/systems=libvirt-debian-9/ws/build…'> INTLTOOL_EXTRACT="/usr/bin/intltool-extract" XGETTEXT="/usr/bin/xgettext" srcdir=../../po /usr/bin/intltool-update --gettext-package libosinfo --pot rm -f missing notexist srcdir=../../po /usr/bin/intltool-update -m Unescaped left brace in regex is deprecated, passed through in regex; marked by <-- HERE in m/\${ <-- HERE ?PACKAGE_NAME}?/ at /usr/bin/intltool-update line 1071, <CONF> line 295. if [ -r missing -o -r notexist ]; then \ exit 1; \ fi make[1]: Leaving directory '<https://ci.centos.org/job/libosinfo-check/systems=libvirt-debian-9/ws/build…'> Making check in examples make[1]: Entering directory '<https://ci.centos.org/job/libosinfo-check/systems=libvirt-debian-9/ws/build…'> make[1]: Nothing to be done for 'check'. make[1]: Leaving directory '<https://ci.centos.org/job/libosinfo-check/systems=libvirt-debian-9/ws/build…'> Making check in tests make[1]: Entering directory '<https://ci.centos.org/job/libosinfo-check/systems=libvirt-debian-9/ws/build…'> /usr/bin/make test-entity test-device test-list test-devicelist test-filter test-product test-os test-oslist test-productfilter test-platform test-platformlist test-db test-loader test-isodetect test-install-script test-os-resources test-mediauris test-treeuris make[2]: Entering directory '<https://ci.centos.org/job/libosinfo-check/systems=libvirt-debian-9/ws/build…'> CC test_entity-test-entity.o CC test_device-test-device.o CC test_list-test-list.o CC test_devicelist-test-devicelist.o CC test_filter-test-filter.o CC test_product-test-product.o CC test_os-test-os.o CC test_oslist-test-oslist.o CC test_productfilter-test-productfilter.o CC test_platform-test-platform.o CC test_platformlist-test-platformlist.o CC test_db-test-db.o CC test_loader-test-loader.o CC test_isodetect-test-isodetect.o CC test_install_script-test-install-script.o CC test_os_resources-test-os-resources.o CC test_mediauris-test-mediauris.o CC test_treeuris-test-treeuris.o CCLD test-entity CCLD test-device CCLD test-list CCLD test-devicelist CCLD test-filter CCLD test-product CCLD test-os CCLD test-oslist CCLD test-productfilter CCLD test-platform CCLD test-platformlist CCLD test-db CCLD test-loader CCLD test-isodetect CCLD test-install-script CCLD test-os-resources CCLD test-mediauris CCLD test-treeuris make[2]: Leaving directory '<https://ci.centos.org/job/libosinfo-check/systems=libvirt-debian-9/ws/build…'> /usr/bin/make check-TESTS make[2]: Entering directory '<https://ci.centos.org/job/libosinfo-check/systems=libvirt-debian-9/ws/build…'> make[3]: Entering directory '<https://ci.centos.org/job/libosinfo-check/systems=libvirt-debian-9/ws/build…'> PASS: test-device PASS: test-list PASS: test-entity PASS: test-devicelist PASS: test-filter PASS: test-product PASS: test-os PASS: test-oslist PASS: test-productfilter PASS: test-db PASS: test-platformlist PASS: test-platform PASS: test-install-script PASS: test-os-resources PASS: test-loader PASS: test-treeuris PASS: test-isodetect ../../build-aux/test-driver: line 107: 24347 Aborted "$@" > $log_file 2>&1 FAIL: test-mediauris ============================================================================ Testsuite summary for libosinfo 1.3.0 ============================================================================ # TOTAL: 18 # PASS: 17 # SKIP: 0 # XFAIL: 0 # FAIL: 1 # XPASS: 0 # ERROR: 0 ============================================================================ See tests/test-suite.log Please report to libosinfo(a)redhat.com ============================================================================ Makefile:1289: recipe for target 'test-suite.log' failed make[3]: *** [test-suite.log] Error 1 make[3]: Leaving directory '<https://ci.centos.org/job/libosinfo-check/systems=libvirt-debian-9/ws/build…'> Makefile:1395: recipe for target 'check-TESTS' failed make[2]: *** [check-TESTS] Error 2 make[2]: Leaving directory '<https://ci.centos.org/job/libosinfo-check/systems=libvirt-debian-9/ws/build…'> Makefile:1587: recipe for target 'check-am' failed make[1]: *** [check-am] Error 2 make[1]: Leaving directory '<https://ci.centos.org/job/libosinfo-check/systems=libvirt-debian-9/ws/build…'> Makefile:595: recipe for target 'check-recursive' failed make: *** [check-recursive] Error 1 + cat tests/test-suite.log =========================================== libosinfo 1.3.0: tests/test-suite.log =========================================== # TOTAL: 18 # PASS: 17 # SKIP: 0 # XFAIL: 0 # FAIL: 1 # XPASS: 0 # ERROR: 0 .. contents:: :depth: 2 FAIL: test-mediauris ==================== /mediauris/uris: ** ERROR:../../tests/test-mediauris.c:49:test_media: assertion failed (res == CURLE_OK): (28 == 0) FAIL test-mediauris (exit status: 134) + exit 1 Build step 'Execute shell' marked build as failure
1 1
0 0
[Libvirt-ci] Build failed in Jenkins: libosinfo-check » libvirt-freebsd-11 #26
by ci@centos.org 19 Oct '18

19 Oct '18
See <https://ci.centos.org/job/libosinfo-check/systems=libvirt-freebsd-11/26/dis…> ------------------------------------------ Started by upstream project "libosinfo-check" build number 26 originally caused by: Started by upstream project "libosinfo-syntax-check" build number 26 originally caused by: Started by upstream project "libosinfo-build" build number 26 originally caused by: Started by an SCM change [EnvInject] - Loading node environment variables. Building remotely on libvirt-freebsd-11 (libvirt) in workspace <https://ci.centos.org/job/libosinfo-check/systems=libvirt-freebsd-11/ws/> [libosinfo] $ /bin/sh -xe /tmp/jenkins5191040467608488672.sh + export 'LIBOSINFO_NETWORK_TESTS=1' + cd build + /usr/local/bin/gmake check Making check in osinfo GEN public-submodule-commit gmake[1]: Entering directory '/usr<https://ci.centos.org/job/libosinfo-check/systems=libvirt-freebsd-11/ws/bui…'> /usr/local/bin/gmake check-am gmake[2]: Entering directory '/usr<https://ci.centos.org/job/libosinfo-check/systems=libvirt-freebsd-11/ws/bui…'> /usr/local/bin/gmake check-local gmake[3]: Entering directory '/usr<https://ci.centos.org/job/libosinfo-check/systems=libvirt-freebsd-11/ws/bui…'> GEN check-symsorting gmake[3]: Leaving directory '/usr<https://ci.centos.org/job/libosinfo-check/systems=libvirt-freebsd-11/ws/bui…'> gmake[2]: Leaving directory '/usr<https://ci.centos.org/job/libosinfo-check/systems=libvirt-freebsd-11/ws/bui…'> gmake[1]: Leaving directory '/usr<https://ci.centos.org/job/libosinfo-check/systems=libvirt-freebsd-11/ws/bui…'> Making check in tools gmake[1]: Entering directory '/usr<https://ci.centos.org/job/libosinfo-check/systems=libvirt-freebsd-11/ws/bui…'> gmake[1]: Nothing to be done for 'check'. gmake[1]: Leaving directory '/usr<https://ci.centos.org/job/libosinfo-check/systems=libvirt-freebsd-11/ws/bui…'> Making check in docs gmake[1]: Entering directory '/usr<https://ci.centos.org/job/libosinfo-check/systems=libvirt-freebsd-11/ws/bui…'> Making check in reference gmake[2]: Entering directory '/usr<https://ci.centos.org/job/libosinfo-check/systems=libvirt-freebsd-11/ws/bui…'> gmake[2]: Nothing to be done for 'check'. gmake[2]: Leaving directory '/usr<https://ci.centos.org/job/libosinfo-check/systems=libvirt-freebsd-11/ws/bui…'> gmake[2]: Entering directory '/usr<https://ci.centos.org/job/libosinfo-check/systems=libvirt-freebsd-11/ws/bui…'> gmake[2]: Nothing to be done for 'check-am'. gmake[2]: Leaving directory '/usr<https://ci.centos.org/job/libosinfo-check/systems=libvirt-freebsd-11/ws/bui…'> gmake[1]: Leaving directory '/usr<https://ci.centos.org/job/libosinfo-check/systems=libvirt-freebsd-11/ws/bui…'> Making check in po gmake[1]: Entering directory '/usr<https://ci.centos.org/job/libosinfo-check/systems=libvirt-freebsd-11/ws/bui…'> INTLTOOL_EXTRACT="/usr/local/bin/intltool-extract" XGETTEXT="/usr/local/bin/xgettext" srcdir=../../po /usr/local/bin/intltool-update --gettext-package libosinfo --pot rm -f missing notexist srcdir=../../po /usr/local/bin/intltool-update -m if [ -r missing -o -r notexist ]; then \ exit 1; \ fi gmake[1]: Leaving directory '/usr<https://ci.centos.org/job/libosinfo-check/systems=libvirt-freebsd-11/ws/bui…'> Making check in examples gmake[1]: Entering directory '/usr<https://ci.centos.org/job/libosinfo-check/systems=libvirt-freebsd-11/ws/bui…'> gmake[1]: Nothing to be done for 'check'. gmake[1]: Leaving directory '/usr<https://ci.centos.org/job/libosinfo-check/systems=libvirt-freebsd-11/ws/bui…'> Making check in tests gmake[1]: Entering directory '/usr<https://ci.centos.org/job/libosinfo-check/systems=libvirt-freebsd-11/ws/bui…'> /usr/local/bin/gmake test-entity test-device test-list test-devicelist test-filter test-product test-os test-oslist test-productfilter test-platform test-platformlist test-db test-loader test-isodetect test-install-script test-os-resources test-mediauris test-treeuris gmake[2]: Entering directory '/usr<https://ci.centos.org/job/libosinfo-check/systems=libvirt-freebsd-11/ws/bui…'> CC test_entity-test-entity.o CC test_device-test-device.o CC test_list-test-list.o CC test_devicelist-test-devicelist.o CC test_filter-test-filter.o CC test_product-test-product.o CC test_os-test-os.o CC test_oslist-test-oslist.o CC test_productfilter-test-productfilter.o CC test_platform-test-platform.o CC test_platformlist-test-platformlist.o CC test_db-test-db.o CC test_loader-test-loader.o CC test_isodetect-test-isodetect.o CC test_install_script-test-install-script.o CC test_os_resources-test-os-resources.o CC test_mediauris-test-mediauris.o CC test_treeuris-test-treeuris.o CCLD test-entity CCLD test-device CCLD test-list CCLD test-devicelist CCLD test-filter CCLD test-product CCLD test-os CCLD test-oslist CCLD test-productfilter CCLD test-platform CCLD test-platformlist CCLD test-db CCLD test-loader CCLD test-isodetect CCLD test-install-script CCLD test-os-resources CCLD test-mediauris CCLD test-treeuris gmake[2]: Leaving directory '/usr<https://ci.centos.org/job/libosinfo-check/systems=libvirt-freebsd-11/ws/bui…'> /usr/local/bin/gmake check-TESTS gmake[2]: Entering directory '/usr<https://ci.centos.org/job/libosinfo-check/systems=libvirt-freebsd-11/ws/bui…'> gmake[3]: Entering directory '/usr<https://ci.centos.org/job/libosinfo-check/systems=libvirt-freebsd-11/ws/bui…'> PASS: test-device PASS: test-entity PASS: test-list PASS: test-devicelist PASS: test-filter PASS: test-product PASS: test-os PASS: test-productfilter PASS: test-oslist PASS: test-platform PASS: test-platformlist PASS: test-db PASS: test-install-script PASS: test-loader PASS: test-os-resources PASS: test-treeuris Abort trap (core dumped) FAIL: test-mediauris PASS: test-isodetect ============================================================================ Testsuite summary for libosinfo 1.3.0 ============================================================================ # TOTAL: 18 # PASS: 17 # SKIP: 0 # XFAIL: 0 # FAIL: 1 # XPASS: 0 # ERROR: 0 ============================================================================ See tests/test-suite.log Please report to libosinfo(a)redhat.com ============================================================================ gmake[3]: *** [Makefile:1313: test-suite.log] Error 1 gmake[3]: Leaving directory '/usr<https://ci.centos.org/job/libosinfo-check/systems=libvirt-freebsd-11/ws/bui…'> gmake[2]: *** [Makefile:1421: check-TESTS] Error 2 gmake[2]: Leaving directory '/usr<https://ci.centos.org/job/libosinfo-check/systems=libvirt-freebsd-11/ws/bui…'> gmake[1]: *** [Makefile:1614: check-am] Error 2 gmake[1]: Leaving directory '/usr<https://ci.centos.org/job/libosinfo-check/systems=libvirt-freebsd-11/ws/bui…'> gmake: *** [Makefile:594: check-recursive] Error 1 + cat tests/test-suite.log =========================================== libosinfo 1.3.0: tests/test-suite.log =========================================== # TOTAL: 18 # PASS: 17 # SKIP: 0 # XFAIL: 0 # FAIL: 1 # XPASS: 0 # ERROR: 0 .. contents:: :depth: 2 FAIL: test-mediauris ==================== /mediauris/uris: ** ERROR:../../tests/test-mediauris.c:49:test_media: assertion failed (res == CURLE_OK): (7 == 0) FAIL test-mediauris (exit status: 134) + exit 1 Build step 'Execute shell' marked build as failure
1 1
0 0
[Libvirt-ci] Build failed in Jenkins: libosinfo-check » libvirt-centos-7 #26
by ci@centos.org 19 Oct '18

19 Oct '18
See <https://ci.centos.org/job/libosinfo-check/systems=libvirt-centos-7/26/displ…> ------------------------------------------ Started by upstream project "libosinfo-check" build number 26 originally caused by: Started by upstream project "libosinfo-syntax-check" build number 26 originally caused by: Started by upstream project "libosinfo-build" build number 26 originally caused by: Started by an SCM change [EnvInject] - Loading node environment variables. Building remotely on libvirt-centos-7 (libvirt) in workspace <https://ci.centos.org/job/libosinfo-check/systems=libvirt-centos-7/ws/> [libosinfo] $ /bin/sh -xe /tmp/jenkins6741246631504728010.sh + export LIBOSINFO_NETWORK_TESTS=1 + LIBOSINFO_NETWORK_TESTS=1 + cd build + /usr/bin/gmake check GEN public-submodule-commit Making check in osinfo gmake[1]: Entering directory `<https://ci.centos.org/job/libosinfo-check/systems=libvirt-centos-7/ws/build…'> /usr/bin/gmake check-am gmake[2]: Entering directory `<https://ci.centos.org/job/libosinfo-check/systems=libvirt-centos-7/ws/build…'> /usr/bin/gmake check-local gmake[3]: Entering directory `<https://ci.centos.org/job/libosinfo-check/systems=libvirt-centos-7/ws/build…'> GEN check-symfile GEN check-symsorting gmake[3]: Leaving directory `<https://ci.centos.org/job/libosinfo-check/systems=libvirt-centos-7/ws/build…'> gmake[2]: Leaving directory `<https://ci.centos.org/job/libosinfo-check/systems=libvirt-centos-7/ws/build…'> gmake[1]: Leaving directory `<https://ci.centos.org/job/libosinfo-check/systems=libvirt-centos-7/ws/build…'> Making check in tools gmake[1]: Entering directory `<https://ci.centos.org/job/libosinfo-check/systems=libvirt-centos-7/ws/build…'> gmake[1]: Nothing to be done for `check'. gmake[1]: Leaving directory `<https://ci.centos.org/job/libosinfo-check/systems=libvirt-centos-7/ws/build…'> Making check in docs gmake[1]: Entering directory `<https://ci.centos.org/job/libosinfo-check/systems=libvirt-centos-7/ws/build…'> Making check in reference gmake[2]: Entering directory `<https://ci.centos.org/job/libosinfo-check/systems=libvirt-centos-7/ws/build…'> gmake[2]: Nothing to be done for `check'. gmake[2]: Leaving directory `<https://ci.centos.org/job/libosinfo-check/systems=libvirt-centos-7/ws/build…'> gmake[2]: Entering directory `<https://ci.centos.org/job/libosinfo-check/systems=libvirt-centos-7/ws/build…'> gmake[2]: Nothing to be done for `check-am'. gmake[2]: Leaving directory `<https://ci.centos.org/job/libosinfo-check/systems=libvirt-centos-7/ws/build…'> gmake[1]: Leaving directory `<https://ci.centos.org/job/libosinfo-check/systems=libvirt-centos-7/ws/build…'> Making check in po gmake[1]: Entering directory `<https://ci.centos.org/job/libosinfo-check/systems=libvirt-centos-7/ws/build…'> INTLTOOL_EXTRACT="/usr/bin/intltool-extract" XGETTEXT="/usr/bin/xgettext" srcdir=../../po /usr/bin/intltool-update --gettext-package libosinfo --pot rm -f missing notexist srcdir=../../po /usr/bin/intltool-update -m if [ -r missing -o -r notexist ]; then \ exit 1; \ fi gmake[1]: Leaving directory `<https://ci.centos.org/job/libosinfo-check/systems=libvirt-centos-7/ws/build…'> Making check in examples gmake[1]: Entering directory `<https://ci.centos.org/job/libosinfo-check/systems=libvirt-centos-7/ws/build…'> gmake[1]: Nothing to be done for `check'. gmake[1]: Leaving directory `<https://ci.centos.org/job/libosinfo-check/systems=libvirt-centos-7/ws/build…'> Making check in tests gmake[1]: Entering directory `<https://ci.centos.org/job/libosinfo-check/systems=libvirt-centos-7/ws/build…'> /usr/bin/gmake test-entity test-device test-list test-devicelist test-filter test-product test-os test-oslist test-productfilter test-platform test-platformlist test-db test-loader test-isodetect test-install-script test-os-resources test-mediauris test-treeuris gmake[2]: Entering directory `<https://ci.centos.org/job/libosinfo-check/systems=libvirt-centos-7/ws/build…'> CC test_entity-test-entity.o CC test_list-test-list.o CC test_device-test-device.o CC test_devicelist-test-devicelist.o CC test_filter-test-filter.o CC test_product-test-product.o CC test_os-test-os.o CC test_oslist-test-oslist.o CC test_productfilter-test-productfilter.o CC test_platform-test-platform.o CC test_platformlist-test-platformlist.o CC test_db-test-db.o CC test_loader-test-loader.o CC test_isodetect-test-isodetect.o CC test_install_script-test-install-script.o CC test_os_resources-test-os-resources.o CC test_mediauris-test-mediauris.o CC test_treeuris-test-treeuris.o CCLD test-entity CCLD test-device CCLD test-list CCLD test-devicelist CCLD test-filter CCLD test-product CCLD test-os CCLD test-oslist CCLD test-productfilter CCLD test-platform CCLD test-platformlist CCLD test-db CCLD test-loader CCLD test-isodetect CCLD test-install-script CCLD test-os-resources CCLD test-mediauris CCLD test-treeuris gmake[2]: Leaving directory `<https://ci.centos.org/job/libosinfo-check/systems=libvirt-centos-7/ws/build…'> /usr/bin/gmake check-TESTS gmake[2]: Entering directory `<https://ci.centos.org/job/libosinfo-check/systems=libvirt-centos-7/ws/build…'> gmake[3]: Entering directory `<https://ci.centos.org/job/libosinfo-check/systems=libvirt-centos-7/ws/build…'> PASS: test-device PASS: test-list PASS: test-entity PASS: test-product PASS: test-devicelist PASS: test-filter PASS: test-oslist PASS: test-os PASS: test-productfilter PASS: test-platform PASS: test-platformlist PASS: test-db PASS: test-install-script PASS: test-os-resources PASS: test-loader PASS: test-treeuris ../../build-aux/test-driver: line 95: 22490 Aborted "$@" > $log_file 2>&1 FAIL: test-mediauris PASS: test-isodetect gmake[4]: Entering directory `<https://ci.centos.org/job/libosinfo-check/systems=libvirt-centos-7/ws/build…'> gmake[4]: Nothing to be done for `all'. gmake[4]: Leaving directory `<https://ci.centos.org/job/libosinfo-check/systems=libvirt-centos-7/ws/build…'> ============================================================================ Testsuite summary for libosinfo 1.3.0 ============================================================================ # TOTAL: 18 # PASS: 17 # SKIP: 0 # XFAIL: 0 # FAIL: 1 # XPASS: 0 # ERROR: 0 ============================================================================ See tests/test-suite.log Please report to libosinfo(a)redhat.com ============================================================================ gmake[3]: *** [test-suite.log] Error 1 gmake[3]: Leaving directory `<https://ci.centos.org/job/libosinfo-check/systems=libvirt-centos-7/ws/build…'> gmake[2]: *** [check-TESTS] Error 2 gmake[2]: Leaving directory `<https://ci.centos.org/job/libosinfo-check/systems=libvirt-centos-7/ws/build…'> gmake[1]: *** [check-am] Error 2 gmake[1]: Leaving directory `<https://ci.centos.org/job/libosinfo-check/systems=libvirt-centos-7/ws/build…'> gmake: *** [check-recursive] Error 1 + cat tests/test-suite.log =========================================== libosinfo 1.3.0: tests/test-suite.log =========================================== # TOTAL: 18 # PASS: 17 # SKIP: 0 # XFAIL: 0 # FAIL: 1 # XPASS: 0 # ERROR: 0 .. contents:: :depth: 2 FAIL: test-mediauris ==================== /mediauris/uris: ** ERROR:../../tests/test-mediauris.c:49:test_media: assertion failed (res == CURLE_OK): (22 == 0) + exit 1 Build step 'Execute shell' marked build as failure
1 1
0 0
[Libvirt-ci] Build failed in Jenkins: libvirt-python-build » libvirt-freebsd-10 #74
by ci@centos.org 17 Oct '18

17 Oct '18
See <https://ci.centos.org/job/libvirt-python-build/systems=libvirt-freebsd-10/7…> ------------------------------------------ Started by upstream project "libvirt-python-build" build number 74 originally caused by: Started by upstream project "libvirt-build" build number 96 originally caused by: Started by an SCM change Started by an SCM change Started by an SCM change [EnvInject] - Loading node environment variables. Building remotely on libvirt-freebsd-10 (libvirt) in workspace <https://ci.centos.org/job/libvirt-python-build/systems=libvirt-freebsd-10/w…> > git rev-parse --is-inside-work-tree # timeout=10 Fetching changes from the remote Git repository > git config remote.origin.url https://github.com/libvirt/libvirt-python.git # timeout=10 Fetching upstream changes from https://github.com/libvirt/libvirt-python.git > git --version # timeout=10 > git fetch --tags --progress https://github.com/libvirt/libvirt-python.git +refs/heads/*:refs/remotes/origin/* Checking out Revision b1828e604f92c426301cd63b174292c9fda88182 (refs/remotes/origin/master) > git config core.sparsecheckout # timeout=10 > git checkout -f b1828e604f92c426301cd63b174292c9fda88182 Commit message: "Release of libvirt-python 4.8.0" > git rev-list --no-walk b1828e604f92c426301cd63b174292c9fda88182 # timeout=10 Cleaning workspace > git rev-parse --verify HEAD # timeout=10 FATAL: Invalid id: b1828e604f92c426301cd63b174292c9fda88182 Process leaked file descriptors. See https://jenkins.io/redirect/troubleshooting/process-leaked-file-descriptors for more information Also: hudson.remoting.Channel$CallSiteStackTrace: Remote call to JNLP4-connect connection from n64.gusty.ci.centos.org/172.19.2.192:1027 at hudson.remoting.Channel.attachCallSiteStackTrace(Channel.java:1741) at hudson.remoting.UserRequest$ExceptionResponse.retrieve(UserRequest.java:357) at hudson.remoting.Channel.call(Channel.java:955) at hudson.remoting.RemoteInvocationHandler.invoke(RemoteInvocationHandler.java:283) at com.sun.proxy.$Proxy86.clean(Unknown Source) at org.jenkinsci.plugins.gitclient.RemoteGitImpl.clean(RemoteGitImpl.java:450) at hudson.plugins.git.extensions.impl.CleanCheckout.onCheckoutCompleted(CleanCheckout.java:30) at hudson.plugins.git.GitSCM.checkout(GitSCM.java:1264) at hudson.scm.SCM.checkout(SCM.java:504) at hudson.model.AbstractProject.checkout(AbstractProject.java:1208) at hudson.model.AbstractBuild$AbstractBuildExecution.defaultCheckout(AbstractBuild.java:574) at jenkins.scm.SCMCheckoutStrategy.checkout(SCMCheckoutStrategy.java:86) at hudson.model.AbstractBuild$AbstractBuildExecution.run(AbstractBuild.java:499) at hudson.model.Run.execute(Run.java:1798) at hudson.matrix.MatrixRun.run(MatrixRun.java:153) at hudson.model.ResourceController.execute(ResourceController.java:97) at hudson.model.Executor.run(Executor.java:429) org.eclipse.jgit.errors.InvalidObjectIdException: Invalid id: b1828e604f92c426301cd63b174292c9fda88182 Process leaked file descriptors. See https://jenkins.io/redirect/troubleshooting/process-leaked-file-descriptors for more information at org.eclipse.jgit.lib.ObjectId.fromString(ObjectId.java:232) at org.jenkinsci.plugins.gitclient.CliGitAPIImpl.validateRevision(CliGitAPIImpl.java:866) at org.jenkinsci.plugins.gitclient.CliGitAPIImpl.reset(CliGitAPIImpl.java:465) at org.jenkinsci.plugins.gitclient.CliGitAPIImpl.clean(CliGitAPIImpl.java:801) at hudson.plugins.git.GitAPI.clean(GitAPI.java:311) at sun.reflect.GeneratedMethodAccessor987.invoke(Unknown Source) at sun.reflect.DelegatingMethodAccessorImpl.invoke(DelegatingMethodAccessorImpl.java:43) at java.lang.reflect.Method.invoke(Method.java:498) at hudson.remoting.RemoteInvocationHandler$RPCRequest.perform(RemoteInvocationHandler.java:929) at hudson.remoting.RemoteInvocationHandler$RPCRequest.call(RemoteInvocationHandler.java:903) at hudson.remoting.RemoteInvocationHandler$RPCRequest.call(RemoteInvocationHandler.java:855) at hudson.remoting.UserRequest.perform(UserRequest.java:212) at hudson.remoting.UserRequest.perform(UserRequest.java:54) at hudson.remoting.Request$2.run(Request.java:369) at hudson.remoting.InterceptingExecutorService$1.call(InterceptingExecutorService.java:72) at java.util.concurrent.FutureTask.run(FutureTask.java:266) at java.util.concurrent.ThreadPoolExecutor.runWorker(ThreadPoolExecutor.java:1149) at java.util.concurrent.ThreadPoolExecutor$Worker.run(ThreadPoolExecutor.java:624) at hudson.remoting.Engine$1.lambda$newThread$0(Engine.java:93) at java.lang.Thread.run(Thread.java:748)
1 1
0 0
[Libvirt-ci] Build failed in Jenkins: libosinfo-check » libvirt-fedora-27 #25
by ci@centos.org 15 Oct '18

15 Oct '18
See <https://ci.centos.org/job/libosinfo-check/systems=libvirt-fedora-27/25/disp…> ------------------------------------------ Started by upstream project "libosinfo-check" build number 25 originally caused by: Started by upstream project "libosinfo-syntax-check" build number 25 originally caused by: Started by upstream project "libosinfo-build" build number 25 originally caused by: Started by upstream project "osinfo-db-build" build number 18 originally caused by: Started by upstream project "osinfo-db-tools-build" build number 5 originally caused by: Started by an SCM change [EnvInject] - Loading node environment variables. Building remotely on libvirt-fedora-27 (libvirt) in workspace <https://ci.centos.org/job/libosinfo-check/systems=libvirt-fedora-27/ws/> [libosinfo] $ /bin/sh -xe /tmp/jenkins625032861861364313.sh + export LIBOSINFO_NETWORK_TESTS=1 + LIBOSINFO_NETWORK_TESTS=1 + cd build + /usr/bin/gmake check GEN public-submodule-commit Making check in osinfo gmake[1]: Entering directory '<https://ci.centos.org/job/libosinfo-check/systems=libvirt-fedora-27/ws/buil…'> /usr/bin/gmake check-am gmake[2]: Entering directory '<https://ci.centos.org/job/libosinfo-check/systems=libvirt-fedora-27/ws/buil…'> /usr/bin/gmake check-local gmake[3]: Entering directory '<https://ci.centos.org/job/libosinfo-check/systems=libvirt-fedora-27/ws/buil…'> GEN check-symfile GEN check-symsorting gmake[3]: Leaving directory '<https://ci.centos.org/job/libosinfo-check/systems=libvirt-fedora-27/ws/buil…'> gmake[2]: Leaving directory '<https://ci.centos.org/job/libosinfo-check/systems=libvirt-fedora-27/ws/buil…'> gmake[1]: Leaving directory '<https://ci.centos.org/job/libosinfo-check/systems=libvirt-fedora-27/ws/buil…'> Making check in tools gmake[1]: Entering directory '<https://ci.centos.org/job/libosinfo-check/systems=libvirt-fedora-27/ws/buil…'> gmake[1]: Nothing to be done for 'check'. gmake[1]: Leaving directory '<https://ci.centos.org/job/libosinfo-check/systems=libvirt-fedora-27/ws/buil…'> Making check in docs gmake[1]: Entering directory '<https://ci.centos.org/job/libosinfo-check/systems=libvirt-fedora-27/ws/buil…'> Making check in reference gmake[2]: Entering directory '<https://ci.centos.org/job/libosinfo-check/systems=libvirt-fedora-27/ws/buil…'> gmake[2]: Nothing to be done for 'check'. gmake[2]: Leaving directory '<https://ci.centos.org/job/libosinfo-check/systems=libvirt-fedora-27/ws/buil…'> gmake[2]: Entering directory '<https://ci.centos.org/job/libosinfo-check/systems=libvirt-fedora-27/ws/buil…'> gmake[2]: Nothing to be done for 'check-am'. gmake[2]: Leaving directory '<https://ci.centos.org/job/libosinfo-check/systems=libvirt-fedora-27/ws/buil…'> gmake[1]: Leaving directory '<https://ci.centos.org/job/libosinfo-check/systems=libvirt-fedora-27/ws/buil…'> Making check in po gmake[1]: Entering directory '<https://ci.centos.org/job/libosinfo-check/systems=libvirt-fedora-27/ws/buil…'> INTLTOOL_EXTRACT="/usr/bin/intltool-extract" XGETTEXT="/usr/bin/xgettext" srcdir=../../po /usr/bin/intltool-update --gettext-package libosinfo --pot rm -f missing notexist srcdir=../../po /usr/bin/intltool-update -m if [ -r missing -o -r notexist ]; then \ exit 1; \ fi gmake[1]: Leaving directory '<https://ci.centos.org/job/libosinfo-check/systems=libvirt-fedora-27/ws/buil…'> Making check in examples gmake[1]: Entering directory '<https://ci.centos.org/job/libosinfo-check/systems=libvirt-fedora-27/ws/buil…'> gmake[1]: Nothing to be done for 'check'. gmake[1]: Leaving directory '<https://ci.centos.org/job/libosinfo-check/systems=libvirt-fedora-27/ws/buil…'> Making check in tests gmake[1]: Entering directory '<https://ci.centos.org/job/libosinfo-check/systems=libvirt-fedora-27/ws/buil…'> /usr/bin/gmake test-entity test-device test-list test-devicelist test-filter test-product test-os test-oslist test-productfilter test-platform test-platformlist test-db test-loader test-isodetect test-install-script test-os-resources test-mediauris test-treeuris gmake[2]: Entering directory '<https://ci.centos.org/job/libosinfo-check/systems=libvirt-fedora-27/ws/buil…'> CC test_device-test-device.o CC test_entity-test-entity.o CC test_list-test-list.o CC test_devicelist-test-devicelist.o CC test_filter-test-filter.o CC test_product-test-product.o CC test_os-test-os.o CC test_oslist-test-oslist.o CC test_productfilter-test-productfilter.o CC test_platform-test-platform.o CC test_platformlist-test-platformlist.o CC test_db-test-db.o CC test_loader-test-loader.o CC test_isodetect-test-isodetect.o CC test_install_script-test-install-script.o CC test_os_resources-test-os-resources.o CC test_mediauris-test-mediauris.o CC test_treeuris-test-treeuris.o CCLD test-entity CCLD test-device CCLD test-list CCLD test-devicelist CCLD test-filter CCLD test-product CCLD test-os CCLD test-oslist CCLD test-productfilter CCLD test-platform CCLD test-platformlist CCLD test-db CCLD test-loader CCLD test-isodetect CCLD test-install-script CCLD test-os-resources CCLD test-mediauris CCLD test-treeuris gmake[2]: Leaving directory '<https://ci.centos.org/job/libosinfo-check/systems=libvirt-fedora-27/ws/buil…'> /usr/bin/gmake check-TESTS gmake[2]: Entering directory '<https://ci.centos.org/job/libosinfo-check/systems=libvirt-fedora-27/ws/buil…'> gmake[3]: Entering directory '<https://ci.centos.org/job/libosinfo-check/systems=libvirt-fedora-27/ws/buil…'> PASS: test-device PASS: test-entity PASS: test-list PASS: test-filter PASS: test-devicelist PASS: test-product PASS: test-os PASS: test-oslist PASS: test-productfilter PASS: test-platformlist PASS: test-platform PASS: test-db PASS: test-install-script PASS: test-loader PASS: test-os-resources PASS: test-treeuris PASS: test-isodetect ../../build-aux/test-driver: line 107: 12205 Aborted (core dumped) "$@" > $log_file 2>&1 FAIL: test-mediauris ============================================================================ Testsuite summary for libosinfo 1.3.0 ============================================================================ # TOTAL: 18 # PASS: 17 # SKIP: 0 # XFAIL: 0 # FAIL: 1 # XPASS: 0 # ERROR: 0 ============================================================================ See tests/test-suite.log Please report to libosinfo(a)redhat.com ============================================================================ gmake[3]: *** [Makefile:1289: test-suite.log] Error 1 gmake[3]: Leaving directory '<https://ci.centos.org/job/libosinfo-check/systems=libvirt-fedora-27/ws/buil…'> gmake[2]: *** [Makefile:1397: check-TESTS] Error 2 gmake[2]: Leaving directory '<https://ci.centos.org/job/libosinfo-check/systems=libvirt-fedora-27/ws/buil…'> gmake[1]: *** [Makefile:1587: check-am] Error 2 gmake[1]: Leaving directory '<https://ci.centos.org/job/libosinfo-check/systems=libvirt-fedora-27/ws/buil…'> gmake: *** [Makefile:594: check-recursive] Error 1 + cat tests/test-suite.log =========================================== libosinfo 1.3.0: tests/test-suite.log =========================================== # TOTAL: 18 # PASS: 17 # SKIP: 0 # XFAIL: 0 # FAIL: 1 # XPASS: 0 # ERROR: 0 .. contents:: :depth: 2 FAIL: test-mediauris ==================== /mediauris/uris: ** ERROR:../../tests/test-mediauris.c:50:test_media: assertion failed (res == CURLE_OK): (28 == 0) FAIL test-mediauris (exit status: 134) + exit 1 Build step 'Execute shell' marked build as failure
1 1
0 0
[Libvirt-ci] Build failed in Jenkins: libosinfo-check » libvirt-freebsd-10 #25
by ci@centos.org 15 Oct '18

15 Oct '18
See <https://ci.centos.org/job/libosinfo-check/systems=libvirt-freebsd-10/25/dis…> ------------------------------------------ Started by upstream project "libosinfo-check" build number 25 originally caused by: Started by upstream project "libosinfo-syntax-check" build number 25 originally caused by: Started by upstream project "libosinfo-build" build number 25 originally caused by: Started by upstream project "osinfo-db-build" build number 18 originally caused by: Started by upstream project "osinfo-db-tools-build" build number 5 originally caused by: Started by an SCM change [EnvInject] - Loading node environment variables. Building remotely on libvirt-freebsd-10 (libvirt) in workspace <https://ci.centos.org/job/libosinfo-check/systems=libvirt-freebsd-10/ws/> [libosinfo] $ /bin/sh -xe /tmp/jenkins4195017440608769323.sh + export LIBOSINFO_NETWORK_TESTS=1 + cd build + /usr/local/bin/gmake check Making check in osinfo GEN public-submodule-commit gmake[1]: Entering directory '/usr<https://ci.centos.org/job/libosinfo-check/systems=libvirt-freebsd-10/ws/bui…'> /usr/local/bin/gmake check-am gmake[2]: Entering directory '/usr<https://ci.centos.org/job/libosinfo-check/systems=libvirt-freebsd-10/ws/bui…'> /usr/local/bin/gmake check-local gmake[3]: Entering directory '/usr<https://ci.centos.org/job/libosinfo-check/systems=libvirt-freebsd-10/ws/bui…'> GEN check-symsorting gmake[3]: Leaving directory '/usr<https://ci.centos.org/job/libosinfo-check/systems=libvirt-freebsd-10/ws/bui…'> gmake[2]: Leaving directory '/usr<https://ci.centos.org/job/libosinfo-check/systems=libvirt-freebsd-10/ws/bui…'> gmake[1]: Leaving directory '/usr<https://ci.centos.org/job/libosinfo-check/systems=libvirt-freebsd-10/ws/bui…'> Making check in tools gmake[1]: Entering directory '/usr<https://ci.centos.org/job/libosinfo-check/systems=libvirt-freebsd-10/ws/bui…'> gmake[1]: Nothing to be done for 'check'. gmake[1]: Leaving directory '/usr<https://ci.centos.org/job/libosinfo-check/systems=libvirt-freebsd-10/ws/bui…'> Making check in docs gmake[1]: Entering directory '/usr<https://ci.centos.org/job/libosinfo-check/systems=libvirt-freebsd-10/ws/bui…'> Making check in reference gmake[2]: Entering directory '/usr<https://ci.centos.org/job/libosinfo-check/systems=libvirt-freebsd-10/ws/bui…'> gmake[2]: Nothing to be done for 'check'. gmake[2]: Leaving directory '/usr<https://ci.centos.org/job/libosinfo-check/systems=libvirt-freebsd-10/ws/bui…'> gmake[2]: Entering directory '/usr<https://ci.centos.org/job/libosinfo-check/systems=libvirt-freebsd-10/ws/bui…'> gmake[2]: Nothing to be done for 'check-am'. gmake[2]: Leaving directory '/usr<https://ci.centos.org/job/libosinfo-check/systems=libvirt-freebsd-10/ws/bui…'> gmake[1]: Leaving directory '/usr<https://ci.centos.org/job/libosinfo-check/systems=libvirt-freebsd-10/ws/bui…'> Making check in po gmake[1]: Entering directory '/usr<https://ci.centos.org/job/libosinfo-check/systems=libvirt-freebsd-10/ws/bui…'> INTLTOOL_EXTRACT="/usr/local/bin/intltool-extract" XGETTEXT="/usr/local/bin/xgettext" srcdir=../../po /usr/local/bin/intltool-update --gettext-package libosinfo --pot rm -f missing notexist srcdir=../../po /usr/local/bin/intltool-update -m if [ -r missing -o -r notexist ]; then \ exit 1; \ fi gmake[1]: Leaving directory '/usr<https://ci.centos.org/job/libosinfo-check/systems=libvirt-freebsd-10/ws/bui…'> Making check in examples gmake[1]: Entering directory '/usr<https://ci.centos.org/job/libosinfo-check/systems=libvirt-freebsd-10/ws/bui…'> gmake[1]: Nothing to be done for 'check'. gmake[1]: Leaving directory '/usr<https://ci.centos.org/job/libosinfo-check/systems=libvirt-freebsd-10/ws/bui…'> Making check in tests gmake[1]: Entering directory '/usr<https://ci.centos.org/job/libosinfo-check/systems=libvirt-freebsd-10/ws/bui…'> /usr/local/bin/gmake test-entity test-device test-list test-devicelist test-filter test-product test-os test-oslist test-productfilter test-platform test-platformlist test-db test-loader test-isodetect test-install-script test-os-resources test-mediauris test-treeuris gmake[2]: Entering directory '/usr<https://ci.centos.org/job/libosinfo-check/systems=libvirt-freebsd-10/ws/bui…'> CC test_entity-test-entity.o CC test_device-test-device.o CC test_list-test-list.o CC test_devicelist-test-devicelist.o CC test_filter-test-filter.o CC test_product-test-product.o CC test_os-test-os.o CC test_oslist-test-oslist.o CC test_productfilter-test-productfilter.o CC test_platform-test-platform.o CC test_platformlist-test-platformlist.o CC test_db-test-db.o CC test_loader-test-loader.o CC test_isodetect-test-isodetect.o CC test_install_script-test-install-script.o CC test_os_resources-test-os-resources.o CC test_mediauris-test-mediauris.o CC test_treeuris-test-treeuris.o CCLD test-entity CCLD test-device CCLD test-list CCLD test-devicelist CCLD test-filter CCLD test-product CCLD test-os CCLD test-oslist CCLD test-productfilter CCLD test-platform CCLD test-platformlist CCLD test-db CCLD test-loader CCLD test-isodetect CCLD test-install-script CCLD test-os-resources CCLD test-mediauris CCLD test-treeuris gmake[2]: Leaving directory '/usr<https://ci.centos.org/job/libosinfo-check/systems=libvirt-freebsd-10/ws/bui…'> /usr/local/bin/gmake check-TESTS gmake[2]: Entering directory '/usr<https://ci.centos.org/job/libosinfo-check/systems=libvirt-freebsd-10/ws/bui…'> gmake[3]: Entering directory '/usr<https://ci.centos.org/job/libosinfo-check/systems=libvirt-freebsd-10/ws/bui…'> PASS: test-device PASS: test-entity PASS: test-list PASS: test-devicelist PASS: test-filter PASS: test-product PASS: test-oslist PASS: test-productfilter PASS: test-os PASS: test-platform PASS: test-platformlist PASS: test-db PASS: test-install-script PASS: test-loader PASS: test-os-resources PASS: test-treeuris PASS: test-isodetect Abort trap (core dumped) FAIL: test-mediauris ============================================================================ Testsuite summary for libosinfo 1.3.0 ============================================================================ # TOTAL: 18 # PASS: 17 # SKIP: 0 # XFAIL: 0 # FAIL: 1 # XPASS: 0 # ERROR: 0 ============================================================================ See tests/test-suite.log Please report to libosinfo(a)redhat.com ============================================================================ gmake[3]: *** [Makefile:1313: test-suite.log] Error 1 gmake[3]: Leaving directory '/usr<https://ci.centos.org/job/libosinfo-check/systems=libvirt-freebsd-10/ws/bui…'> gmake[2]: *** [Makefile:1421: check-TESTS] Error 2 gmake[2]: Leaving directory '/usr<https://ci.centos.org/job/libosinfo-check/systems=libvirt-freebsd-10/ws/bui…'> gmake[1]: *** [Makefile:1614: check-am] Error 2 gmake[1]: Leaving directory '/usr<https://ci.centos.org/job/libosinfo-check/systems=libvirt-freebsd-10/ws/bui…'> gmake: *** [Makefile:594: check-recursive] Error 1 + cat tests/test-suite.log =========================================== libosinfo 1.3.0: tests/test-suite.log =========================================== # TOTAL: 18 # PASS: 17 # SKIP: 0 # XFAIL: 0 # FAIL: 1 # XPASS: 0 # ERROR: 0 .. contents:: :depth: 2 FAIL: test-mediauris ==================== /mediauris/uris: ** ERROR:../../tests/test-mediauris.c:50:test_media: assertion failed (res == CURLE_OK): (28 == 0) FAIL test-mediauris (exit status: 134) + exit 1 Build step 'Execute shell' marked build as failure
1 1
0 0
  • ← Newer
  • 1
  • 2
  • 3
  • 4
  • 5
  • 6
  • 7
  • 8
  • 9
  • 10
  • Older →

HyperKitty Powered by HyperKitty version 1.3.12.