libvirt List Archives
Sign In Sign Up
Manage this list Sign In Sign Up

Keyboard Shortcuts

Thread View

  • j: Next unread message
  • k: Previous unread message
  • j a: Jump to all threads
  • j l: Jump to MailingList overview

CI

Thread Start a new thread
Download
Threads by month
  • ----- 2025 -----
  • August
  • July
  • June
  • May
  • April
  • March
  • February
  • January
  • ----- 2024 -----
  • December
  • November
  • October
  • September
  • August
  • July
  • June
  • May
  • April
  • March
  • February
  • January
  • ----- 2023 -----
  • December
  • November
  • October
  • September
  • August
  • July
  • June
  • May
  • April
  • March
  • February
  • January
  • ----- 2022 -----
  • December
  • November
  • October
  • September
  • August
  • July
  • June
  • May
  • April
  • March
  • February
  • January
  • ----- 2021 -----
  • December
  • November
  • October
  • September
  • August
  • July
  • June
  • May
  • April
  • March
  • February
  • January
  • ----- 2020 -----
  • December
  • November
  • October
  • September
  • August
  • July
  • June
  • May
  • April
  • March
  • February
  • January
  • ----- 2019 -----
  • December
  • November
  • October
  • September
  • August
  • July
  • June
  • May
  • April
  • March
  • February
  • January
  • ----- 2018 -----
  • December
  • November
  • October
  • September
  • August
  • July
  • June
  • May
  • April
  • March
  • February
  • January
  • ----- 2017 -----
  • December
  • November
  • October
  • September
  • August
  • July
  • June
  • May
  • April
  • March
  • February
  • January
  • ----- 2016 -----
  • December
  • November
  • October
  • September
  • August
  • July
ci@lists.libvirt.org

October 2018

  • 2 participants
  • 91 discussions
[Libvirt-ci] Build failed in Jenkins: libvirt-dbus-check » libvirt-fedora-28 #47
by ci@centos.org 01 Oct '18

01 Oct '18
See <https://ci.centos.org/job/libvirt-dbus-check/systems=libvirt-fedora-28/47/d…> ------------------------------------------ Started by upstream project "libvirt-dbus-check" build number 47 originally caused by: Started by upstream project "libvirt-dbus-syntax-check" build number 47 originally caused by: Started by upstream project "libvirt-dbus-build" build number 47 originally caused by: Started by upstream project "libvirt-glib-build" build number 47 originally caused by: Started by upstream project "libvirt-build" build number 70 originally caused by: Started by an SCM change [EnvInject] - Loading node environment variables. Building remotely on libvirt-fedora-28 (libvirt) in workspace <https://ci.centos.org/job/libvirt-dbus-check/systems=libvirt-fedora-28/ws/> [libvirt-dbus] $ /bin/sh -xe /tmp/jenkins5695195326336509536.sh + cd build + /usr/bin/gmake check Making check in data gmake[1]: Entering directory '<https://ci.centos.org/job/libvirt-dbus-check/systems=libvirt-fedora-28/ws/b…'> gmake[1]: Nothing to be done for 'check'. gmake[1]: Leaving directory '<https://ci.centos.org/job/libvirt-dbus-check/systems=libvirt-fedora-28/ws/b…'> Making check in docs gmake[1]: Entering directory '<https://ci.centos.org/job/libvirt-dbus-check/systems=libvirt-fedora-28/ws/b…'> gmake[1]: Nothing to be done for 'check'. gmake[1]: Leaving directory '<https://ci.centos.org/job/libvirt-dbus-check/systems=libvirt-fedora-28/ws/b…'> Making check in src gmake[1]: Entering directory '<https://ci.centos.org/job/libvirt-dbus-check/systems=libvirt-fedora-28/ws/b…'> gmake[1]: Nothing to be done for 'check'. gmake[1]: Leaving directory '<https://ci.centos.org/job/libvirt-dbus-check/systems=libvirt-fedora-28/ws/b…'> Making check in tests gmake[1]: Entering directory '<https://ci.centos.org/job/libvirt-dbus-check/systems=libvirt-fedora-28/ws/b…'> /usr/bin/gmake test_util gmake[2]: Entering directory '<https://ci.centos.org/job/libvirt-dbus-check/systems=libvirt-fedora-28/ws/b…'> CC test_util-test_util.o CCLD test_util gmake[2]: Leaving directory '<https://ci.centos.org/job/libvirt-dbus-check/systems=libvirt-fedora-28/ws/b…'> /usr/bin/gmake check-TESTS gmake[2]: Entering directory '<https://ci.centos.org/job/libvirt-dbus-check/systems=libvirt-fedora-28/ws/b…'> gmake[3]: Entering directory '<https://ci.centos.org/job/libvirt-dbus-check/systems=libvirt-fedora-28/ws/b…'> PASS: test_util PASS: test_interface.py FAIL: test_domain.py PASS: test_network.py PASS: test_nodedev.py PASS: test_connect.py PASS: test_storage.py ============================================================================ Testsuite summary for libvirt-dbus 1.3.0 ============================================================================ # TOTAL: 7 # PASS: 6 # SKIP: 0 # XFAIL: 0 # FAIL: 1 # XPASS: 0 # ERROR: 0 ============================================================================ See tests/test-suite.log Please report to libvir-list(a)redhat.com ============================================================================ gmake[3]: *** [Makefile:759: test-suite.log] Error 1 gmake[3]: Leaving directory '<https://ci.centos.org/job/libvirt-dbus-check/systems=libvirt-fedora-28/ws/b…'> gmake[2]: *** [Makefile:867: check-TESTS] Error 2 gmake[2]: Leaving directory '<https://ci.centos.org/job/libvirt-dbus-check/systems=libvirt-fedora-28/ws/b…'> gmake[1]: *** [Makefile:980: check-am] Error 2 gmake[1]: Leaving directory '<https://ci.centos.org/job/libvirt-dbus-check/systems=libvirt-fedora-28/ws/b…'> gmake: *** [Makefile:460: check-recursive] Error 1 + cat tests/test-suite.log ============================================== libvirt-dbus 1.3.0: tests/test-suite.log ============================================== # TOTAL: 7 # PASS: 6 # SKIP: 0 # XFAIL: 0 # FAIL: 1 # XPASS: 0 # ERROR: 0 .. contents:: :depth: 2 FAIL: test_domain.py ==================== ============================= test session starts ============================== platform linux -- Python 3.6.6, pytest-3.4.2, py-1.5.4, pluggy-0.6.0 rootdir: <https://ci.centos.org/job/libvirt-dbus-check/systems=libvirt-fedora-28/ws/,> inifile: collected 10 items ../../tests/test_domain.py .......E.. [100%] ==================================== ERRORS ==================================== __________________ ERROR at setup of TestDomain.test_undefine __________________ self = <test_domain.TestDomain object at 0x7fe2b533dda0> request = <SubRequest 'libvirt_dbus_setup' for <Function 'test_undefine'>> @pytest.fixture(autouse=True) def libvirt_dbus_setup(self, request): """Start libvirt-dbus for each test function """ os.environ['LIBVIRT_DEBUG'] = '3' self.libvirt_dbus = subprocess.Popen([exe, '--session']) self.bus = dbus.SessionBus() for i in range(10): if self.bus.name_has_owner('org.libvirt'): break time.sleep(0.1) else: > raise TimeoutError('error starting libvirt-dbus') E TimeoutError: error starting libvirt-dbus ../../tests/libvirttest.py:44: TimeoutError ====================== 9 passed, 1 error in 8.81 seconds ======================= FAIL test_domain.py (exit status: 1) + exit 1 Build step 'Execute shell' marked build as failure
1 1
0 0
  • ← Newer
  • 1
  • 2
  • 3
  • 4
  • 5
  • 6
  • 7
  • 8
  • 9
  • 10
  • Older →

HyperKitty Powered by HyperKitty version 1.3.12.