libvirt List Archives
Sign In Sign Up
Manage this list Sign In Sign Up

Keyboard Shortcuts

Thread View

  • j: Next unread message
  • k: Previous unread message
  • j a: Jump to all threads
  • j l: Jump to MailingList overview

CI

Thread Start a new thread
Download
Threads by month
  • ----- 2025 -----
  • August
  • July
  • June
  • May
  • April
  • March
  • February
  • January
  • ----- 2024 -----
  • December
  • November
  • October
  • September
  • August
  • July
  • June
  • May
  • April
  • March
  • February
  • January
  • ----- 2023 -----
  • December
  • November
  • October
  • September
  • August
  • July
  • June
  • May
  • April
  • March
  • February
  • January
  • ----- 2022 -----
  • December
  • November
  • October
  • September
  • August
  • July
  • June
  • May
  • April
  • March
  • February
  • January
  • ----- 2021 -----
  • December
  • November
  • October
  • September
  • August
  • July
  • June
  • May
  • April
  • March
  • February
  • January
  • ----- 2020 -----
  • December
  • November
  • October
  • September
  • August
  • July
  • June
  • May
  • April
  • March
  • February
  • January
  • ----- 2019 -----
  • December
  • November
  • October
  • September
  • August
  • July
  • June
  • May
  • April
  • March
  • February
  • January
  • ----- 2018 -----
  • December
  • November
  • October
  • September
  • August
  • July
  • June
  • May
  • April
  • March
  • February
  • January
  • ----- 2017 -----
  • December
  • November
  • October
  • September
  • August
  • July
  • June
  • May
  • April
  • March
  • February
  • January
  • ----- 2016 -----
  • December
  • November
  • October
  • September
  • August
  • July
ci@lists.libvirt.org

October 2018

  • 2 participants
  • 91 discussions
[Libvirt-ci] Build failed in Jenkins: libosinfo-check » libvirt-fedora-28 #14
by ci@centos.org 03 Oct '18

03 Oct '18
See <https://ci.centos.org/job/libosinfo-check/systems=libvirt-fedora-28/14/disp…> ------------------------------------------ Started by upstream project "libosinfo-check" build number 14 originally caused by: Started by upstream project "libosinfo-syntax-check" build number 14 originally caused by: Started by upstream project "libosinfo-build" build number 14 originally caused by: Started by an SCM change [EnvInject] - Loading node environment variables. Building remotely on libvirt-fedora-28 (libvirt) in workspace <https://ci.centos.org/job/libosinfo-check/systems=libvirt-fedora-28/ws/> [libosinfo] $ /bin/sh -xe /tmp/jenkins3392943976579043663.sh + export LIBOSINFO_NETWORK_TESTS=1 + LIBOSINFO_NETWORK_TESTS=1 + cd build + /usr/bin/gmake check GEN public-submodule-commit Making check in osinfo gmake[1]: Entering directory '<https://ci.centos.org/job/libosinfo-check/systems=libvirt-fedora-28/ws/buil…'> /usr/bin/gmake check-am gmake[2]: Entering directory '<https://ci.centos.org/job/libosinfo-check/systems=libvirt-fedora-28/ws/buil…'> /usr/bin/gmake check-local gmake[3]: Entering directory '<https://ci.centos.org/job/libosinfo-check/systems=libvirt-fedora-28/ws/buil…'> GEN check-symfile GEN check-symsorting gmake[3]: Leaving directory '<https://ci.centos.org/job/libosinfo-check/systems=libvirt-fedora-28/ws/buil…'> gmake[2]: Leaving directory '<https://ci.centos.org/job/libosinfo-check/systems=libvirt-fedora-28/ws/buil…'> gmake[1]: Leaving directory '<https://ci.centos.org/job/libosinfo-check/systems=libvirt-fedora-28/ws/buil…'> Making check in tools gmake[1]: Entering directory '<https://ci.centos.org/job/libosinfo-check/systems=libvirt-fedora-28/ws/buil…'> gmake[1]: Nothing to be done for 'check'. gmake[1]: Leaving directory '<https://ci.centos.org/job/libosinfo-check/systems=libvirt-fedora-28/ws/buil…'> Making check in docs gmake[1]: Entering directory '<https://ci.centos.org/job/libosinfo-check/systems=libvirt-fedora-28/ws/buil…'> Making check in reference gmake[2]: Entering directory '<https://ci.centos.org/job/libosinfo-check/systems=libvirt-fedora-28/ws/buil…'> gmake[2]: Nothing to be done for 'check'. gmake[2]: Leaving directory '<https://ci.centos.org/job/libosinfo-check/systems=libvirt-fedora-28/ws/buil…'> gmake[2]: Entering directory '<https://ci.centos.org/job/libosinfo-check/systems=libvirt-fedora-28/ws/buil…'> gmake[2]: Nothing to be done for 'check-am'. gmake[2]: Leaving directory '<https://ci.centos.org/job/libosinfo-check/systems=libvirt-fedora-28/ws/buil…'> gmake[1]: Leaving directory '<https://ci.centos.org/job/libosinfo-check/systems=libvirt-fedora-28/ws/buil…'> Making check in po gmake[1]: Entering directory '<https://ci.centos.org/job/libosinfo-check/systems=libvirt-fedora-28/ws/buil…'> INTLTOOL_EXTRACT="/usr/bin/intltool-extract" XGETTEXT="/usr/bin/xgettext" srcdir=../../po /usr/bin/intltool-update --gettext-package libosinfo --pot rm -f missing notexist srcdir=../../po /usr/bin/intltool-update -m if [ -r missing -o -r notexist ]; then \ exit 1; \ fi gmake[1]: Leaving directory '<https://ci.centos.org/job/libosinfo-check/systems=libvirt-fedora-28/ws/buil…'> Making check in examples gmake[1]: Entering directory '<https://ci.centos.org/job/libosinfo-check/systems=libvirt-fedora-28/ws/buil…'> gmake[1]: Nothing to be done for 'check'. gmake[1]: Leaving directory '<https://ci.centos.org/job/libosinfo-check/systems=libvirt-fedora-28/ws/buil…'> Making check in tests gmake[1]: Entering directory '<https://ci.centos.org/job/libosinfo-check/systems=libvirt-fedora-28/ws/buil…'> /usr/bin/gmake test-entity test-device test-list test-devicelist test-filter test-product test-os test-oslist test-productfilter test-platform test-platformlist test-db test-loader test-isodetect test-install-script test-os-resources test-mediauris test-treeuris gmake[2]: Entering directory '<https://ci.centos.org/job/libosinfo-check/systems=libvirt-fedora-28/ws/buil…'> CC test_entity-test-entity.o CC test_device-test-device.o CC test_list-test-list.o CC test_devicelist-test-devicelist.o CC test_filter-test-filter.o CC test_product-test-product.o CC test_os-test-os.o CC test_oslist-test-oslist.o CC test_productfilter-test-productfilter.o CC test_platform-test-platform.o CC test_platformlist-test-platformlist.o CC test_db-test-db.o CC test_loader-test-loader.o CC test_isodetect-test-isodetect.o CC test_install_script-test-install-script.o CC test_os_resources-test-os-resources.o CC test_mediauris-test-mediauris.o CC test_treeuris-test-treeuris.o CCLD test-entity CCLD test-device CCLD test-list CCLD test-devicelist CCLD test-filter CCLD test-product CCLD test-os CCLD test-oslist CCLD test-productfilter CCLD test-platform CCLD test-platformlist CCLD test-db CCLD test-loader CCLD test-isodetect CCLD test-install-script CCLD test-os-resources CCLD test-mediauris CCLD test-treeuris gmake[2]: Leaving directory '<https://ci.centos.org/job/libosinfo-check/systems=libvirt-fedora-28/ws/buil…'> /usr/bin/gmake check-TESTS gmake[2]: Entering directory '<https://ci.centos.org/job/libosinfo-check/systems=libvirt-fedora-28/ws/buil…'> gmake[3]: Entering directory '<https://ci.centos.org/job/libosinfo-check/systems=libvirt-fedora-28/ws/buil…'> PASS: test-list PASS: test-entity PASS: test-device PASS: test-filter PASS: test-devicelist PASS: test-product PASS: test-oslist PASS: test-productfilter PASS: test-os PASS: test-platform PASS: test-db PASS: test-platformlist PASS: test-install-script PASS: test-os-resources PASS: test-loader ../../build-aux/test-driver: line 107: 20711 Trace/breakpoint trap (core dumped) "$@" > $log_file 2>&1 FAIL: test-isodetect PASS: test-treeuris PASS: test-mediauris ============================================================================ Testsuite summary for libosinfo 1.3.0 ============================================================================ # TOTAL: 18 # PASS: 17 # SKIP: 0 # XFAIL: 0 # FAIL: 1 # XPASS: 0 # ERROR: 0 ============================================================================ See tests/test-suite.log Please report to libosinfo(a)redhat.com ============================================================================ gmake[3]: *** [Makefile:1289: test-suite.log] Error 1 gmake[3]: Leaving directory '<https://ci.centos.org/job/libosinfo-check/systems=libvirt-fedora-28/ws/buil…'> gmake[2]: *** [Makefile:1397: check-TESTS] Error 2 gmake[2]: Leaving directory '<https://ci.centos.org/job/libosinfo-check/systems=libvirt-fedora-28/ws/buil…'> gmake[1]: *** [Makefile:1587: check-am] Error 2 gmake[1]: Leaving directory '<https://ci.centos.org/job/libosinfo-check/systems=libvirt-fedora-28/ws/buil…'> gmake: *** [Makefile:594: check-recursive] Error 1 + cat tests/test-suite.log =========================================== libosinfo 1.3.0: tests/test-suite.log =========================================== # TOTAL: 18 # PASS: 17 # SKIP: 0 # XFAIL: 0 # FAIL: 1 # XPASS: 0 # ERROR: 0 .. contents:: :depth: 2 FAIL: test-isodetect ==================== /isodetect/windows: OK /isodetect/ubuntu: OK /isodetect/sles: ** (<https://ci.centos.org/job/libosinfo-check/systems=libvirt-fedora-28/ws/buil…>:20711): ERROR **: 20:51:00.415: ISO SUSE-CaaS-Platform-1.0-DVD-x86_64-GM-DVD1.iso.txt was not matched by OS caasp1.0 FAIL test-isodetect (exit status: 133) + exit 1 Build step 'Execute shell' marked build as failure
1 1
0 0
[Libvirt-ci] Build failed in Jenkins: libosinfo-check » libvirt-fedora-27 #14
by ci@centos.org 03 Oct '18

03 Oct '18
See <https://ci.centos.org/job/libosinfo-check/systems=libvirt-fedora-27/14/disp…> ------------------------------------------ Started by upstream project "libosinfo-check" build number 14 originally caused by: Started by upstream project "libosinfo-syntax-check" build number 14 originally caused by: Started by upstream project "libosinfo-build" build number 14 originally caused by: Started by an SCM change [EnvInject] - Loading node environment variables. Building remotely on libvirt-fedora-27 (libvirt) in workspace <https://ci.centos.org/job/libosinfo-check/systems=libvirt-fedora-27/ws/> [libosinfo] $ /bin/sh -xe /tmp/jenkins1111437007105336468.sh + export LIBOSINFO_NETWORK_TESTS=1 + LIBOSINFO_NETWORK_TESTS=1 + cd build + /usr/bin/gmake check GEN public-submodule-commit Making check in osinfo gmake[1]: Entering directory '<https://ci.centos.org/job/libosinfo-check/systems=libvirt-fedora-27/ws/buil…'> /usr/bin/gmake check-am gmake[2]: Entering directory '<https://ci.centos.org/job/libosinfo-check/systems=libvirt-fedora-27/ws/buil…'> /usr/bin/gmake check-local gmake[3]: Entering directory '<https://ci.centos.org/job/libosinfo-check/systems=libvirt-fedora-27/ws/buil…'> GEN check-symfile GEN check-symsorting gmake[3]: Leaving directory '<https://ci.centos.org/job/libosinfo-check/systems=libvirt-fedora-27/ws/buil…'> gmake[2]: Leaving directory '<https://ci.centos.org/job/libosinfo-check/systems=libvirt-fedora-27/ws/buil…'> gmake[1]: Leaving directory '<https://ci.centos.org/job/libosinfo-check/systems=libvirt-fedora-27/ws/buil…'> Making check in tools gmake[1]: Entering directory '<https://ci.centos.org/job/libosinfo-check/systems=libvirt-fedora-27/ws/buil…'> gmake[1]: Nothing to be done for 'check'. gmake[1]: Leaving directory '<https://ci.centos.org/job/libosinfo-check/systems=libvirt-fedora-27/ws/buil…'> Making check in docs gmake[1]: Entering directory '<https://ci.centos.org/job/libosinfo-check/systems=libvirt-fedora-27/ws/buil…'> Making check in reference gmake[2]: Entering directory '<https://ci.centos.org/job/libosinfo-check/systems=libvirt-fedora-27/ws/buil…'> gmake[2]: Nothing to be done for 'check'. gmake[2]: Leaving directory '<https://ci.centos.org/job/libosinfo-check/systems=libvirt-fedora-27/ws/buil…'> gmake[2]: Entering directory '<https://ci.centos.org/job/libosinfo-check/systems=libvirt-fedora-27/ws/buil…'> gmake[2]: Nothing to be done for 'check-am'. gmake[2]: Leaving directory '<https://ci.centos.org/job/libosinfo-check/systems=libvirt-fedora-27/ws/buil…'> gmake[1]: Leaving directory '<https://ci.centos.org/job/libosinfo-check/systems=libvirt-fedora-27/ws/buil…'> Making check in po gmake[1]: Entering directory '<https://ci.centos.org/job/libosinfo-check/systems=libvirt-fedora-27/ws/buil…'> INTLTOOL_EXTRACT="/usr/bin/intltool-extract" XGETTEXT="/usr/bin/xgettext" srcdir=../../po /usr/bin/intltool-update --gettext-package libosinfo --pot rm -f missing notexist srcdir=../../po /usr/bin/intltool-update -m if [ -r missing -o -r notexist ]; then \ exit 1; \ fi gmake[1]: Leaving directory '<https://ci.centos.org/job/libosinfo-check/systems=libvirt-fedora-27/ws/buil…'> Making check in examples gmake[1]: Entering directory '<https://ci.centos.org/job/libosinfo-check/systems=libvirt-fedora-27/ws/buil…'> gmake[1]: Nothing to be done for 'check'. gmake[1]: Leaving directory '<https://ci.centos.org/job/libosinfo-check/systems=libvirt-fedora-27/ws/buil…'> Making check in tests gmake[1]: Entering directory '<https://ci.centos.org/job/libosinfo-check/systems=libvirt-fedora-27/ws/buil…'> /usr/bin/gmake test-entity test-device test-list test-devicelist test-filter test-product test-os test-oslist test-productfilter test-platform test-platformlist test-db test-loader test-isodetect test-install-script test-os-resources test-mediauris test-treeuris gmake[2]: Entering directory '<https://ci.centos.org/job/libosinfo-check/systems=libvirt-fedora-27/ws/buil…'> CC test_entity-test-entity.o CC test_device-test-device.o CC test_list-test-list.o CC test_devicelist-test-devicelist.o CC test_filter-test-filter.o CC test_product-test-product.o CC test_os-test-os.o CC test_oslist-test-oslist.o CC test_productfilter-test-productfilter.o CC test_platform-test-platform.o CC test_platformlist-test-platformlist.o CC test_db-test-db.o CC test_loader-test-loader.o CC test_isodetect-test-isodetect.o CC test_install_script-test-install-script.o CC test_os_resources-test-os-resources.o CC test_mediauris-test-mediauris.o CC test_treeuris-test-treeuris.o CCLD test-entity CCLD test-device CCLD test-list CCLD test-devicelist CCLD test-filter CCLD test-product CCLD test-os CCLD test-oslist CCLD test-productfilter CCLD test-platform CCLD test-platformlist CCLD test-db CCLD test-loader CCLD test-isodetect CCLD test-install-script CCLD test-os-resources CCLD test-mediauris CCLD test-treeuris gmake[2]: Leaving directory '<https://ci.centos.org/job/libosinfo-check/systems=libvirt-fedora-27/ws/buil…'> /usr/bin/gmake check-TESTS gmake[2]: Entering directory '<https://ci.centos.org/job/libosinfo-check/systems=libvirt-fedora-27/ws/buil…'> gmake[3]: Entering directory '<https://ci.centos.org/job/libosinfo-check/systems=libvirt-fedora-27/ws/buil…'> PASS: test-device PASS: test-list PASS: test-entity PASS: test-devicelist PASS: test-filter PASS: test-product PASS: test-oslist PASS: test-os PASS: test-productfilter PASS: test-platform PASS: test-platformlist PASS: test-db PASS: test-install-script PASS: test-os-resources PASS: test-loader PASS: test-treeuris ../../build-aux/test-driver: line 107: 28644 Trace/breakpoint trap (core dumped) "$@" > $log_file 2>&1 FAIL: test-isodetect PASS: test-mediauris ============================================================================ Testsuite summary for libosinfo 1.3.0 ============================================================================ # TOTAL: 18 # PASS: 17 # SKIP: 0 # XFAIL: 0 # FAIL: 1 # XPASS: 0 # ERROR: 0 ============================================================================ See tests/test-suite.log Please report to libosinfo(a)redhat.com ============================================================================ gmake[3]: *** [Makefile:1289: test-suite.log] Error 1 gmake[3]: Leaving directory '<https://ci.centos.org/job/libosinfo-check/systems=libvirt-fedora-27/ws/buil…'> gmake[2]: *** [Makefile:1397: check-TESTS] Error 2 gmake[2]: Leaving directory '<https://ci.centos.org/job/libosinfo-check/systems=libvirt-fedora-27/ws/buil…'> gmake[1]: *** [Makefile:1587: check-am] Error 2 gmake[1]: Leaving directory '<https://ci.centos.org/job/libosinfo-check/systems=libvirt-fedora-27/ws/buil…'> gmake: *** [Makefile:594: check-recursive] Error 1 + cat tests/test-suite.log =========================================== libosinfo 1.3.0: tests/test-suite.log =========================================== # TOTAL: 18 # PASS: 17 # SKIP: 0 # XFAIL: 0 # FAIL: 1 # XPASS: 0 # ERROR: 0 .. contents:: :depth: 2 FAIL: test-isodetect ==================== /isodetect/windows: OK /isodetect/ubuntu: OK /isodetect/sles: ** (<https://ci.centos.org/job/libosinfo-check/systems=libvirt-fedora-27/ws/buil…>:28644): ERROR **: ISO SUSE-CaaS-Platform-1.0-DVD-x86_64-GM-DVD1.iso.txt was not matched by OS caasp1.0 FAIL test-isodetect (exit status: 133) + exit 1 Build step 'Execute shell' marked build as failure
1 1
0 0
[Libvirt-ci] Build failed in Jenkins: libosinfo-check » libvirt-freebsd-11 #14
by ci@centos.org 03 Oct '18

03 Oct '18
See <https://ci.centos.org/job/libosinfo-check/systems=libvirt-freebsd-11/14/dis…> ------------------------------------------ Started by upstream project "libosinfo-check" build number 14 originally caused by: Started by upstream project "libosinfo-syntax-check" build number 14 originally caused by: Started by upstream project "libosinfo-build" build number 14 originally caused by: Started by an SCM change [EnvInject] - Loading node environment variables. Building remotely on libvirt-freebsd-11 (libvirt) in workspace <https://ci.centos.org/job/libosinfo-check/systems=libvirt-freebsd-11/ws/> [libosinfo] $ /bin/sh -xe /tmp/jenkins437248139885342716.sh + export 'LIBOSINFO_NETWORK_TESTS=1' + cd build + /usr/local/bin/gmake check GEN public-submodule-commit Making check in osinfo gmake[1]: Entering directory '/usr<https://ci.centos.org/job/libosinfo-check/systems=libvirt-freebsd-11/ws/bui…'> /usr/local/bin/gmake check-am gmake[2]: Entering directory '/usr<https://ci.centos.org/job/libosinfo-check/systems=libvirt-freebsd-11/ws/bui…'> /usr/local/bin/gmake check-local gmake[3]: Entering directory '/usr<https://ci.centos.org/job/libosinfo-check/systems=libvirt-freebsd-11/ws/bui…'> GEN check-symsorting gmake[3]: Leaving directory '/usr<https://ci.centos.org/job/libosinfo-check/systems=libvirt-freebsd-11/ws/bui…'> gmake[2]: Leaving directory '/usr<https://ci.centos.org/job/libosinfo-check/systems=libvirt-freebsd-11/ws/bui…'> gmake[1]: Leaving directory '/usr<https://ci.centos.org/job/libosinfo-check/systems=libvirt-freebsd-11/ws/bui…'> Making check in tools gmake[1]: Entering directory '/usr<https://ci.centos.org/job/libosinfo-check/systems=libvirt-freebsd-11/ws/bui…'> gmake[1]: Nothing to be done for 'check'. gmake[1]: Leaving directory '/usr<https://ci.centos.org/job/libosinfo-check/systems=libvirt-freebsd-11/ws/bui…'> Making check in docs gmake[1]: Entering directory '/usr<https://ci.centos.org/job/libosinfo-check/systems=libvirt-freebsd-11/ws/bui…'> Making check in reference gmake[2]: Entering directory '/usr<https://ci.centos.org/job/libosinfo-check/systems=libvirt-freebsd-11/ws/bui…'> gmake[2]: Nothing to be done for 'check'. gmake[2]: Leaving directory '/usr<https://ci.centos.org/job/libosinfo-check/systems=libvirt-freebsd-11/ws/bui…'> gmake[2]: Entering directory '/usr<https://ci.centos.org/job/libosinfo-check/systems=libvirt-freebsd-11/ws/bui…'> gmake[2]: Nothing to be done for 'check-am'. gmake[2]: Leaving directory '/usr<https://ci.centos.org/job/libosinfo-check/systems=libvirt-freebsd-11/ws/bui…'> gmake[1]: Leaving directory '/usr<https://ci.centos.org/job/libosinfo-check/systems=libvirt-freebsd-11/ws/bui…'> Making check in po gmake[1]: Entering directory '/usr<https://ci.centos.org/job/libosinfo-check/systems=libvirt-freebsd-11/ws/bui…'> INTLTOOL_EXTRACT="/usr/local/bin/intltool-extract" XGETTEXT="/usr/local/bin/xgettext" srcdir=../../po /usr/local/bin/intltool-update --gettext-package libosinfo --pot rm -f missing notexist srcdir=../../po /usr/local/bin/intltool-update -m if [ -r missing -o -r notexist ]; then \ exit 1; \ fi gmake[1]: Leaving directory '/usr<https://ci.centos.org/job/libosinfo-check/systems=libvirt-freebsd-11/ws/bui…'> Making check in examples gmake[1]: Entering directory '/usr<https://ci.centos.org/job/libosinfo-check/systems=libvirt-freebsd-11/ws/bui…'> gmake[1]: Nothing to be done for 'check'. gmake[1]: Leaving directory '/usr<https://ci.centos.org/job/libosinfo-check/systems=libvirt-freebsd-11/ws/bui…'> Making check in tests gmake[1]: Entering directory '/usr<https://ci.centos.org/job/libosinfo-check/systems=libvirt-freebsd-11/ws/bui…'> /usr/local/bin/gmake test-entity test-device test-list test-devicelist test-filter test-product test-os test-oslist test-productfilter test-platform test-platformlist test-db test-loader test-isodetect test-install-script test-os-resources test-mediauris test-treeuris gmake[2]: Entering directory '/usr<https://ci.centos.org/job/libosinfo-check/systems=libvirt-freebsd-11/ws/bui…'> CC test_entity-test-entity.o CC test_device-test-device.o CC test_list-test-list.o CC test_devicelist-test-devicelist.o CC test_filter-test-filter.o CC test_product-test-product.o CC test_os-test-os.o CC test_oslist-test-oslist.o CC test_productfilter-test-productfilter.o CC test_platform-test-platform.o CC test_platformlist-test-platformlist.o CC test_db-test-db.o CC test_loader-test-loader.o CC test_isodetect-test-isodetect.o CC test_install_script-test-install-script.o CC test_os_resources-test-os-resources.o CC test_mediauris-test-mediauris.o CC test_treeuris-test-treeuris.o CCLD test-entity CCLD test-device CCLD test-list CCLD test-devicelist CCLD test-filter CCLD test-product CCLD test-os CCLD test-oslist CCLD test-productfilter CCLD test-platform CCLD test-platformlist CCLD test-db CCLD test-loader CCLD test-isodetect CCLD test-install-script CCLD test-os-resources CCLD test-mediauris CCLD test-treeuris gmake[2]: Leaving directory '/usr<https://ci.centos.org/job/libosinfo-check/systems=libvirt-freebsd-11/ws/bui…'> /usr/local/bin/gmake check-TESTS gmake[2]: Entering directory '/usr<https://ci.centos.org/job/libosinfo-check/systems=libvirt-freebsd-11/ws/bui…'> gmake[3]: Entering directory '/usr<https://ci.centos.org/job/libosinfo-check/systems=libvirt-freebsd-11/ws/bui…'> PASS: test-entity PASS: test-device PASS: test-list PASS: test-devicelist PASS: test-product PASS: test-filter PASS: test-oslist PASS: test-productfilter PASS: test-os PASS: test-platform PASS: test-db PASS: test-platformlist PASS: test-install-script PASS: test-os-resources PASS: test-loader PASS: test-treeuris Trace/BPT trap (core dumped) FAIL: test-isodetect PASS: test-mediauris ============================================================================ Testsuite summary for libosinfo 1.3.0 ============================================================================ # TOTAL: 18 # PASS: 17 # SKIP: 0 # XFAIL: 0 # FAIL: 1 # XPASS: 0 # ERROR: 0 ============================================================================ See tests/test-suite.log Please report to libosinfo(a)redhat.com ============================================================================ gmake[3]: *** [Makefile:1313: test-suite.log] Error 1 gmake[3]: Leaving directory '/usr<https://ci.centos.org/job/libosinfo-check/systems=libvirt-freebsd-11/ws/bui…'> gmake[2]: *** [Makefile:1421: check-TESTS] Error 2 gmake[2]: Leaving directory '/usr<https://ci.centos.org/job/libosinfo-check/systems=libvirt-freebsd-11/ws/bui…'> gmake[1]: *** [Makefile:1614: check-am] Error 2 gmake[1]: Leaving directory '/usr<https://ci.centos.org/job/libosinfo-check/systems=libvirt-freebsd-11/ws/bui…'> gmake: *** [Makefile:594: check-recursive] Error 1 + cat tests/test-suite.log =========================================== libosinfo 1.3.0: tests/test-suite.log =========================================== # TOTAL: 18 # PASS: 17 # SKIP: 0 # XFAIL: 0 # FAIL: 1 # XPASS: 0 # ERROR: 0 .. contents:: :depth: 2 FAIL: test-isodetect ==================== /isodetect/windows: OK /isodetect/ubuntu: OK /isodetect/sles: ** (/usr<https://ci.centos.org/job/libosinfo-check/systems=libvirt-freebsd-11/ws/bui…>:64119): ERROR **: ISO SUSE-CaaS-Platform-1.0-DVD-x86_64-GM-DVD1.iso.txt was not matched by OS caasp1.0 FAIL test-isodetect (exit status: 133) + exit 1 Build step 'Execute shell' marked build as failure
1 1
0 0
[Libvirt-ci] Build failed in Jenkins: libosinfo-check » libvirt-freebsd-10 #14
by ci@centos.org 03 Oct '18

03 Oct '18
See <https://ci.centos.org/job/libosinfo-check/systems=libvirt-freebsd-10/14/dis…> ------------------------------------------ Started by upstream project "libosinfo-check" build number 14 originally caused by: Started by upstream project "libosinfo-syntax-check" build number 14 originally caused by: Started by upstream project "libosinfo-build" build number 14 originally caused by: Started by an SCM change [EnvInject] - Loading node environment variables. Building remotely on libvirt-freebsd-10 (libvirt) in workspace <https://ci.centos.org/job/libosinfo-check/systems=libvirt-freebsd-10/ws/> [libosinfo] $ /bin/sh -xe /tmp/jenkins2163070002247259882.sh + export LIBOSINFO_NETWORK_TESTS=1 + cd build + /usr/local/bin/gmake check Making check in osinfo GEN public-submodule-commit gmake[1]: Entering directory '/usr<https://ci.centos.org/job/libosinfo-check/systems=libvirt-freebsd-10/ws/bui…'> /usr/local/bin/gmake check-am gmake[2]: Entering directory '/usr<https://ci.centos.org/job/libosinfo-check/systems=libvirt-freebsd-10/ws/bui…'> /usr/local/bin/gmake check-local gmake[3]: Entering directory '/usr<https://ci.centos.org/job/libosinfo-check/systems=libvirt-freebsd-10/ws/bui…'> GEN check-symsorting gmake[3]: Leaving directory '/usr<https://ci.centos.org/job/libosinfo-check/systems=libvirt-freebsd-10/ws/bui…'> gmake[2]: Leaving directory '/usr<https://ci.centos.org/job/libosinfo-check/systems=libvirt-freebsd-10/ws/bui…'> gmake[1]: Leaving directory '/usr<https://ci.centos.org/job/libosinfo-check/systems=libvirt-freebsd-10/ws/bui…'> Making check in tools gmake[1]: Entering directory '/usr<https://ci.centos.org/job/libosinfo-check/systems=libvirt-freebsd-10/ws/bui…'> gmake[1]: Nothing to be done for 'check'. gmake[1]: Leaving directory '/usr<https://ci.centos.org/job/libosinfo-check/systems=libvirt-freebsd-10/ws/bui…'> Making check in docs gmake[1]: Entering directory '/usr<https://ci.centos.org/job/libosinfo-check/systems=libvirt-freebsd-10/ws/bui…'> Making check in reference gmake[2]: Entering directory '/usr<https://ci.centos.org/job/libosinfo-check/systems=libvirt-freebsd-10/ws/bui…'> gmake[2]: Nothing to be done for 'check'. gmake[2]: Leaving directory '/usr<https://ci.centos.org/job/libosinfo-check/systems=libvirt-freebsd-10/ws/bui…'> gmake[2]: Entering directory '/usr<https://ci.centos.org/job/libosinfo-check/systems=libvirt-freebsd-10/ws/bui…'> gmake[2]: Nothing to be done for 'check-am'. gmake[2]: Leaving directory '/usr<https://ci.centos.org/job/libosinfo-check/systems=libvirt-freebsd-10/ws/bui…'> gmake[1]: Leaving directory '/usr<https://ci.centos.org/job/libosinfo-check/systems=libvirt-freebsd-10/ws/bui…'> Making check in po gmake[1]: Entering directory '/usr<https://ci.centos.org/job/libosinfo-check/systems=libvirt-freebsd-10/ws/bui…'> INTLTOOL_EXTRACT="/usr/local/bin/intltool-extract" XGETTEXT="/usr/local/bin/xgettext" srcdir=../../po /usr/local/bin/intltool-update --gettext-package libosinfo --pot rm -f missing notexist srcdir=../../po /usr/local/bin/intltool-update -m if [ -r missing -o -r notexist ]; then \ exit 1; \ fi gmake[1]: Leaving directory '/usr<https://ci.centos.org/job/libosinfo-check/systems=libvirt-freebsd-10/ws/bui…'> Making check in examples gmake[1]: Entering directory '/usr<https://ci.centos.org/job/libosinfo-check/systems=libvirt-freebsd-10/ws/bui…'> gmake[1]: Nothing to be done for 'check'. gmake[1]: Leaving directory '/usr<https://ci.centos.org/job/libosinfo-check/systems=libvirt-freebsd-10/ws/bui…'> Making check in tests gmake[1]: Entering directory '/usr<https://ci.centos.org/job/libosinfo-check/systems=libvirt-freebsd-10/ws/bui…'> /usr/local/bin/gmake test-entity test-device test-list test-devicelist test-filter test-product test-os test-oslist test-productfilter test-platform test-platformlist test-db test-loader test-isodetect test-install-script test-os-resources test-mediauris test-treeuris gmake[2]: Entering directory '/usr<https://ci.centos.org/job/libosinfo-check/systems=libvirt-freebsd-10/ws/bui…'> CC test_entity-test-entity.o CC test_device-test-device.o CC test_list-test-list.o CC test_devicelist-test-devicelist.o CC test_filter-test-filter.o CC test_product-test-product.o CC test_os-test-os.o CC test_oslist-test-oslist.o CC test_productfilter-test-productfilter.o CC test_platform-test-platform.o CC test_platformlist-test-platformlist.o CC test_db-test-db.o CC test_loader-test-loader.o CC test_isodetect-test-isodetect.o CC test_install_script-test-install-script.o CC test_os_resources-test-os-resources.o CC test_mediauris-test-mediauris.o CC test_treeuris-test-treeuris.o CCLD test-entity CCLD test-list CCLD test-device CCLD test-devicelist CCLD test-filter CCLD test-product CCLD test-os CCLD test-oslist CCLD test-productfilter CCLD test-platform CCLD test-platformlist CCLD test-db CCLD test-loader CCLD test-isodetect CCLD test-install-script CCLD test-os-resources CCLD test-mediauris CCLD test-treeuris gmake[2]: Leaving directory '/usr<https://ci.centos.org/job/libosinfo-check/systems=libvirt-freebsd-10/ws/bui…'> /usr/local/bin/gmake check-TESTS gmake[2]: Entering directory '/usr<https://ci.centos.org/job/libosinfo-check/systems=libvirt-freebsd-10/ws/bui…'> gmake[3]: Entering directory '/usr<https://ci.centos.org/job/libosinfo-check/systems=libvirt-freebsd-10/ws/bui…'> PASS: test-list PASS: test-entity PASS: test-device PASS: test-devicelist PASS: test-product PASS: test-filter PASS: test-productfilter PASS: test-oslist PASS: test-os PASS: test-platformlist PASS: test-platform PASS: test-db PASS: test-install-script PASS: test-os-resources PASS: test-loader PASS: test-treeuris Trace/BPT trap (core dumped) FAIL: test-isodetect PASS: test-mediauris ============================================================================ Testsuite summary for libosinfo 1.3.0 ============================================================================ # TOTAL: 18 # PASS: 17 # SKIP: 0 # XFAIL: 0 # FAIL: 1 # XPASS: 0 # ERROR: 0 ============================================================================ See tests/test-suite.log Please report to libosinfo(a)redhat.com ============================================================================ gmake[3]: *** [Makefile:1313: test-suite.log] Error 1 gmake[3]: Leaving directory '/usr<https://ci.centos.org/job/libosinfo-check/systems=libvirt-freebsd-10/ws/bui…'> gmake[2]: *** [Makefile:1421: check-TESTS] Error 2 gmake[2]: Leaving directory '/usr<https://ci.centos.org/job/libosinfo-check/systems=libvirt-freebsd-10/ws/bui…'> gmake[1]: *** [Makefile:1614: check-am] Error 2 gmake[1]: Leaving directory '/usr<https://ci.centos.org/job/libosinfo-check/systems=libvirt-freebsd-10/ws/bui…'> gmake: *** [Makefile:594: check-recursive] Error 1 + cat tests/test-suite.log =========================================== libosinfo 1.3.0: tests/test-suite.log =========================================== # TOTAL: 18 # PASS: 17 # SKIP: 0 # XFAIL: 0 # FAIL: 1 # XPASS: 0 # ERROR: 0 .. contents:: :depth: 2 FAIL: test-isodetect ==================== /isodetect/windows: OK /isodetect/ubuntu: OK /isodetect/sles: ** (/usr<https://ci.centos.org/job/libosinfo-check/systems=libvirt-freebsd-10/ws/bui…>:61605): ERROR **: ISO SUSE-CaaS-Platform-1.0-DVD-x86_64-GM-DVD1.iso.txt was not matched by OS caasp1.0 FAIL test-isodetect (exit status: 133) + exit 1 Build step 'Execute shell' marked build as failure
1 1
0 0
[Libvirt-ci] Build failed in Jenkins: libosinfo-check » libvirt-debian-8 #14
by ci@centos.org 03 Oct '18

03 Oct '18
See <https://ci.centos.org/job/libosinfo-check/systems=libvirt-debian-8/14/displ…> ------------------------------------------ Started by upstream project "libosinfo-check" build number 14 originally caused by: Started by upstream project "libosinfo-syntax-check" build number 14 originally caused by: Started by upstream project "libosinfo-build" build number 14 originally caused by: Started by an SCM change [EnvInject] - Loading node environment variables. Building remotely on libvirt-debian-8 (libvirt) in workspace <https://ci.centos.org/job/libosinfo-check/systems=libvirt-debian-8/ws/> [libosinfo] $ /bin/sh -xe /tmp/jenkins6907230531553298379.sh + export LIBOSINFO_NETWORK_TESTS=1 + cd build + /usr/bin/make check GEN public-submodule-commit Making check in osinfo make[1]: Entering directory '<https://ci.centos.org/job/libosinfo-check/systems=libvirt-debian-8/ws/build…'> /usr/bin/make check-am make[2]: Entering directory '<https://ci.centos.org/job/libosinfo-check/systems=libvirt-debian-8/ws/build…'> /usr/bin/make check-local make[3]: Entering directory '<https://ci.centos.org/job/libosinfo-check/systems=libvirt-debian-8/ws/build…'> GEN check-symfile GEN check-symsorting make[3]: Leaving directory '<https://ci.centos.org/job/libosinfo-check/systems=libvirt-debian-8/ws/build…'> make[2]: Leaving directory '<https://ci.centos.org/job/libosinfo-check/systems=libvirt-debian-8/ws/build…'> make[1]: Leaving directory '<https://ci.centos.org/job/libosinfo-check/systems=libvirt-debian-8/ws/build…'> Making check in tools make[1]: Entering directory '<https://ci.centos.org/job/libosinfo-check/systems=libvirt-debian-8/ws/build…'> make[1]: Nothing to be done for 'check'. make[1]: Leaving directory '<https://ci.centos.org/job/libosinfo-check/systems=libvirt-debian-8/ws/build…'> Making check in docs make[1]: Entering directory '<https://ci.centos.org/job/libosinfo-check/systems=libvirt-debian-8/ws/build…'> Making check in reference make[2]: Entering directory '<https://ci.centos.org/job/libosinfo-check/systems=libvirt-debian-8/ws/build…'> make[2]: Nothing to be done for 'check'. make[2]: Leaving directory '<https://ci.centos.org/job/libosinfo-check/systems=libvirt-debian-8/ws/build…'> make[2]: Entering directory '<https://ci.centos.org/job/libosinfo-check/systems=libvirt-debian-8/ws/build…'> make[2]: Nothing to be done for 'check-am'. make[2]: Leaving directory '<https://ci.centos.org/job/libosinfo-check/systems=libvirt-debian-8/ws/build…'> make[1]: Leaving directory '<https://ci.centos.org/job/libosinfo-check/systems=libvirt-debian-8/ws/build…'> Making check in po make[1]: Entering directory '<https://ci.centos.org/job/libosinfo-check/systems=libvirt-debian-8/ws/build…'> INTLTOOL_EXTRACT="/usr/bin/intltool-extract" XGETTEXT="/usr/bin/xgettext" srcdir=../../po /usr/bin/intltool-update --gettext-package libosinfo --pot rm -f missing notexist srcdir=../../po /usr/bin/intltool-update -m if [ -r missing -o -r notexist ]; then \ exit 1; \ fi make[1]: Leaving directory '<https://ci.centos.org/job/libosinfo-check/systems=libvirt-debian-8/ws/build…'> Making check in examples make[1]: Entering directory '<https://ci.centos.org/job/libosinfo-check/systems=libvirt-debian-8/ws/build…'> make[1]: Nothing to be done for 'check'. make[1]: Leaving directory '<https://ci.centos.org/job/libosinfo-check/systems=libvirt-debian-8/ws/build…'> Making check in tests make[1]: Entering directory '<https://ci.centos.org/job/libosinfo-check/systems=libvirt-debian-8/ws/build…'> /usr/bin/make test-entity test-device test-list test-devicelist test-filter test-product test-os test-oslist test-productfilter test-platform test-platformlist test-db test-loader test-isodetect test-install-script test-os-resources test-mediauris test-treeuris make[2]: Entering directory '<https://ci.centos.org/job/libosinfo-check/systems=libvirt-debian-8/ws/build…'> CC test_entity-test-entity.o CC test_device-test-device.o CC test_list-test-list.o CC test_devicelist-test-devicelist.o CC test_filter-test-filter.o CC test_product-test-product.o CC test_os-test-os.o CC test_oslist-test-oslist.o CC test_productfilter-test-productfilter.o CC test_platform-test-platform.o CC test_platformlist-test-platformlist.o CC test_db-test-db.o CC test_loader-test-loader.o CC test_isodetect-test-isodetect.o CC test_os_resources-test-os-resources.o CC test_install_script-test-install-script.o CC test_mediauris-test-mediauris.o CC test_treeuris-test-treeuris.o CCLD test-entity CCLD test-list CCLD test-device CCLD test-devicelist CCLD test-filter CCLD test-product CCLD test-os CCLD test-productfilter CCLD test-oslist CCLD test-platform CCLD test-platformlist CCLD test-db CCLD test-loader CCLD test-isodetect CCLD test-install-script CCLD test-os-resources CCLD test-mediauris CCLD test-treeuris make[2]: Leaving directory '<https://ci.centos.org/job/libosinfo-check/systems=libvirt-debian-8/ws/build…'> /usr/bin/make check-TESTS make[2]: Entering directory '<https://ci.centos.org/job/libosinfo-check/systems=libvirt-debian-8/ws/build…'> make[3]: Entering directory '<https://ci.centos.org/job/libosinfo-check/systems=libvirt-debian-8/ws/build…'> PASS: test-entity PASS: test-device PASS: test-list PASS: test-product PASS: test-devicelist PASS: test-filter PASS: test-oslist PASS: test-os PASS: test-productfilter PASS: test-platformlist PASS: test-platform PASS: test-db PASS: test-install-script PASS: test-os-resources PASS: test-loader ../../build-aux/test-driver: line 107: 24515 Trace/breakpoint trap "$@" > $log_file 2>&1 FAIL: test-isodetect PASS: test-treeuris PASS: test-mediauris make[4]: Entering directory '<https://ci.centos.org/job/libosinfo-check/systems=libvirt-debian-8/ws/build…'> make[4]: Nothing to be done for 'all'. make[4]: Leaving directory '<https://ci.centos.org/job/libosinfo-check/systems=libvirt-debian-8/ws/build…'> ============================================================================ Testsuite summary for libosinfo 1.3.0 ============================================================================ # TOTAL: 18 # PASS: 17 # SKIP: 0 # XFAIL: 0 # FAIL: 1 # XPASS: 0 # ERROR: 0 ============================================================================ See tests/test-suite.log Please report to libosinfo(a)redhat.com ============================================================================ Makefile:1278: recipe for target 'test-suite.log' failed make[3]: *** [test-suite.log] Error 1 make[3]: Leaving directory '<https://ci.centos.org/job/libosinfo-check/systems=libvirt-debian-8/ws/build…'> Makefile:1384: recipe for target 'check-TESTS' failed make[2]: *** [check-TESTS] Error 2 make[2]: Leaving directory '<https://ci.centos.org/job/libosinfo-check/systems=libvirt-debian-8/ws/build…'> Makefile:1576: recipe for target 'check-am' failed make[1]: *** [check-am] Error 2 make[1]: Leaving directory '<https://ci.centos.org/job/libosinfo-check/systems=libvirt-debian-8/ws/build…'> Makefile:584: recipe for target 'check-recursive' failed make: *** [check-recursive] Error 1 + cat tests/test-suite.log =========================================== libosinfo 1.3.0: tests/test-suite.log =========================================== # TOTAL: 18 # PASS: 17 # SKIP: 0 # XFAIL: 0 # FAIL: 1 # XPASS: 0 # ERROR: 0 .. contents:: :depth: 2 FAIL: test-isodetect ==================== /isodetect/haiku: OK /isodetect/dragonflybsd: OK /isodetect/windows: OK /isodetect/ubuntu: OK /isodetect/sles: ** (<https://ci.centos.org/job/libosinfo-check/systems=libvirt-debian-8/ws/build…>:24515): ERROR **: ISO SUSE-CaaS-Platform-1.0-DVD-x86_64-GM-DVD1.iso.txt was not matched by OS caasp1.0 + exit 1 Build step 'Execute shell' marked build as failure
1 1
0 0
[Libvirt-ci] Build failed in Jenkins: libosinfo-check » libvirt-centos-7 #14
by ci@centos.org 03 Oct '18

03 Oct '18
See <https://ci.centos.org/job/libosinfo-check/systems=libvirt-centos-7/14/displ…> ------------------------------------------ Started by upstream project "libosinfo-check" build number 14 originally caused by: Started by upstream project "libosinfo-syntax-check" build number 14 originally caused by: Started by upstream project "libosinfo-build" build number 14 originally caused by: Started by an SCM change [EnvInject] - Loading node environment variables. Building remotely on libvirt-centos-7 (libvirt) in workspace <https://ci.centos.org/job/libosinfo-check/systems=libvirt-centos-7/ws/> [libosinfo] $ /bin/sh -xe /tmp/jenkins5844790900960660976.sh + export LIBOSINFO_NETWORK_TESTS=1 + LIBOSINFO_NETWORK_TESTS=1 + cd build + /usr/bin/gmake check GEN public-submodule-commit Making check in osinfo gmake[1]: Entering directory `<https://ci.centos.org/job/libosinfo-check/systems=libvirt-centos-7/ws/build…'> /usr/bin/gmake check-am gmake[2]: Entering directory `<https://ci.centos.org/job/libosinfo-check/systems=libvirt-centos-7/ws/build…'> /usr/bin/gmake check-local gmake[3]: Entering directory `<https://ci.centos.org/job/libosinfo-check/systems=libvirt-centos-7/ws/build…'> GEN check-symfile GEN check-symsorting gmake[3]: Leaving directory `<https://ci.centos.org/job/libosinfo-check/systems=libvirt-centos-7/ws/build…'> gmake[2]: Leaving directory `<https://ci.centos.org/job/libosinfo-check/systems=libvirt-centos-7/ws/build…'> gmake[1]: Leaving directory `<https://ci.centos.org/job/libosinfo-check/systems=libvirt-centos-7/ws/build…'> Making check in tools gmake[1]: Entering directory `<https://ci.centos.org/job/libosinfo-check/systems=libvirt-centos-7/ws/build…'> gmake[1]: Nothing to be done for `check'. gmake[1]: Leaving directory `<https://ci.centos.org/job/libosinfo-check/systems=libvirt-centos-7/ws/build…'> Making check in docs gmake[1]: Entering directory `<https://ci.centos.org/job/libosinfo-check/systems=libvirt-centos-7/ws/build…'> Making check in reference gmake[2]: Entering directory `<https://ci.centos.org/job/libosinfo-check/systems=libvirt-centos-7/ws/build…'> gmake[2]: Nothing to be done for `check'. gmake[2]: Leaving directory `<https://ci.centos.org/job/libosinfo-check/systems=libvirt-centos-7/ws/build…'> gmake[2]: Entering directory `<https://ci.centos.org/job/libosinfo-check/systems=libvirt-centos-7/ws/build…'> gmake[2]: Nothing to be done for `check-am'. gmake[2]: Leaving directory `<https://ci.centos.org/job/libosinfo-check/systems=libvirt-centos-7/ws/build…'> gmake[1]: Leaving directory `<https://ci.centos.org/job/libosinfo-check/systems=libvirt-centos-7/ws/build…'> Making check in po gmake[1]: Entering directory `<https://ci.centos.org/job/libosinfo-check/systems=libvirt-centos-7/ws/build…'> INTLTOOL_EXTRACT="/usr/bin/intltool-extract" XGETTEXT="/usr/bin/xgettext" srcdir=../../po /usr/bin/intltool-update --gettext-package libosinfo --pot rm -f missing notexist srcdir=../../po /usr/bin/intltool-update -m if [ -r missing -o -r notexist ]; then \ exit 1; \ fi gmake[1]: Leaving directory `<https://ci.centos.org/job/libosinfo-check/systems=libvirt-centos-7/ws/build…'> Making check in examples gmake[1]: Entering directory `<https://ci.centos.org/job/libosinfo-check/systems=libvirt-centos-7/ws/build…'> gmake[1]: Nothing to be done for `check'. gmake[1]: Leaving directory `<https://ci.centos.org/job/libosinfo-check/systems=libvirt-centos-7/ws/build…'> Making check in tests gmake[1]: Entering directory `<https://ci.centos.org/job/libosinfo-check/systems=libvirt-centos-7/ws/build…'> /usr/bin/gmake test-entity test-device test-list test-devicelist test-filter test-product test-os test-oslist test-productfilter test-platform test-platformlist test-db test-loader test-isodetect test-install-script test-os-resources test-mediauris test-treeuris gmake[2]: Entering directory `<https://ci.centos.org/job/libosinfo-check/systems=libvirt-centos-7/ws/build…'> CC test_entity-test-entity.o CC test_device-test-device.o CC test_list-test-list.o CC test_devicelist-test-devicelist.o CC test_filter-test-filter.o CC test_product-test-product.o CC test_os-test-os.o CC test_oslist-test-oslist.o CC test_productfilter-test-productfilter.o CC test_platform-test-platform.o CC test_platformlist-test-platformlist.o CC test_db-test-db.o CC test_loader-test-loader.o CC test_isodetect-test-isodetect.o CC test_install_script-test-install-script.o CC test_os_resources-test-os-resources.o CC test_mediauris-test-mediauris.o CC test_treeuris-test-treeuris.o CCLD test-entity CCLD test-device CCLD test-list CCLD test-devicelist CCLD test-filter CCLD test-product CCLD test-os CCLD test-oslist CCLD test-productfilter CCLD test-platform CCLD test-platformlist CCLD test-db CCLD test-loader CCLD test-isodetect CCLD test-install-script CCLD test-os-resources CCLD test-mediauris CCLD test-treeuris gmake[2]: Leaving directory `<https://ci.centos.org/job/libosinfo-check/systems=libvirt-centos-7/ws/build…'> /usr/bin/gmake check-TESTS gmake[2]: Entering directory `<https://ci.centos.org/job/libosinfo-check/systems=libvirt-centos-7/ws/build…'> gmake[3]: Entering directory `<https://ci.centos.org/job/libosinfo-check/systems=libvirt-centos-7/ws/build…'> PASS: test-list PASS: test-entity PASS: test-device PASS: test-filter PASS: test-devicelist PASS: test-product PASS: test-os PASS: test-oslist PASS: test-productfilter PASS: test-platform PASS: test-db PASS: test-platformlist PASS: test-install-script PASS: test-loader PASS: test-os-resources PASS: test-treeuris ../../build-aux/test-driver: line 95: 31345 Trace/breakpoint trap "$@" > $log_file 2>&1 FAIL: test-isodetect PASS: test-mediauris gmake[4]: Entering directory `<https://ci.centos.org/job/libosinfo-check/systems=libvirt-centos-7/ws/build…'> gmake[4]: Nothing to be done for `all'. gmake[4]: Leaving directory `<https://ci.centos.org/job/libosinfo-check/systems=libvirt-centos-7/ws/build…'> ============================================================================ Testsuite summary for libosinfo 1.3.0 ============================================================================ # TOTAL: 18 # PASS: 17 # SKIP: 0 # XFAIL: 0 # FAIL: 1 # XPASS: 0 # ERROR: 0 ============================================================================ See tests/test-suite.log Please report to libosinfo(a)redhat.com ============================================================================ gmake[3]: *** [test-suite.log] Error 1 gmake[3]: Leaving directory `<https://ci.centos.org/job/libosinfo-check/systems=libvirt-centos-7/ws/build…'> gmake[2]: *** [check-TESTS] Error 2 gmake[2]: Leaving directory `<https://ci.centos.org/job/libosinfo-check/systems=libvirt-centos-7/ws/build…'> gmake[1]: *** [check-am] Error 2 gmake[1]: Leaving directory `<https://ci.centos.org/job/libosinfo-check/systems=libvirt-centos-7/ws/build…'> gmake: *** [check-recursive] Error 1 + cat tests/test-suite.log =========================================== libosinfo 1.3.0: tests/test-suite.log =========================================== # TOTAL: 18 # PASS: 17 # SKIP: 0 # XFAIL: 0 # FAIL: 1 # XPASS: 0 # ERROR: 0 .. contents:: :depth: 2 FAIL: test-isodetect ==================== /isodetect/dragonflybsd: OK /isodetect/haiku: OK /isodetect/windows: OK /isodetect/ubuntu: OK /isodetect/sles: ** (<https://ci.centos.org/job/libosinfo-check/systems=libvirt-centos-7/ws/build…>:31345): ERROR **: ISO SUSE-CaaS-Platform-1.0-DVD-x86_64-GM-DVD1.iso.txt was not matched by OS caasp1.0 + exit 1 Build step 'Execute shell' marked build as failure
1 1
0 0
[Libvirt-ci] Build failed in Jenkins: libvirt-dbus-check » libvirt-freebsd-11 #55
by ci@centos.org 03 Oct '18

03 Oct '18
See <https://ci.centos.org/job/libvirt-dbus-check/systems=libvirt-freebsd-11/55/…> ------------------------------------------ Started by upstream project "libvirt-dbus-check" build number 55 originally caused by: Started by upstream project "libvirt-dbus-syntax-check" build number 55 originally caused by: Started by upstream project "libvirt-dbus-build" build number 55 originally caused by: Started by upstream project "libvirt-glib-build" build number 55 originally caused by: Started by upstream project "libvirt-build" build number 78 originally caused by: Started by an SCM change [EnvInject] - Loading node environment variables. Building remotely on libvirt-freebsd-11 (libvirt) in workspace <https://ci.centos.org/job/libvirt-dbus-check/systems=libvirt-freebsd-11/ws/> [libvirt-dbus] $ /bin/sh -xe /tmp/jenkins7549932638741533089.sh + cd build + /usr/local/bin/gmake check Making check in data gmake[1]: Entering directory '/usr<https://ci.centos.org/job/libvirt-dbus-check/systems=libvirt-freebsd-11/ws/…'> gmake[1]: Nothing to be done for 'check'. gmake[1]: Leaving directory '/usr<https://ci.centos.org/job/libvirt-dbus-check/systems=libvirt-freebsd-11/ws/…'> Making check in docs gmake[1]: Entering directory '/usr<https://ci.centos.org/job/libvirt-dbus-check/systems=libvirt-freebsd-11/ws/…'> gmake[1]: Nothing to be done for 'check'. gmake[1]: Leaving directory '/usr<https://ci.centos.org/job/libvirt-dbus-check/systems=libvirt-freebsd-11/ws/…'> Making check in src gmake[1]: Entering directory '/usr<https://ci.centos.org/job/libvirt-dbus-check/systems=libvirt-freebsd-11/ws/…'> gmake[1]: Nothing to be done for 'check'. gmake[1]: Leaving directory '/usr<https://ci.centos.org/job/libvirt-dbus-check/systems=libvirt-freebsd-11/ws/…'> Making check in tests gmake[1]: Entering directory '/usr<https://ci.centos.org/job/libvirt-dbus-check/systems=libvirt-freebsd-11/ws/…'> /usr/local/bin/gmake test_util gmake[2]: Entering directory '/usr<https://ci.centos.org/job/libvirt-dbus-check/systems=libvirt-freebsd-11/ws/…'> CC test_util-test_util.o CCLD test_util gmake[2]: Leaving directory '/usr<https://ci.centos.org/job/libvirt-dbus-check/systems=libvirt-freebsd-11/ws/…'> /usr/local/bin/gmake check-TESTS gmake[2]: Entering directory '/usr<https://ci.centos.org/job/libvirt-dbus-check/systems=libvirt-freebsd-11/ws/…'> gmake[3]: Entering directory '/usr<https://ci.centos.org/job/libvirt-dbus-check/systems=libvirt-freebsd-11/ws/…'> PASS: test_util PASS: test_interface.py PASS: test_domain.py PASS: test_network.py FAIL: test_nodedev.py PASS: test_connect.py PASS: test_storage.py ============================================================================ Testsuite summary for libvirt-dbus 1.3.0 ============================================================================ # TOTAL: 7 # PASS: 6 # SKIP: 0 # XFAIL: 0 # FAIL: 1 # XPASS: 0 # ERROR: 0 ============================================================================ See tests/test-suite.log Please report to libvir-list(a)redhat.com ============================================================================ gmake[3]: *** [Makefile:766: test-suite.log] Error 1 gmake[3]: Leaving directory '/usr<https://ci.centos.org/job/libvirt-dbus-check/systems=libvirt-freebsd-11/ws/…'> gmake[2]: *** [Makefile:874: check-TESTS] Error 2 gmake[2]: Leaving directory '/usr<https://ci.centos.org/job/libvirt-dbus-check/systems=libvirt-freebsd-11/ws/…'> gmake[1]: *** [Makefile:990: check-am] Error 2 gmake[1]: Leaving directory '/usr<https://ci.centos.org/job/libvirt-dbus-check/systems=libvirt-freebsd-11/ws/…'> gmake: *** [Makefile:460: check-recursive] Error 1 + cat tests/test-suite.log ============================================== libvirt-dbus 1.3.0: tests/test-suite.log ============================================== # TOTAL: 7 # PASS: 6 # SKIP: 0 # XFAIL: 0 # FAIL: 1 # XPASS: 0 # ERROR: 0 .. contents:: :depth: 2 FAIL: test_nodedev.py ===================== ============================= test session starts ============================== platform freebsd11 -- Python 3.6.5, pytest-3.4.2, py-1.5.3, pluggy-0.6.0 rootdir: /usr<https://ci.centos.org/job/libvirt-dbus-check/systems=libvirt-freebsd-11/ws/,> inifile: collected 4 items ../../tests/test_nodedev.py ..E. [100%] ==================================== ERRORS ==================================== _________ ERROR at setup of TestNodeDevice.test_node_device_list_caps __________ self = <test_nodedev.TestNodeDevice object at 0x80941b2e8> request = <SubRequest 'libvirt_dbus_setup' for <Function 'test_node_device_list_caps'>> @pytest.fixture(autouse=True) def libvirt_dbus_setup(self, request): """Start libvirt-dbus for each test function """ os.environ['LIBVIRT_DEBUG'] = '3' self.libvirt_dbus = subprocess.Popen([exe, '--session']) self.bus = dbus.SessionBus() for i in range(10): if self.bus.name_has_owner('org.libvirt'): break time.sleep(0.1) else: > raise TimeoutError('error starting libvirt-dbus') E TimeoutError: error starting libvirt-dbus ../../tests/libvirttest.py:44: TimeoutError ====================== 3 passed, 1 error in 5.88 seconds ======================= FAIL test_nodedev.py (exit status: 1) + exit 1 Build step 'Execute shell' marked build as failure
1 1
0 0
[Libvirt-ci] Build failed in Jenkins: libvirt-dbus-check » libvirt-fedora-rawhide #52
by ci@centos.org 02 Oct '18

02 Oct '18
See <https://ci.centos.org/job/libvirt-dbus-check/systems=libvirt-fedora-rawhide…> ------------------------------------------ Started by upstream project "libvirt-dbus-check" build number 52 originally caused by: Started by upstream project "libvirt-dbus-syntax-check" build number 52 originally caused by: Started by upstream project "libvirt-dbus-build" build number 52 originally caused by: Started by upstream project "libvirt-glib-build" build number 52 originally caused by: Started by upstream project "libvirt-build" build number 75 originally caused by: Started by an SCM change Started by an SCM change Started by an SCM change [EnvInject] - Loading node environment variables. Building remotely on libvirt-fedora-rawhide (libvirt) in workspace <https://ci.centos.org/job/libvirt-dbus-check/systems=libvirt-fedora-rawhide…> [libvirt-dbus] $ /bin/sh -xe /tmp/jenkins2485057074200914624.sh + cd build + /usr/bin/gmake check Making check in data gmake[1]: Entering directory '<https://ci.centos.org/job/libvirt-dbus-check/systems=libvirt-fedora-rawhide…'> gmake[1]: Nothing to be done for 'check'. gmake[1]: Leaving directory '<https://ci.centos.org/job/libvirt-dbus-check/systems=libvirt-fedora-rawhide…'> Making check in docs gmake[1]: Entering directory '<https://ci.centos.org/job/libvirt-dbus-check/systems=libvirt-fedora-rawhide…'> gmake[1]: Nothing to be done for 'check'. gmake[1]: Leaving directory '<https://ci.centos.org/job/libvirt-dbus-check/systems=libvirt-fedora-rawhide…'> Making check in src gmake[1]: Entering directory '<https://ci.centos.org/job/libvirt-dbus-check/systems=libvirt-fedora-rawhide…'> gmake[1]: Nothing to be done for 'check'. gmake[1]: Leaving directory '<https://ci.centos.org/job/libvirt-dbus-check/systems=libvirt-fedora-rawhide…'> Making check in tests gmake[1]: Entering directory '<https://ci.centos.org/job/libvirt-dbus-check/systems=libvirt-fedora-rawhide…'> /usr/bin/gmake test_util gmake[2]: Entering directory '<https://ci.centos.org/job/libvirt-dbus-check/systems=libvirt-fedora-rawhide…'> CC test_util-test_util.o CCLD test_util gmake[2]: Leaving directory '<https://ci.centos.org/job/libvirt-dbus-check/systems=libvirt-fedora-rawhide…'> /usr/bin/gmake check-TESTS gmake[2]: Entering directory '<https://ci.centos.org/job/libvirt-dbus-check/systems=libvirt-fedora-rawhide…'> gmake[3]: Entering directory '<https://ci.centos.org/job/libvirt-dbus-check/systems=libvirt-fedora-rawhide…'> PASS: test_util PASS: test_interface.py PASS: test_domain.py FAIL: test_network.py PASS: test_nodedev.py PASS: test_connect.py PASS: test_storage.py ============================================================================ Testsuite summary for libvirt-dbus 1.3.0 ============================================================================ # TOTAL: 7 # PASS: 6 # SKIP: 0 # XFAIL: 0 # FAIL: 1 # XPASS: 0 # ERROR: 0 ============================================================================ See tests/test-suite.log Please report to libvir-list(a)redhat.com ============================================================================ gmake[3]: *** [Makefile:766: test-suite.log] Error 1 gmake[3]: Leaving directory '<https://ci.centos.org/job/libvirt-dbus-check/systems=libvirt-fedora-rawhide…'> gmake[2]: *** [Makefile:874: check-TESTS] Error 2 gmake[2]: Leaving directory '<https://ci.centos.org/job/libvirt-dbus-check/systems=libvirt-fedora-rawhide…'> gmake[1]: *** [Makefile:990: check-am] Error 2 gmake[1]: Leaving directory '<https://ci.centos.org/job/libvirt-dbus-check/systems=libvirt-fedora-rawhide…'> gmake: *** [Makefile:460: check-recursive] Error 1 + cat tests/test-suite.log ============================================== libvirt-dbus 1.3.0: tests/test-suite.log ============================================== # TOTAL: 7 # PASS: 6 # SKIP: 0 # XFAIL: 0 # FAIL: 1 # XPASS: 0 # ERROR: 0 .. contents:: :depth: 2 FAIL: test_network.py ===================== ============================= test session starts ============================== platform linux -- Python 3.7.0, pytest-3.6.3, py-1.5.4, pluggy-0.6.0 rootdir: <https://ci.centos.org/job/libvirt-dbus-check/systems=libvirt-fedora-rawhide…,> inifile: collected 7 items ../../tests/test_network.py E.....F [100%] ==================================== ERRORS ==================================== __________ ERROR at setup of TestNetwork.test_network_properties_type __________ self = <test_network.TestNetwork object at 0x7f0b9ca2ff98> request = <SubRequest 'libvirt_dbus_setup' for <Function 'test_network_properties_type'>> @pytest.fixture(autouse=True) def libvirt_dbus_setup(self, request): """Start libvirt-dbus for each test function """ os.environ['LIBVIRT_DEBUG'] = '3' self.libvirt_dbus = subprocess.Popen([exe, '--session']) self.bus = dbus.SessionBus() for i in range(10): if self.bus.name_has_owner('org.libvirt'): break time.sleep(0.1) else: > raise TimeoutError('error starting libvirt-dbus') E TimeoutError: error starting libvirt-dbus ../../tests/libvirttest.py:44: TimeoutError ---------------------------- Captured stderr setup ----------------------------- dbus-daemon[23669]: Cannot setup inotify for '/home/jenkins/.local/share/dbus-1/services'; error 'Permission denied' =================================== FAILURES =================================== TestNetwork.test_network_update[4-4-0-\n <host mac='00:16:3e:77:e2:ed' name='foo.example.com' ip='192.168.122.10'/>\n -0] self = <test_network.TestNetwork object at 0x7f0b9ca1f4a8>, command = '4' section = '4', parentIndex = 0 xml_str = "\n <host mac='00:16:3e:77:e2:ed' name='foo.example.com' ip='192.168.122.10'/>\n " flags = 0 @pytest.mark.parametrize("command, section, parentIndex, xml_str, flags", [ ('4', '4', 0, ip_dhcp_host_xml, 0), # add-first, ip-dhcp-host ]) def test_network_update(self, command, section, parentIndex, xml_str, flags): > _, test_network = self.get_test_network() ../../tests/test_network.py:91: _ _ _ _ _ _ _ _ _ _ _ _ _ _ _ _ _ _ _ _ _ _ _ _ _ _ _ _ _ _ _ _ _ _ _ _ _ _ _ _ self = <test_network.TestNetwork object at 0x7f0b9ca1f4a8> def get_test_network(self): """Fetch information for the test network from test driver Returns: (dbus.proxies.ProxyObject, dbus.proxies.ProxyObject): Test Network Object, Local proxy for the test Network Object. """ > path = self.connect.ListNetworks(0)[0] E IndexError: list index out of range ../../tests/libvirttest.py:138: IndexError ================= 1 failed, 5 passed, 1 error in 3.17 seconds ================== FAIL test_network.py (exit status: 1) + exit 1 Build step 'Execute shell' marked build as failure
1 1
0 0
[Libvirt-ci] Build failed in Jenkins: virt-viewer-build » libvirt-freebsd-10 #55
by ci@centos.org 01 Oct '18

01 Oct '18
See <https://ci.centos.org/job/virt-viewer-build/systems=libvirt-freebsd-10/55/d…> ------------------------------------------ Started by upstream project "virt-viewer-build" build number 55 originally caused by: Started by upstream project "libvirt-glib-build" build number 51 originally caused by: Started by upstream project "libvirt-build" build number 74 originally caused by: Started by an SCM change Started by an SCM change Started by an SCM change Started by an SCM change Started by an SCM change [EnvInject] - Loading node environment variables. Building remotely on libvirt-freebsd-10 (libvirt) in workspace <https://ci.centos.org/job/virt-viewer-build/systems=libvirt-freebsd-10/ws/> > git rev-parse --is-inside-work-tree # timeout=10 Fetching changes from the remote Git repository > git config remote.origin.url https://pagure.io/virt-viewer.git # timeout=10 Fetching upstream changes from https://pagure.io/virt-viewer.git > git --version # timeout=10 > git fetch --tags --progress https://pagure.io/virt-viewer.git +refs/heads/*:refs/remotes/origin/* Checking out Revision 45eeda66a284dd8b6795603312d18819c0a72790 (refs/remotes/origin/master) > git config core.sparsecheckout # timeout=10 > git checkout -f 45eeda66a284dd8b6795603312d18819c0a72790 Commit message: "display: make klass->close() optional" > git rev-list --no-walk 45eeda66a284dd8b6795603312d18819c0a72790 # timeout=10 Cleaning workspace > git rev-parse --verify HEAD # timeout=10 FATAL: Invalid id: 45eeda66a284dd8b6795603312d18819c0a72790 Process leaked file descriptors. See https://jenkins.io/redirect/troubleshooting/process-leaked-file-descriptors for more information Also: hudson.remoting.Channel$CallSiteStackTrace: Remote call to JNLP4-connect connection from n64.gusty.ci.centos.org/172.19.2.192:1027 at hudson.remoting.Channel.attachCallSiteStackTrace(Channel.java:1741) at hudson.remoting.UserRequest$ExceptionResponse.retrieve(UserRequest.java:357) at hudson.remoting.Channel.call(Channel.java:955) at hudson.remoting.RemoteInvocationHandler.invoke(RemoteInvocationHandler.java:283) at com.sun.proxy.$Proxy86.clean(Unknown Source) at org.jenkinsci.plugins.gitclient.RemoteGitImpl.clean(RemoteGitImpl.java:450) at hudson.plugins.git.extensions.impl.CleanCheckout.onCheckoutCompleted(CleanCheckout.java:30) at hudson.plugins.git.GitSCM.checkout(GitSCM.java:1264) at hudson.scm.SCM.checkout(SCM.java:504) at hudson.model.AbstractProject.checkout(AbstractProject.java:1208) at hudson.model.AbstractBuild$AbstractBuildExecution.defaultCheckout(AbstractBuild.java:574) at jenkins.scm.SCMCheckoutStrategy.checkout(SCMCheckoutStrategy.java:86) at hudson.model.AbstractBuild$AbstractBuildExecution.run(AbstractBuild.java:499) at hudson.model.Run.execute(Run.java:1798) at hudson.matrix.MatrixRun.run(MatrixRun.java:153) at hudson.model.ResourceController.execute(ResourceController.java:97) at hudson.model.Executor.run(Executor.java:429) org.eclipse.jgit.errors.InvalidObjectIdException: Invalid id: 45eeda66a284dd8b6795603312d18819c0a72790 Process leaked file descriptors. See https://jenkins.io/redirect/troubleshooting/process-leaked-file-descriptors for more information at org.eclipse.jgit.lib.ObjectId.fromString(ObjectId.java:232) at org.jenkinsci.plugins.gitclient.CliGitAPIImpl.validateRevision(CliGitAPIImpl.java:866) at org.jenkinsci.plugins.gitclient.CliGitAPIImpl.reset(CliGitAPIImpl.java:465) at org.jenkinsci.plugins.gitclient.CliGitAPIImpl.clean(CliGitAPIImpl.java:801) at hudson.plugins.git.GitAPI.clean(GitAPI.java:311) at sun.reflect.GeneratedMethodAccessor598.invoke(Unknown Source) at sun.reflect.DelegatingMethodAccessorImpl.invoke(DelegatingMethodAccessorImpl.java:43) at java.lang.reflect.Method.invoke(Method.java:498) at hudson.remoting.RemoteInvocationHandler$RPCRequest.perform(RemoteInvocationHandler.java:929) at hudson.remoting.RemoteInvocationHandler$RPCRequest.call(RemoteInvocationHandler.java:903) at hudson.remoting.RemoteInvocationHandler$RPCRequest.call(RemoteInvocationHandler.java:855) at hudson.remoting.UserRequest.perform(UserRequest.java:212) at hudson.remoting.UserRequest.perform(UserRequest.java:54) at hudson.remoting.Request$2.run(Request.java:369) at hudson.remoting.InterceptingExecutorService$1.call(InterceptingExecutorService.java:72) at java.util.concurrent.FutureTask.run(FutureTask.java:266) at java.util.concurrent.ThreadPoolExecutor.runWorker(ThreadPoolExecutor.java:1149) at java.util.concurrent.ThreadPoolExecutor$Worker.run(ThreadPoolExecutor.java:624) at hudson.remoting.Engine$1.lambda$newThread$0(Engine.java:93) at java.lang.Thread.run(Thread.java:748)
1 1
0 0
[Libvirt-ci] Errored: libvirt/libvirt-python#11 (v4.8.0 - b1828e6)
by Travis CI 01 Oct '18

01 Oct '18
Build Update for libvirt/libvirt-python ------------------------------------- Build: #11 Status: Errored Duration: 16 mins and 12 secs Commit: b1828e6 (v4.8.0) Author: Daniel Veillard Message: Release of libvirt-python 4.8.0 Signed-off-by: Daniel Veillard <veillard(a)redhat.com> - setup.py : updated for release View the changeset: https://github.com/libvirt/libvirt-python/compare/v4.8.0 View the full build log and details: https://travis-ci.org/libvirt/libvirt-python/builds/435681395?utm_medium=no… -- You can unsubscribe from build emails from the libvirt/libvirt-python repository going to https://travis-ci.org/account/preferences/unsubscribe?repository=4872050&ut…. Or unsubscribe from *all* email updating your settings at https://travis-ci.org/account/preferences/unsubscribe?utm_medium=notificati…. Or configure specific recipients for build notifications in your .travis.yml file. See https://docs.travis-ci.com/user/notifications.
1 0
0 0
  • ← Newer
  • 1
  • 2
  • 3
  • 4
  • 5
  • 6
  • 7
  • 8
  • 9
  • 10
  • Older →

HyperKitty Powered by HyperKitty version 1.3.12.