libvirt List Archives
Sign In Sign Up
Manage this list Sign In Sign Up

Keyboard Shortcuts

Thread View

  • j: Next unread message
  • k: Previous unread message
  • j a: Jump to all threads
  • j l: Jump to MailingList overview

CI

Thread Start a new thread
Download
Threads by month
  • ----- 2025 -----
  • August
  • July
  • June
  • May
  • April
  • March
  • February
  • January
  • ----- 2024 -----
  • December
  • November
  • October
  • September
  • August
  • July
  • June
  • May
  • April
  • March
  • February
  • January
  • ----- 2023 -----
  • December
  • November
  • October
  • September
  • August
  • July
  • June
  • May
  • April
  • March
  • February
  • January
  • ----- 2022 -----
  • December
  • November
  • October
  • September
  • August
  • July
  • June
  • May
  • April
  • March
  • February
  • January
  • ----- 2021 -----
  • December
  • November
  • October
  • September
  • August
  • July
  • June
  • May
  • April
  • March
  • February
  • January
  • ----- 2020 -----
  • December
  • November
  • October
  • September
  • August
  • July
  • June
  • May
  • April
  • March
  • February
  • January
  • ----- 2019 -----
  • December
  • November
  • October
  • September
  • August
  • July
  • June
  • May
  • April
  • March
  • February
  • January
  • ----- 2018 -----
  • December
  • November
  • October
  • September
  • August
  • July
  • June
  • May
  • April
  • March
  • February
  • January
  • ----- 2017 -----
  • December
  • November
  • October
  • September
  • August
  • July
  • June
  • May
  • April
  • March
  • February
  • January
  • ----- 2016 -----
  • December
  • November
  • October
  • September
  • August
  • July
ci@lists.libvirt.org

October 2018

  • 2 participants
  • 91 discussions
[Libvirt-ci] Build failed in Jenkins: virt-manager-check » libvirt-debian-9 #122
by ci@centos.org 11 Oct '18

11 Oct '18
See <https://ci.centos.org/job/virt-manager-check/systems=libvirt-debian-9/122/d…> ------------------------------------------ Started by upstream project "virt-manager-check" build number 122 originally caused by: Started by upstream project "virt-manager-build" build number 123 originally caused by: Started by an SCM change [EnvInject] - Loading node environment variables. Building remotely on libvirt-debian-9 (libvirt) in workspace <https://ci.centos.org/job/virt-manager-check/systems=libvirt-debian-9/ws/> [virt-manager] $ /bin/sh -xe /tmp/jenkins7265275352817541339.sh + /usr/bin/python3 ./setup.py test running test ............................................................................................................................F......................................................................................................................s.........................................................................................................................................................................................s ====================================================================== FAIL: testCLI0003virt_install_many_devices (tests.clitest.CLITests) ---------------------------------------------------------------------- Traceback (most recent call last): File "<https://ci.centos.org/job/virt-manager-check/systems=libvirt-debian-9/ws/te…",> line 1059, in <lambda> return lambda s: cmdtemplate(s, cmd) File "<https://ci.centos.org/job/virt-manager-check/systems=libvirt-debian-9/ws/te…",> line 1058, in cmdtemplate _cmdobj.run(self) File "<https://ci.centos.org/job/virt-manager-check/systems=libvirt-debian-9/ws/te…",> line 230, in run tests.fail(err) AssertionError: ./virt-install --name foobar --ram 64 --print-step all --connect __virtinst_test__test://<https://ci.centos.org/job/virt-manager-check/systems=libvirt-debian-9/ws/te…> --noautoconsole --os-variant fedora-unknown --vcpus 4,cores=1,placement=static --cpu none --disk /dev/default-pool/UPPER,cache=writeback,io=threads,perms=sh,serial=WD-WMAP9A966149,boot_order=2 --disk /dev/default-pool/new1.img,sparse=false,size=.001,perms=ro,error_policy=enospace,discard=unmap,detect_zeroes=yes --disk device=cdrom,bus=sata,read_bytes_sec=1,read_iops_sec=2,total_bytes_sec=10,total_iops_sec=20,write_bytes_sec=5,write_iops_sec=6,driver.copy_on_read=on,geometry.cyls=16383,geometry.heads=16,geometry.secs=63,geometry.trans=lba --disk size=1 --disk /iscsi-pool/diskvol1 --disk /dev/default-pool/iso-vol,seclabel.model=dac,seclabel1.model=selinux,seclabel1.relabel=no,seclabel0.label=foo,bar,baz --disk /dev/default-pool/iso-vol,format=qcow2 --disk source_pool=rbd-ceph,source_volume=some-rbd-vol,size=.1 --disk pool=rbd-ceph,size=.1 --disk source_protocol=http,source_host_name=example.com,source_host_port=8000,source_name=/path/to/my/file --disk source_protocol=nbd,source_host_transport=unix,source_host_socket=/tmp/socket,bus=scsi,logical_block_size=512,physical_block_size=512 --disk gluster://192.168.1.100/test-volume/some/dir/test-gluster.qcow2 --disk qemu+nbd:///var/foo/bar/socket,bus=usb,removable=on --disk path=http://[1:2:3:4:1:2:3:4]:5522/my/path?query=foo --disk vol=gluster-pool/test-gluster.raw,startup_policy=optional --disk /var,device=floppy,address.type=ccw,address.cssid=0xfe,address.ssid=0,address.devno=01 --disk /dev/default-pool/new2.img,size=1,backing_store=/tmp/foo.img,backing_format=vmdk --disk /tmp/brand-new.img,size=1,backing_store=/dev/default-pool/iso-vol --disk path=/dev/sda,device=lun,bus=scsi,reservations.managed=no,reservations.source.type=unix,reservations.source.path=/var/run/test/pr-helper0.sock,reservations.source.mode=client --network user,mac=12:34:56:78:11:22,portgroup=foo,link_state=down,rom_bar=on,rom_file=/tmp/foo --network bridge=foobar,model=virtio,driver_name=qemu,driver_queues=3 --network bridge=ovsbr,virtualport_type=openvswitch,virtualport_profileid=demo,virtualport_interfaceid=09b11c53-8b5c-4eeb-8f00-d84eaa0aaa3b,link_state=yes --network type=direct,source=eth5,source_mode=vepa,target=mytap12,virtualport_type=802.1Qbg,virtualport_managerid=12,virtualport_typeid=1193046,virtualport_typeidversion=1,virtualport_instanceid=09b11c53-8b5c-4eeb-8f00-d84eaa0aaa3b,boot_order=1,trustGuestRxFilters=yes,mtu.size=1500 --network user,model=virtio,address.type=spapr-vio,address.reg=0x500 --network vhostuser,source_type=unix,source_path=/tmp/vhost1.sock,source_mode=server,model=virtio --graphics sdl --graphics spice,keymap=none --graphics vnc,port=5950,listen=1.2.3.4,keymap=ja,password=foo --graphics spice,port=5950,tlsport=5950,listen=1.2.3.4,keymap=ja --graphics spice,image_compression=foo,streaming_mode=bar,clipboard_copypaste=yes,mouse_mode=client,filetransfer_enable=on --graphics spice,gl=yes,listen=socket --graphics spice,gl=yes,listen=none --graphics spice,gl=yes,listen=none,rendernode=/dev/dri/foo --graphics spice,listens0.type=address,listens0.address=1.2.3.4 --graphics spice,listens0.type=network,listens0.network=default --graphics spice,listens0.type=socket,listens0.socket=/tmp/foobar --controller usb,model=ich9-ehci1,address=0:0:4.7,index=0 --controller usb,model=ich9-uhci1,address=0:0:4.0,index=0,master=0,address.multifunction=on --controller usb,model=ich9-uhci2,address=0:0:4.1,index=0,master=2 --controller usb,model=ich9-uhci3,address=0:0:4.2,index=0,master=4 --input type=keyboard,bus=usb --input tablet --serial tcp,host=:2222,mode=bind,protocol=telnet,log_file=/tmp/foo.log,log_append=yes --serial nmdm,source.master=/dev/foo1,source.slave=/dev/foo2 --parallel udp,host=0.0.0.0:1234,bind_host=127.0.0.1:1234 --parallel unix,path=/tmp/foo-socket --channel pty,target_type=guestfwd,target_address=127.0.0.1:10000 --channel pty,target_type=virtio,name=org.linux-kvm.port1 --console pty,target_type=virtio --channel spicevmc --hostdev net_00_1c_25_10_b1_e4,boot_order=4,rom_bar=off --host-device usb_device_781_5151_2004453082054CA1BEEE --host-device 001.003 --hostdev 15:0.1 --host-device 2:15:0.2 --hostdev 0:15:0.3,address.type=isa,address.iobase=0x500,address.irq=5 --host-device 0x0781:0x5151,driver_name=vfio --host-device 04b3:4485 --host-device pci_8086_2829_scsi_host_scsi_device_lun0 --hostdev usb_5_20 --hostdev usb_5_21 --filesystem /source,/target --filesystem template_name,/,type=template,mode=passthrough --filesystem type=file,source=/tmp/somefile.img,target=/mount/point,accessmode=squash --soundhw default --sound ac97 --sound codec0.type=micro,codec1.type=duplex,codec2.type=output --video cirrus --video model=qxl,vgamem=1,ram=2,vram=3,heads=4,accel3d=yes,vram64=65 --smartcard passthrough,type=spicevmc --smartcard type=host --smartcard default --redirdev usb,type=spicevmc --redirdev usb,type=tcp,server=localhost:4000 --redirdev usb,type=tcp,server=127.0.0.1:4002,boot_order=3 --redirdev default --rng egd,backend_host=127.0.0.1,backend_service=8000,backend_type=tcp --panic iobase=507 --qemu-commandline env=DISPLAY=:0.1 --qemu-commandline="-display gtk,gl=on" --qemu-commandline="-device vfio-pci,addr=05.0,sysfsdev=/sys/class/mdev_bus/0000:00:02.0/f321853c-c584-4a6b-b99a-3eee22a3919c" --qemu-commandline="-set device.video0.driver=virtio-vga" Command was: ./virt-install --name foobar --ram 64 --print-step all --connect __virtinst_test__test://<https://ci.centos.org/job/virt-manager-check/systems=libvirt-debian-9/ws/te…> --noautoconsole --os-variant fedora-unknown --vcpus 4,cores=1,placement=static --cpu none --disk /dev/default-pool/UPPER,cache=writeback,io=threads,perms=sh,serial=WD-WMAP9A966149,boot_order=2 --disk /dev/default-pool/new1.img,sparse=false,size=.001,perms=ro,error_policy=enospace,discard=unmap,detect_zeroes=yes --disk device=cdrom,bus=sata,read_bytes_sec=1,read_iops_sec=2,total_bytes_sec=10,total_iops_sec=20,write_bytes_sec=5,write_iops_sec=6,driver.copy_on_read=on,geometry.cyls=16383,geometry.heads=16,geometry.secs=63,geometry.trans=lba --disk size=1 --disk /iscsi-pool/diskvol1 --disk /dev/default-pool/iso-vol,seclabel.model=dac,seclabel1.model=selinux,seclabel1.relabel=no,seclabel0.label=foo,bar,baz --disk /dev/default-pool/iso-vol,format=qcow2 --disk source_pool=rbd-ceph,source_volume=some-rbd-vol,size=.1 --disk pool=rbd-ceph,size=.1 --disk source_protocol=http,source_host_name=example.com,source_host_port=8000,source_name=/path/to/my/file --disk source_protocol=nbd,source_host_transport=unix,source_host_socket=/tmp/socket,bus=scsi,logical_block_size=512,physical_block_size=512 --disk gluster://192.168.1.100/test-volume/some/dir/test-gluster.qcow2 --disk qemu+nbd:///var/foo/bar/socket,bus=usb,removable=on --disk path=http://[1:2:3:4:1:2:3:4]:5522/my/path?query=foo --disk vol=gluster-pool/test-gluster.raw,startup_policy=optional --disk /var,device=floppy,address.type=ccw,address.cssid=0xfe,address.ssid=0,address.devno=01 --disk /dev/default-pool/new2.img,size=1,backing_store=/tmp/foo.img,backing_format=vmdk --disk /tmp/brand-new.img,size=1,backing_store=/dev/default-pool/iso-vol --disk path=/dev/sda,device=lun,bus=scsi,reservations.managed=no,reservations.source.type=unix,reservations.source.path=/var/run/test/pr-helper0.sock,reservations.source.mode=client --network user,mac=12:34:56:78:11:22,portgroup=foo,link_state=down,rom_bar=on,rom_file=/tmp/foo --network bridge=foobar,model=virtio,driver_name=qemu,driver_queues=3 --network bridge=ovsbr,virtualport_type=openvswitch,virtualport_profileid=demo,virtualport_interfaceid=09b11c53-8b5c-4eeb-8f00-d84eaa0aaa3b,link_state=yes --network type=direct,source=eth5,source_mode=vepa,target=mytap12,virtualport_type=802.1Qbg,virtualport_managerid=12,virtualport_typeid=1193046,virtualport_typeidversion=1,virtualport_instanceid=09b11c53-8b5c-4eeb-8f00-d84eaa0aaa3b,boot_order=1,trustGuestRxFilters=yes,mtu.size=1500 --network user,model=virtio,address.type=spapr-vio,address.reg=0x500 --network vhostuser,source_type=unix,source_path=/tmp/vhost1.sock,source_mode=server,model=virtio --graphics sdl --graphics spice,keymap=none --graphics vnc,port=5950,listen=1.2.3.4,keymap=ja,password=foo --graphics spice,port=5950,tlsport=5950,listen=1.2.3.4,keymap=ja --graphics spice,image_compression=foo,streaming_mode=bar,clipboard_copypaste=yes,mouse_mode=client,filetransfer_enable=on --graphics spice,gl=yes,listen=socket --graphics spice,gl=yes,listen=none --graphics spice,gl=yes,listen=none,rendernode=/dev/dri/foo --graphics spice,listens0.type=address,listens0.address=1.2.3.4 --graphics spice,listens0.type=network,listens0.network=default --graphics spice,listens0.type=socket,listens0.socket=/tmp/foobar --controller usb,model=ich9-ehci1,address=0:0:4.7,index=0 --controller usb,model=ich9-uhci1,address=0:0:4.0,index=0,master=0,address.multifunction=on --controller usb,model=ich9-uhci2,address=0:0:4.1,index=0,master=2 --controller usb,model=ich9-uhci3,address=0:0:4.2,index=0,master=4 --input type=keyboard,bus=usb --input tablet --serial tcp,host=:2222,mode=bind,protocol=telnet,log_file=/tmp/foo.log,log_append=yes --serial nmdm,source.master=/dev/foo1,source.slave=/dev/foo2 --parallel udp,host=0.0.0.0:1234,bind_host=127.0.0.1:1234 --parallel unix,path=/tmp/foo-socket --channel pty,target_type=guestfwd,target_address=127.0.0.1:10000 --channel pty,target_type=virtio,name=org.linux-kvm.port1 --console pty,target_type=virtio --channel spicevmc --hostdev net_00_1c_25_10_b1_e4,boot_order=4,rom_bar=off --host-device usb_device_781_5151_2004453082054CA1BEEE --host-device 001.003 --hostdev 15:0.1 --host-device 2:15:0.2 --hostdev 0:15:0.3,address.type=isa,address.iobase=0x500,address.irq=5 --host-device 0x0781:0x5151,driver_name=vfio --host-device 04b3:4485 --host-device pci_8086_2829_scsi_host_scsi_device_lun0 --hostdev usb_5_20 --hostdev usb_5_21 --filesystem /source,/target --filesystem template_name,/,type=template,mode=passthrough --filesystem type=file,source=/tmp/somefile.img,target=/mount/point,accessmode=squash --soundhw default --sound ac97 --sound codec0.type=micro,codec1.type=duplex,codec2.type=output --video cirrus --video model=qxl,vgamem=1,ram=2,vram=3,heads=4,accel3d=yes,vram64=65 --smartcard passthrough,type=spicevmc --smartcard type=host --smartcard default --redirdev usb,type=spicevmc --redirdev usb,type=tcp,server=localhost:4000 --redirdev usb,type=tcp,server=127.0.0.1:4002,boot_order=3 --redirdev default --rng egd,backend_host=127.0.0.1,backend_service=8000,backend_type=tcp --panic iobase=507 --qemu-commandline env=DISPLAY=:0.1 --qemu-commandline="-display gtk,gl=on" --qemu-commandline="-device vfio-pci,addr=05.0,sysfsdev=/sys/class/mdev_bus/0000:00:02.0/f321853c-c584-4a6b-b99a-3eee22a3919c" --qemu-commandline="-set device.video0.driver=virtio-vga" Error code : -1 Output was: ERROR Error: --disk path=/dev/sda,device=lun,bus=scsi,reservations.managed=no,reservations.source.type=unix,reservations.source.path=/var/run/test/pr-helper0.sock,reservations.source.mode=client: Size must be specified for non existent volume 'sda' TESTSUITE: Expected command to pass, but it didn't. ---------------------------------------------------------------------- Ran 430 tests in 34.512s FAILED (failures=1, skipped=2) Build step 'Execute shell' marked build as failure
1 1
0 0
[Libvirt-ci] Build failed in Jenkins: virt-manager-check » libvirt-fedora-rawhide #122
by ci@centos.org 11 Oct '18

11 Oct '18
See <https://ci.centos.org/job/virt-manager-check/systems=libvirt-fedora-rawhide…> ------------------------------------------ Started by upstream project "virt-manager-check" build number 122 originally caused by: Started by upstream project "virt-manager-build" build number 123 originally caused by: Started by an SCM change [EnvInject] - Loading node environment variables. Building remotely on libvirt-fedora-rawhide (libvirt) in workspace <https://ci.centos.org/job/virt-manager-check/systems=libvirt-fedora-rawhide…> [virt-manager] $ /bin/sh -xe /tmp/jenkins5719435592696298138.sh + /usr/bin/python3 ./setup.py test running test ............................................................................................................................F......................................................................................................................s.........................................................................................................................................................................................s ====================================================================== FAIL: testCLI0003virt_install_many_devices (tests.clitest.CLITests) ---------------------------------------------------------------------- Traceback (most recent call last): File "<https://ci.centos.org/job/virt-manager-check/systems=libvirt-fedora-rawhide…",> line 1059, in <lambda> return lambda s: cmdtemplate(s, cmd) File "<https://ci.centos.org/job/virt-manager-check/systems=libvirt-fedora-rawhide…",> line 1058, in cmdtemplate _cmdobj.run(self) File "<https://ci.centos.org/job/virt-manager-check/systems=libvirt-fedora-rawhide…",> line 230, in run tests.fail(err) AssertionError: ./virt-install --name foobar --ram 64 --print-step all --connect __virtinst_test__test://<https://ci.centos.org/job/virt-manager-check/systems=libvirt-fedora-rawhide…> --noautoconsole --os-variant fedora-unknown --vcpus 4,cores=1,placement=static --cpu none --disk /dev/default-pool/UPPER,cache=writeback,io=threads,perms=sh,serial=WD-WMAP9A966149,boot_order=2 --disk /dev/default-pool/new1.img,sparse=false,size=.001,perms=ro,error_policy=enospace,discard=unmap,detect_zeroes=yes --disk device=cdrom,bus=sata,read_bytes_sec=1,read_iops_sec=2,total_bytes_sec=10,total_iops_sec=20,write_bytes_sec=5,write_iops_sec=6,driver.copy_on_read=on,geometry.cyls=16383,geometry.heads=16,geometry.secs=63,geometry.trans=lba --disk size=1 --disk /iscsi-pool/diskvol1 --disk /dev/default-pool/iso-vol,seclabel.model=dac,seclabel1.model=selinux,seclabel1.relabel=no,seclabel0.label=foo,bar,baz --disk /dev/default-pool/iso-vol,format=qcow2 --disk source_pool=rbd-ceph,source_volume=some-rbd-vol,size=.1 --disk pool=rbd-ceph,size=.1 --disk source_protocol=http,source_host_name=example.com,source_host_port=8000,source_name=/path/to/my/file --disk source_protocol=nbd,source_host_transport=unix,source_host_socket=/tmp/socket,bus=scsi,logical_block_size=512,physical_block_size=512 --disk gluster://192.168.1.100/test-volume/some/dir/test-gluster.qcow2 --disk qemu+nbd:///var/foo/bar/socket,bus=usb,removable=on --disk path=http://[1:2:3:4:1:2:3:4]:5522/my/path?query=foo --disk vol=gluster-pool/test-gluster.raw,startup_policy=optional --disk /var,device=floppy,address.type=ccw,address.cssid=0xfe,address.ssid=0,address.devno=01 --disk /dev/default-pool/new2.img,size=1,backing_store=/tmp/foo.img,backing_format=vmdk --disk /tmp/brand-new.img,size=1,backing_store=/dev/default-pool/iso-vol --disk path=/dev/sda,device=lun,bus=scsi,reservations.managed=no,reservations.source.type=unix,reservations.source.path=/var/run/test/pr-helper0.sock,reservations.source.mode=client --network user,mac=12:34:56:78:11:22,portgroup=foo,link_state=down,rom_bar=on,rom_file=/tmp/foo --network bridge=foobar,model=virtio,driver_name=qemu,driver_queues=3 --network bridge=ovsbr,virtualport_type=openvswitch,virtualport_profileid=demo,virtualport_interfaceid=09b11c53-8b5c-4eeb-8f00-d84eaa0aaa3b,link_state=yes --network type=direct,source=eth5,source_mode=vepa,target=mytap12,virtualport_type=802.1Qbg,virtualport_managerid=12,virtualport_typeid=1193046,virtualport_typeidversion=1,virtualport_instanceid=09b11c53-8b5c-4eeb-8f00-d84eaa0aaa3b,boot_order=1,trustGuestRxFilters=yes,mtu.size=1500 --network user,model=virtio,address.type=spapr-vio,address.reg=0x500 --network vhostuser,source_type=unix,source_path=/tmp/vhost1.sock,source_mode=server,model=virtio --graphics sdl --graphics spice,keymap=none --graphics vnc,port=5950,listen=1.2.3.4,keymap=ja,password=foo --graphics spice,port=5950,tlsport=5950,listen=1.2.3.4,keymap=ja --graphics spice,image_compression=foo,streaming_mode=bar,clipboard_copypaste=yes,mouse_mode=client,filetransfer_enable=on --graphics spice,gl=yes,listen=socket --graphics spice,gl=yes,listen=none --graphics spice,gl=yes,listen=none,rendernode=/dev/dri/foo --graphics spice,listens0.type=address,listens0.address=1.2.3.4 --graphics spice,listens0.type=network,listens0.network=default --graphics spice,listens0.type=socket,listens0.socket=/tmp/foobar --controller usb,model=ich9-ehci1,address=0:0:4.7,index=0 --controller usb,model=ich9-uhci1,address=0:0:4.0,index=0,master=0,address.multifunction=on --controller usb,model=ich9-uhci2,address=0:0:4.1,index=0,master=2 --controller usb,model=ich9-uhci3,address=0:0:4.2,index=0,master=4 --input type=keyboard,bus=usb --input tablet --serial tcp,host=:2222,mode=bind,protocol=telnet,log_file=/tmp/foo.log,log_append=yes --serial nmdm,source.master=/dev/foo1,source.slave=/dev/foo2 --parallel udp,host=0.0.0.0:1234,bind_host=127.0.0.1:1234 --parallel unix,path=/tmp/foo-socket --channel pty,target_type=guestfwd,target_address=127.0.0.1:10000 --channel pty,target_type=virtio,name=org.linux-kvm.port1 --console pty,target_type=virtio --channel spicevmc --hostdev net_00_1c_25_10_b1_e4,boot_order=4,rom_bar=off --host-device usb_device_781_5151_2004453082054CA1BEEE --host-device 001.003 --hostdev 15:0.1 --host-device 2:15:0.2 --hostdev 0:15:0.3,address.type=isa,address.iobase=0x500,address.irq=5 --host-device 0x0781:0x5151,driver_name=vfio --host-device 04b3:4485 --host-device pci_8086_2829_scsi_host_scsi_device_lun0 --hostdev usb_5_20 --hostdev usb_5_21 --filesystem /source,/target --filesystem template_name,/,type=template,mode=passthrough --filesystem type=file,source=/tmp/somefile.img,target=/mount/point,accessmode=squash --soundhw default --sound ac97 --sound codec0.type=micro,codec1.type=duplex,codec2.type=output --video cirrus --video model=qxl,vgamem=1,ram=2,vram=3,heads=4,accel3d=yes,vram64=65 --smartcard passthrough,type=spicevmc --smartcard type=host --smartcard default --redirdev usb,type=spicevmc --redirdev usb,type=tcp,server=localhost:4000 --redirdev usb,type=tcp,server=127.0.0.1:4002,boot_order=3 --redirdev default --rng egd,backend_host=127.0.0.1,backend_service=8000,backend_type=tcp --panic iobase=507 --qemu-commandline env=DISPLAY=:0.1 --qemu-commandline="-display gtk,gl=on" --qemu-commandline="-device vfio-pci,addr=05.0,sysfsdev=/sys/class/mdev_bus/0000:00:02.0/f321853c-c584-4a6b-b99a-3eee22a3919c" --qemu-commandline="-set device.video0.driver=virtio-vga" Command was: ./virt-install --name foobar --ram 64 --print-step all --connect __virtinst_test__test://<https://ci.centos.org/job/virt-manager-check/systems=libvirt-fedora-rawhide…> --noautoconsole --os-variant fedora-unknown --vcpus 4,cores=1,placement=static --cpu none --disk /dev/default-pool/UPPER,cache=writeback,io=threads,perms=sh,serial=WD-WMAP9A966149,boot_order=2 --disk /dev/default-pool/new1.img,sparse=false,size=.001,perms=ro,error_policy=enospace,discard=unmap,detect_zeroes=yes --disk device=cdrom,bus=sata,read_bytes_sec=1,read_iops_sec=2,total_bytes_sec=10,total_iops_sec=20,write_bytes_sec=5,write_iops_sec=6,driver.copy_on_read=on,geometry.cyls=16383,geometry.heads=16,geometry.secs=63,geometry.trans=lba --disk size=1 --disk /iscsi-pool/diskvol1 --disk /dev/default-pool/iso-vol,seclabel.model=dac,seclabel1.model=selinux,seclabel1.relabel=no,seclabel0.label=foo,bar,baz --disk /dev/default-pool/iso-vol,format=qcow2 --disk source_pool=rbd-ceph,source_volume=some-rbd-vol,size=.1 --disk pool=rbd-ceph,size=.1 --disk source_protocol=http,source_host_name=example.com,source_host_port=8000,source_name=/path/to/my/file --disk source_protocol=nbd,source_host_transport=unix,source_host_socket=/tmp/socket,bus=scsi,logical_block_size=512,physical_block_size=512 --disk gluster://192.168.1.100/test-volume/some/dir/test-gluster.qcow2 --disk qemu+nbd:///var/foo/bar/socket,bus=usb,removable=on --disk path=http://[1:2:3:4:1:2:3:4]:5522/my/path?query=foo --disk vol=gluster-pool/test-gluster.raw,startup_policy=optional --disk /var,device=floppy,address.type=ccw,address.cssid=0xfe,address.ssid=0,address.devno=01 --disk /dev/default-pool/new2.img,size=1,backing_store=/tmp/foo.img,backing_format=vmdk --disk /tmp/brand-new.img,size=1,backing_store=/dev/default-pool/iso-vol --disk path=/dev/sda,device=lun,bus=scsi,reservations.managed=no,reservations.source.type=unix,reservations.source.path=/var/run/test/pr-helper0.sock,reservations.source.mode=client --network user,mac=12:34:56:78:11:22,portgroup=foo,link_state=down,rom_bar=on,rom_file=/tmp/foo --network bridge=foobar,model=virtio,driver_name=qemu,driver_queues=3 --network bridge=ovsbr,virtualport_type=openvswitch,virtualport_profileid=demo,virtualport_interfaceid=09b11c53-8b5c-4eeb-8f00-d84eaa0aaa3b,link_state=yes --network type=direct,source=eth5,source_mode=vepa,target=mytap12,virtualport_type=802.1Qbg,virtualport_managerid=12,virtualport_typeid=1193046,virtualport_typeidversion=1,virtualport_instanceid=09b11c53-8b5c-4eeb-8f00-d84eaa0aaa3b,boot_order=1,trustGuestRxFilters=yes,mtu.size=1500 --network user,model=virtio,address.type=spapr-vio,address.reg=0x500 --network vhostuser,source_type=unix,source_path=/tmp/vhost1.sock,source_mode=server,model=virtio --graphics sdl --graphics spice,keymap=none --graphics vnc,port=5950,listen=1.2.3.4,keymap=ja,password=foo --graphics spice,port=5950,tlsport=5950,listen=1.2.3.4,keymap=ja --graphics spice,image_compression=foo,streaming_mode=bar,clipboard_copypaste=yes,mouse_mode=client,filetransfer_enable=on --graphics spice,gl=yes,listen=socket --graphics spice,gl=yes,listen=none --graphics spice,gl=yes,listen=none,rendernode=/dev/dri/foo --graphics spice,listens0.type=address,listens0.address=1.2.3.4 --graphics spice,listens0.type=network,listens0.network=default --graphics spice,listens0.type=socket,listens0.socket=/tmp/foobar --controller usb,model=ich9-ehci1,address=0:0:4.7,index=0 --controller usb,model=ich9-uhci1,address=0:0:4.0,index=0,master=0,address.multifunction=on --controller usb,model=ich9-uhci2,address=0:0:4.1,index=0,master=2 --controller usb,model=ich9-uhci3,address=0:0:4.2,index=0,master=4 --input type=keyboard,bus=usb --input tablet --serial tcp,host=:2222,mode=bind,protocol=telnet,log_file=/tmp/foo.log,log_append=yes --serial nmdm,source.master=/dev/foo1,source.slave=/dev/foo2 --parallel udp,host=0.0.0.0:1234,bind_host=127.0.0.1:1234 --parallel unix,path=/tmp/foo-socket --channel pty,target_type=guestfwd,target_address=127.0.0.1:10000 --channel pty,target_type=virtio,name=org.linux-kvm.port1 --console pty,target_type=virtio --channel spicevmc --hostdev net_00_1c_25_10_b1_e4,boot_order=4,rom_bar=off --host-device usb_device_781_5151_2004453082054CA1BEEE --host-device 001.003 --hostdev 15:0.1 --host-device 2:15:0.2 --hostdev 0:15:0.3,address.type=isa,address.iobase=0x500,address.irq=5 --host-device 0x0781:0x5151,driver_name=vfio --host-device 04b3:4485 --host-device pci_8086_2829_scsi_host_scsi_device_lun0 --hostdev usb_5_20 --hostdev usb_5_21 --filesystem /source,/target --filesystem template_name,/,type=template,mode=passthrough --filesystem type=file,source=/tmp/somefile.img,target=/mount/point,accessmode=squash --soundhw default --sound ac97 --sound codec0.type=micro,codec1.type=duplex,codec2.type=output --video cirrus --video model=qxl,vgamem=1,ram=2,vram=3,heads=4,accel3d=yes,vram64=65 --smartcard passthrough,type=spicevmc --smartcard type=host --smartcard default --redirdev usb,type=spicevmc --redirdev usb,type=tcp,server=localhost:4000 --redirdev usb,type=tcp,server=127.0.0.1:4002,boot_order=3 --redirdev default --rng egd,backend_host=127.0.0.1,backend_service=8000,backend_type=tcp --panic iobase=507 --qemu-commandline env=DISPLAY=:0.1 --qemu-commandline="-display gtk,gl=on" --qemu-commandline="-device vfio-pci,addr=05.0,sysfsdev=/sys/class/mdev_bus/0000:00:02.0/f321853c-c584-4a6b-b99a-3eee22a3919c" --qemu-commandline="-set device.video0.driver=virtio-vga" Error code : -1 Output was: ERROR Error: --disk path=/dev/sda,device=lun,bus=scsi,reservations.managed=no,reservations.source.type=unix,reservations.source.path=/var/run/test/pr-helper0.sock,reservations.source.mode=client: Size must be specified for non existent volume 'sda' TESTSUITE: Expected command to pass, but it didn't. ---------------------------------------------------------------------- Ran 430 tests in 28.627s FAILED (failures=1, skipped=2) Build step 'Execute shell' marked build as failure
1 1
0 0
[Libvirt-ci] Build failed in Jenkins: libosinfo-check » libvirt-fedora-27 #23
by ci@centos.org 11 Oct '18

11 Oct '18
See <https://ci.centos.org/job/libosinfo-check/systems=libvirt-fedora-27/23/disp…> ------------------------------------------ Started by upstream project "libosinfo-check" build number 23 originally caused by: Started by upstream project "libosinfo-syntax-check" build number 23 originally caused by: Started by upstream project "libosinfo-build" build number 23 originally caused by: Started by upstream project "osinfo-db-build" build number 16 originally caused by: Started by an SCM change [EnvInject] - Loading node environment variables. Building remotely on libvirt-fedora-27 (libvirt) in workspace <https://ci.centos.org/job/libosinfo-check/systems=libvirt-fedora-27/ws/> [libosinfo] $ /bin/sh -xe /tmp/jenkins1570355638896868666.sh + export LIBOSINFO_NETWORK_TESTS=1 + LIBOSINFO_NETWORK_TESTS=1 + cd build + /usr/bin/gmake check GEN public-submodule-commit Making check in osinfo gmake[1]: Entering directory '<https://ci.centos.org/job/libosinfo-check/systems=libvirt-fedora-27/ws/buil…'> /usr/bin/gmake check-am gmake[2]: Entering directory '<https://ci.centos.org/job/libosinfo-check/systems=libvirt-fedora-27/ws/buil…'> /usr/bin/gmake check-local gmake[3]: Entering directory '<https://ci.centos.org/job/libosinfo-check/systems=libvirt-fedora-27/ws/buil…'> GEN check-symfile GEN check-symsorting gmake[3]: Leaving directory '<https://ci.centos.org/job/libosinfo-check/systems=libvirt-fedora-27/ws/buil…'> gmake[2]: Leaving directory '<https://ci.centos.org/job/libosinfo-check/systems=libvirt-fedora-27/ws/buil…'> gmake[1]: Leaving directory '<https://ci.centos.org/job/libosinfo-check/systems=libvirt-fedora-27/ws/buil…'> Making check in tools gmake[1]: Entering directory '<https://ci.centos.org/job/libosinfo-check/systems=libvirt-fedora-27/ws/buil…'> gmake[1]: Nothing to be done for 'check'. gmake[1]: Leaving directory '<https://ci.centos.org/job/libosinfo-check/systems=libvirt-fedora-27/ws/buil…'> Making check in docs gmake[1]: Entering directory '<https://ci.centos.org/job/libosinfo-check/systems=libvirt-fedora-27/ws/buil…'> Making check in reference gmake[2]: Entering directory '<https://ci.centos.org/job/libosinfo-check/systems=libvirt-fedora-27/ws/buil…'> gmake[2]: Nothing to be done for 'check'. gmake[2]: Leaving directory '<https://ci.centos.org/job/libosinfo-check/systems=libvirt-fedora-27/ws/buil…'> gmake[2]: Entering directory '<https://ci.centos.org/job/libosinfo-check/systems=libvirt-fedora-27/ws/buil…'> gmake[2]: Nothing to be done for 'check-am'. gmake[2]: Leaving directory '<https://ci.centos.org/job/libosinfo-check/systems=libvirt-fedora-27/ws/buil…'> gmake[1]: Leaving directory '<https://ci.centos.org/job/libosinfo-check/systems=libvirt-fedora-27/ws/buil…'> Making check in po gmake[1]: Entering directory '<https://ci.centos.org/job/libosinfo-check/systems=libvirt-fedora-27/ws/buil…'> INTLTOOL_EXTRACT="/usr/bin/intltool-extract" XGETTEXT="/usr/bin/xgettext" srcdir=../../po /usr/bin/intltool-update --gettext-package libosinfo --pot rm -f missing notexist srcdir=../../po /usr/bin/intltool-update -m if [ -r missing -o -r notexist ]; then \ exit 1; \ fi gmake[1]: Leaving directory '<https://ci.centos.org/job/libosinfo-check/systems=libvirt-fedora-27/ws/buil…'> Making check in examples gmake[1]: Entering directory '<https://ci.centos.org/job/libosinfo-check/systems=libvirt-fedora-27/ws/buil…'> gmake[1]: Nothing to be done for 'check'. gmake[1]: Leaving directory '<https://ci.centos.org/job/libosinfo-check/systems=libvirt-fedora-27/ws/buil…'> Making check in tests gmake[1]: Entering directory '<https://ci.centos.org/job/libosinfo-check/systems=libvirt-fedora-27/ws/buil…'> /usr/bin/gmake test-entity test-device test-list test-devicelist test-filter test-product test-os test-oslist test-productfilter test-platform test-platformlist test-db test-loader test-isodetect test-install-script test-os-resources test-mediauris test-treeuris gmake[2]: Entering directory '<https://ci.centos.org/job/libosinfo-check/systems=libvirt-fedora-27/ws/buil…'> CC test_entity-test-entity.o CC test_device-test-device.o CC test_list-test-list.o CC test_devicelist-test-devicelist.o CC test_filter-test-filter.o CC test_os-test-os.o CC test_product-test-product.o CC test_oslist-test-oslist.o CC test_productfilter-test-productfilter.o CC test_platform-test-platform.o CC test_platformlist-test-platformlist.o CC test_db-test-db.o CC test_loader-test-loader.o CC test_isodetect-test-isodetect.o CC test_install_script-test-install-script.o CC test_os_resources-test-os-resources.o CC test_mediauris-test-mediauris.o CC test_treeuris-test-treeuris.o CCLD test-entity CCLD test-device CCLD test-list CCLD test-devicelist CCLD test-filter CCLD test-product CCLD test-os CCLD test-oslist CCLD test-productfilter CCLD test-platform CCLD test-platformlist CCLD test-db CCLD test-loader CCLD test-isodetect CCLD test-install-script CCLD test-os-resources CCLD test-mediauris CCLD test-treeuris gmake[2]: Leaving directory '<https://ci.centos.org/job/libosinfo-check/systems=libvirt-fedora-27/ws/buil…'> /usr/bin/gmake check-TESTS gmake[2]: Entering directory '<https://ci.centos.org/job/libosinfo-check/systems=libvirt-fedora-27/ws/buil…'> gmake[3]: Entering directory '<https://ci.centos.org/job/libosinfo-check/systems=libvirt-fedora-27/ws/buil…'> PASS: test-device PASS: test-entity PASS: test-list PASS: test-devicelist PASS: test-filter PASS: test-product PASS: test-oslist PASS: test-os PASS: test-productfilter PASS: test-platformlist PASS: test-platform PASS: test-db PASS: test-install-script PASS: test-loader PASS: test-os-resources PASS: test-treeuris PASS: test-isodetect ../../build-aux/test-driver: line 107: 24684 Aborted (core dumped) "$@" > $log_file 2>&1 FAIL: test-mediauris ============================================================================ Testsuite summary for libosinfo 1.3.0 ============================================================================ # TOTAL: 18 # PASS: 17 # SKIP: 0 # XFAIL: 0 # FAIL: 1 # XPASS: 0 # ERROR: 0 ============================================================================ See tests/test-suite.log Please report to libosinfo(a)redhat.com ============================================================================ gmake[3]: *** [Makefile:1289: test-suite.log] Error 1 gmake[3]: Leaving directory '<https://ci.centos.org/job/libosinfo-check/systems=libvirt-fedora-27/ws/buil…'> gmake[2]: *** [Makefile:1397: check-TESTS] Error 2 gmake[2]: Leaving directory '<https://ci.centos.org/job/libosinfo-check/systems=libvirt-fedora-27/ws/buil…'> gmake[1]: *** [Makefile:1587: check-am] Error 2 gmake[1]: Leaving directory '<https://ci.centos.org/job/libosinfo-check/systems=libvirt-fedora-27/ws/buil…'> gmake: *** [Makefile:594: check-recursive] Error 1 + cat tests/test-suite.log =========================================== libosinfo 1.3.0: tests/test-suite.log =========================================== # TOTAL: 18 # PASS: 17 # SKIP: 0 # XFAIL: 0 # FAIL: 1 # XPASS: 0 # ERROR: 0 .. contents:: :depth: 2 FAIL: test-mediauris ==================== /mediauris/uris: ** ERROR:../../tests/test-mediauris.c:50:test_media: assertion failed (res == CURLE_OK): (28 == 0) FAIL test-mediauris (exit status: 134) + exit 1 Build step 'Execute shell' marked build as failure
1 1
0 0
[Libvirt-ci] Build failed in Jenkins: libosinfo-check » libvirt-freebsd-10 #21
by ci@centos.org 11 Oct '18

11 Oct '18
See <https://ci.centos.org/job/libosinfo-check/systems=libvirt-freebsd-10/21/dis…> ------------------------------------------ Started by upstream project "libosinfo-check" build number 21 originally caused by: Started by upstream project "libosinfo-syntax-check" build number 21 originally caused by: Started by upstream project "libosinfo-build" build number 21 originally caused by: Started by an SCM change [EnvInject] - Loading node environment variables. Building remotely on libvirt-freebsd-10 (libvirt) in workspace <https://ci.centos.org/job/libosinfo-check/systems=libvirt-freebsd-10/ws/> [libosinfo] $ /bin/sh -xe /tmp/jenkins3629950241586827448.sh + export LIBOSINFO_NETWORK_TESTS=1 + cd build + /usr/local/bin/gmake check Making check in osinfo GEN public-submodule-commit gmake[1]: Entering directory '/usr<https://ci.centos.org/job/libosinfo-check/systems=libvirt-freebsd-10/ws/bui…'> /usr/local/bin/gmake check-am gmake[2]: Entering directory '/usr<https://ci.centos.org/job/libosinfo-check/systems=libvirt-freebsd-10/ws/bui…'> /usr/local/bin/gmake check-local gmake[3]: Entering directory '/usr<https://ci.centos.org/job/libosinfo-check/systems=libvirt-freebsd-10/ws/bui…'> GEN check-symsorting gmake[3]: Leaving directory '/usr<https://ci.centos.org/job/libosinfo-check/systems=libvirt-freebsd-10/ws/bui…'> gmake[2]: Leaving directory '/usr<https://ci.centos.org/job/libosinfo-check/systems=libvirt-freebsd-10/ws/bui…'> gmake[1]: Leaving directory '/usr<https://ci.centos.org/job/libosinfo-check/systems=libvirt-freebsd-10/ws/bui…'> Making check in tools gmake[1]: Entering directory '/usr<https://ci.centos.org/job/libosinfo-check/systems=libvirt-freebsd-10/ws/bui…'> gmake[1]: Nothing to be done for 'check'. gmake[1]: Leaving directory '/usr<https://ci.centos.org/job/libosinfo-check/systems=libvirt-freebsd-10/ws/bui…'> Making check in docs gmake[1]: Entering directory '/usr<https://ci.centos.org/job/libosinfo-check/systems=libvirt-freebsd-10/ws/bui…'> Making check in reference gmake[2]: Entering directory '/usr<https://ci.centos.org/job/libosinfo-check/systems=libvirt-freebsd-10/ws/bui…'> gmake[2]: Nothing to be done for 'check'. gmake[2]: Leaving directory '/usr<https://ci.centos.org/job/libosinfo-check/systems=libvirt-freebsd-10/ws/bui…'> gmake[2]: Entering directory '/usr<https://ci.centos.org/job/libosinfo-check/systems=libvirt-freebsd-10/ws/bui…'> gmake[2]: Nothing to be done for 'check-am'. gmake[2]: Leaving directory '/usr<https://ci.centos.org/job/libosinfo-check/systems=libvirt-freebsd-10/ws/bui…'> gmake[1]: Leaving directory '/usr<https://ci.centos.org/job/libosinfo-check/systems=libvirt-freebsd-10/ws/bui…'> Making check in po gmake[1]: Entering directory '/usr<https://ci.centos.org/job/libosinfo-check/systems=libvirt-freebsd-10/ws/bui…'> INTLTOOL_EXTRACT="/usr/local/bin/intltool-extract" XGETTEXT="/usr/local/bin/xgettext" srcdir=../../po /usr/local/bin/intltool-update --gettext-package libosinfo --pot rm -f missing notexist srcdir=../../po /usr/local/bin/intltool-update -m if [ -r missing -o -r notexist ]; then \ exit 1; \ fi gmake[1]: Leaving directory '/usr<https://ci.centos.org/job/libosinfo-check/systems=libvirt-freebsd-10/ws/bui…'> Making check in examples gmake[1]: Entering directory '/usr<https://ci.centos.org/job/libosinfo-check/systems=libvirt-freebsd-10/ws/bui…'> gmake[1]: Nothing to be done for 'check'. gmake[1]: Leaving directory '/usr<https://ci.centos.org/job/libosinfo-check/systems=libvirt-freebsd-10/ws/bui…'> Making check in tests gmake[1]: Entering directory '/usr<https://ci.centos.org/job/libosinfo-check/systems=libvirt-freebsd-10/ws/bui…'> /usr/local/bin/gmake test-entity test-device test-list test-devicelist test-filter test-product test-os test-oslist test-productfilter test-platform test-platformlist test-db test-loader test-isodetect test-install-script test-os-resources test-mediauris test-treeuris gmake[2]: Entering directory '/usr<https://ci.centos.org/job/libosinfo-check/systems=libvirt-freebsd-10/ws/bui…'> CC test_entity-test-entity.o CC test_device-test-device.o CC test_list-test-list.o CC test_devicelist-test-devicelist.o CC test_filter-test-filter.o CC test_product-test-product.o CC test_os-test-os.o CC test_oslist-test-oslist.o CC test_productfilter-test-productfilter.o CC test_platform-test-platform.o CC test_platformlist-test-platformlist.o CC test_db-test-db.o CC test_loader-test-loader.o CC test_isodetect-test-isodetect.o CC test_install_script-test-install-script.o CC test_os_resources-test-os-resources.o CC test_mediauris-test-mediauris.o CC test_treeuris-test-treeuris.o CCLD test-entity CCLD test-device CCLD test-list CCLD test-devicelist CCLD test-filter CCLD test-product CCLD test-os CCLD test-oslist CCLD test-productfilter CCLD test-platform CCLD test-platformlist CCLD test-db CCLD test-loader CCLD test-isodetect CCLD test-install-script CCLD test-os-resources CCLD test-mediauris CCLD test-treeuris gmake[2]: Leaving directory '/usr<https://ci.centos.org/job/libosinfo-check/systems=libvirt-freebsd-10/ws/bui…'> /usr/local/bin/gmake check-TESTS gmake[2]: Entering directory '/usr<https://ci.centos.org/job/libosinfo-check/systems=libvirt-freebsd-10/ws/bui…'> gmake[3]: Entering directory '/usr<https://ci.centos.org/job/libosinfo-check/systems=libvirt-freebsd-10/ws/bui…'> PASS: test-list PASS: test-entity PASS: test-device PASS: test-devicelist PASS: test-product PASS: test-filter PASS: test-os PASS: test-oslist PASS: test-productfilter PASS: test-platform PASS: test-platformlist PASS: test-db PASS: test-install-script PASS: test-loader PASS: test-os-resources PASS: test-treeuris Abort trap (core dumped) FAIL: test-isodetect Abort trap (core dumped) FAIL: test-mediauris ============================================================================ Testsuite summary for libosinfo 1.3.0 ============================================================================ # TOTAL: 18 # PASS: 16 # SKIP: 0 # XFAIL: 0 # FAIL: 2 # XPASS: 0 # ERROR: 0 ============================================================================ See tests/test-suite.log Please report to libosinfo(a)redhat.com ============================================================================ gmake[3]: *** [Makefile:1313: test-suite.log] Error 1 gmake[3]: Leaving directory '/usr<https://ci.centos.org/job/libosinfo-check/systems=libvirt-freebsd-10/ws/bui…'> gmake[2]: *** [Makefile:1421: check-TESTS] Error 2 gmake[2]: Leaving directory '/usr<https://ci.centos.org/job/libosinfo-check/systems=libvirt-freebsd-10/ws/bui…'> gmake[1]: *** [Makefile:1614: check-am] Error 2 gmake[1]: Leaving directory '/usr<https://ci.centos.org/job/libosinfo-check/systems=libvirt-freebsd-10/ws/bui…'> gmake: *** [Makefile:594: check-recursive] Error 1 + cat tests/test-suite.log =========================================== libosinfo 1.3.0: tests/test-suite.log =========================================== # TOTAL: 18 # PASS: 16 # SKIP: 0 # XFAIL: 0 # FAIL: 2 # XPASS: 0 # ERROR: 0 .. contents:: :depth: 2 FAIL: test-isodetect ==================== /isodetect/windows: OK /isodetect/ubuntu: OK /isodetect/sles: OK /isodetect/sled: OK /isodetect/rhel: OK /isodetect/popos: OK /isodetect/opensuse: OK /isodetect/openbsd: OK /isodetect/netbsd: OK /isodetect/mageia: OK /isodetect/gnome: OK /isodetect/freedos: OK /isodetect/freebsd: OK /isodetect/fedora: ** ERROR:../../tests/test-isodetect.c:408:test_one: assertion failed (shortid == info->shortid): ("fedora-unknown" == "fedora29") FAIL test-isodetect (exit status: 134) FAIL: test-mediauris ==================== /mediauris/uris: ** ERROR:../../tests/test-mediauris.c:50:test_media: assertion failed (res == CURLE_OK): (28 == 0) FAIL test-mediauris (exit status: 134) + exit 1 Build step 'Execute shell' marked build as failure
1 3
0 0
[Libvirt-ci] Build failed in Jenkins: libosinfo-check » libvirt-fedora-28 #17
by ci@centos.org 11 Oct '18

11 Oct '18
See <https://ci.centos.org/job/libosinfo-check/systems=libvirt-fedora-28/17/disp…> ------------------------------------------ Started by upstream project "libosinfo-check" build number 17 originally caused by: Started by upstream project "libosinfo-syntax-check" build number 17 originally caused by: Started by upstream project "libosinfo-build" build number 17 originally caused by: Started by upstream project "osinfo-db-build" build number 12 originally caused by: Started by an SCM change [EnvInject] - Loading node environment variables. Building remotely on libvirt-fedora-28 (libvirt) in workspace <https://ci.centos.org/job/libosinfo-check/systems=libvirt-fedora-28/ws/> [libosinfo] $ /bin/sh -xe /tmp/jenkins2332395049901756846.sh + export LIBOSINFO_NETWORK_TESTS=1 + LIBOSINFO_NETWORK_TESTS=1 + cd build + /usr/bin/gmake check GEN public-submodule-commit Making check in osinfo gmake[1]: Entering directory '<https://ci.centos.org/job/libosinfo-check/systems=libvirt-fedora-28/ws/buil…'> /usr/bin/gmake check-am gmake[2]: Entering directory '<https://ci.centos.org/job/libosinfo-check/systems=libvirt-fedora-28/ws/buil…'> /usr/bin/gmake check-local gmake[3]: Entering directory '<https://ci.centos.org/job/libosinfo-check/systems=libvirt-fedora-28/ws/buil…'> GEN check-symfile GEN check-symsorting gmake[3]: Leaving directory '<https://ci.centos.org/job/libosinfo-check/systems=libvirt-fedora-28/ws/buil…'> gmake[2]: Leaving directory '<https://ci.centos.org/job/libosinfo-check/systems=libvirt-fedora-28/ws/buil…'> gmake[1]: Leaving directory '<https://ci.centos.org/job/libosinfo-check/systems=libvirt-fedora-28/ws/buil…'> Making check in tools gmake[1]: Entering directory '<https://ci.centos.org/job/libosinfo-check/systems=libvirt-fedora-28/ws/buil…'> gmake[1]: Nothing to be done for 'check'. gmake[1]: Leaving directory '<https://ci.centos.org/job/libosinfo-check/systems=libvirt-fedora-28/ws/buil…'> Making check in docs gmake[1]: Entering directory '<https://ci.centos.org/job/libosinfo-check/systems=libvirt-fedora-28/ws/buil…'> Making check in reference gmake[2]: Entering directory '<https://ci.centos.org/job/libosinfo-check/systems=libvirt-fedora-28/ws/buil…'> gmake[2]: Nothing to be done for 'check'. gmake[2]: Leaving directory '<https://ci.centos.org/job/libosinfo-check/systems=libvirt-fedora-28/ws/buil…'> gmake[2]: Entering directory '<https://ci.centos.org/job/libosinfo-check/systems=libvirt-fedora-28/ws/buil…'> gmake[2]: Nothing to be done for 'check-am'. gmake[2]: Leaving directory '<https://ci.centos.org/job/libosinfo-check/systems=libvirt-fedora-28/ws/buil…'> gmake[1]: Leaving directory '<https://ci.centos.org/job/libosinfo-check/systems=libvirt-fedora-28/ws/buil…'> Making check in po gmake[1]: Entering directory '<https://ci.centos.org/job/libosinfo-check/systems=libvirt-fedora-28/ws/buil…'> INTLTOOL_EXTRACT="/usr/bin/intltool-extract" XGETTEXT="/usr/bin/xgettext" srcdir=../../po /usr/bin/intltool-update --gettext-package libosinfo --pot rm -f missing notexist srcdir=../../po /usr/bin/intltool-update -m if [ -r missing -o -r notexist ]; then \ exit 1; \ fi gmake[1]: Leaving directory '<https://ci.centos.org/job/libosinfo-check/systems=libvirt-fedora-28/ws/buil…'> Making check in examples gmake[1]: Entering directory '<https://ci.centos.org/job/libosinfo-check/systems=libvirt-fedora-28/ws/buil…'> gmake[1]: Nothing to be done for 'check'. gmake[1]: Leaving directory '<https://ci.centos.org/job/libosinfo-check/systems=libvirt-fedora-28/ws/buil…'> Making check in tests gmake[1]: Entering directory '<https://ci.centos.org/job/libosinfo-check/systems=libvirt-fedora-28/ws/buil…'> /usr/bin/gmake test-entity test-device test-list test-devicelist test-filter test-product test-os test-oslist test-productfilter test-platform test-platformlist test-db test-loader test-isodetect test-install-script test-os-resources test-mediauris test-treeuris gmake[2]: Entering directory '<https://ci.centos.org/job/libosinfo-check/systems=libvirt-fedora-28/ws/buil…'> CC test_entity-test-entity.o CC test_device-test-device.o CC test_list-test-list.o CC test_devicelist-test-devicelist.o CC test_filter-test-filter.o CC test_product-test-product.o CC test_os-test-os.o CC test_oslist-test-oslist.o CC test_productfilter-test-productfilter.o CC test_platform-test-platform.o CC test_platformlist-test-platformlist.o CC test_db-test-db.o CC test_loader-test-loader.o CC test_isodetect-test-isodetect.o CC test_install_script-test-install-script.o CC test_os_resources-test-os-resources.o CC test_mediauris-test-mediauris.o CC test_treeuris-test-treeuris.o CCLD test-entity CCLD test-device CCLD test-list CCLD test-devicelist CCLD test-filter CCLD test-product CCLD test-os CCLD test-oslist CCLD test-productfilter CCLD test-platform CCLD test-platformlist CCLD test-db CCLD test-loader CCLD test-isodetect CCLD test-install-script CCLD test-os-resources CCLD test-mediauris CCLD test-treeuris gmake[2]: Leaving directory '<https://ci.centos.org/job/libosinfo-check/systems=libvirt-fedora-28/ws/buil…'> /usr/bin/gmake check-TESTS gmake[2]: Entering directory '<https://ci.centos.org/job/libosinfo-check/systems=libvirt-fedora-28/ws/buil…'> gmake[3]: Entering directory '<https://ci.centos.org/job/libosinfo-check/systems=libvirt-fedora-28/ws/buil…'> PASS: test-device PASS: test-entity PASS: test-list PASS: test-devicelist PASS: test-filter PASS: test-product PASS: test-os PASS: test-oslist PASS: test-platform PASS: test-productfilter PASS: test-platformlist PASS: test-db PASS: test-install-script PASS: test-loader PASS: test-os-resources PASS: test-treeuris PASS: test-isodetect ../../build-aux/test-driver: line 107: 12748 Aborted (core dumped) "$@" > $log_file 2>&1 FAIL: test-mediauris ============================================================================ Testsuite summary for libosinfo 1.3.0 ============================================================================ # TOTAL: 18 # PASS: 17 # SKIP: 0 # XFAIL: 0 # FAIL: 1 # XPASS: 0 # ERROR: 0 ============================================================================ See tests/test-suite.log Please report to libosinfo(a)redhat.com ============================================================================ gmake[3]: *** [Makefile:1289: test-suite.log] Error 1 gmake[3]: Leaving directory '<https://ci.centos.org/job/libosinfo-check/systems=libvirt-fedora-28/ws/buil…'> gmake[2]: *** [Makefile:1397: check-TESTS] Error 2 gmake[2]: Leaving directory '<https://ci.centos.org/job/libosinfo-check/systems=libvirt-fedora-28/ws/buil…'> gmake[1]: *** [Makefile:1587: check-am] Error 2 gmake[1]: Leaving directory '<https://ci.centos.org/job/libosinfo-check/systems=libvirt-fedora-28/ws/buil…'> gmake: *** [Makefile:594: check-recursive] Error 1 + cat tests/test-suite.log =========================================== libosinfo 1.3.0: tests/test-suite.log =========================================== # TOTAL: 18 # PASS: 17 # SKIP: 0 # XFAIL: 0 # FAIL: 1 # XPASS: 0 # ERROR: 0 .. contents:: :depth: 2 FAIL: test-mediauris ==================== /mediauris/uris: ** ERROR:../../tests/test-mediauris.c:50:test_media: assertion failed (res == CURLE_OK): (7 == 0) FAIL test-mediauris (exit status: 134) + exit 1 Build step 'Execute shell' marked build as failure
1 6
0 0
[Libvirt-ci] Build failed in Jenkins: libosinfo-check » libvirt-freebsd-11 #21
by ci@centos.org 11 Oct '18

11 Oct '18
See <https://ci.centos.org/job/libosinfo-check/systems=libvirt-freebsd-11/21/dis…> ------------------------------------------ Started by upstream project "libosinfo-check" build number 21 originally caused by: Started by upstream project "libosinfo-syntax-check" build number 21 originally caused by: Started by upstream project "libosinfo-build" build number 21 originally caused by: Started by an SCM change [EnvInject] - Loading node environment variables. Building remotely on libvirt-freebsd-11 (libvirt) in workspace <https://ci.centos.org/job/libosinfo-check/systems=libvirt-freebsd-11/ws/> [libosinfo] $ /bin/sh -xe /tmp/jenkins35859634826480572.sh + export 'LIBOSINFO_NETWORK_TESTS=1' + cd build + /usr/local/bin/gmake check Making check in osinfo GEN public-submodule-commit gmake[1]: Entering directory '/usr<https://ci.centos.org/job/libosinfo-check/systems=libvirt-freebsd-11/ws/bui…'> /usr/local/bin/gmake check-am gmake[2]: Entering directory '/usr<https://ci.centos.org/job/libosinfo-check/systems=libvirt-freebsd-11/ws/bui…'> /usr/local/bin/gmake check-local gmake[3]: Entering directory '/usr<https://ci.centos.org/job/libosinfo-check/systems=libvirt-freebsd-11/ws/bui…'> GEN check-symsorting gmake[3]: Leaving directory '/usr<https://ci.centos.org/job/libosinfo-check/systems=libvirt-freebsd-11/ws/bui…'> gmake[2]: Leaving directory '/usr<https://ci.centos.org/job/libosinfo-check/systems=libvirt-freebsd-11/ws/bui…'> gmake[1]: Leaving directory '/usr<https://ci.centos.org/job/libosinfo-check/systems=libvirt-freebsd-11/ws/bui…'> Making check in tools gmake[1]: Entering directory '/usr<https://ci.centos.org/job/libosinfo-check/systems=libvirt-freebsd-11/ws/bui…'> gmake[1]: Nothing to be done for 'check'. gmake[1]: Leaving directory '/usr<https://ci.centos.org/job/libosinfo-check/systems=libvirt-freebsd-11/ws/bui…'> Making check in docs gmake[1]: Entering directory '/usr<https://ci.centos.org/job/libosinfo-check/systems=libvirt-freebsd-11/ws/bui…'> Making check in reference gmake[2]: Entering directory '/usr<https://ci.centos.org/job/libosinfo-check/systems=libvirt-freebsd-11/ws/bui…'> gmake[2]: Nothing to be done for 'check'. gmake[2]: Leaving directory '/usr<https://ci.centos.org/job/libosinfo-check/systems=libvirt-freebsd-11/ws/bui…'> gmake[2]: Entering directory '/usr<https://ci.centos.org/job/libosinfo-check/systems=libvirt-freebsd-11/ws/bui…'> gmake[2]: Nothing to be done for 'check-am'. gmake[2]: Leaving directory '/usr<https://ci.centos.org/job/libosinfo-check/systems=libvirt-freebsd-11/ws/bui…'> gmake[1]: Leaving directory '/usr<https://ci.centos.org/job/libosinfo-check/systems=libvirt-freebsd-11/ws/bui…'> Making check in po gmake[1]: Entering directory '/usr<https://ci.centos.org/job/libosinfo-check/systems=libvirt-freebsd-11/ws/bui…'> INTLTOOL_EXTRACT="/usr/local/bin/intltool-extract" XGETTEXT="/usr/local/bin/xgettext" srcdir=../../po /usr/local/bin/intltool-update --gettext-package libosinfo --pot rm -f missing notexist srcdir=../../po /usr/local/bin/intltool-update -m if [ -r missing -o -r notexist ]; then \ exit 1; \ fi gmake[1]: Leaving directory '/usr<https://ci.centos.org/job/libosinfo-check/systems=libvirt-freebsd-11/ws/bui…'> Making check in examples gmake[1]: Entering directory '/usr<https://ci.centos.org/job/libosinfo-check/systems=libvirt-freebsd-11/ws/bui…'> gmake[1]: Nothing to be done for 'check'. gmake[1]: Leaving directory '/usr<https://ci.centos.org/job/libosinfo-check/systems=libvirt-freebsd-11/ws/bui…'> Making check in tests gmake[1]: Entering directory '/usr<https://ci.centos.org/job/libosinfo-check/systems=libvirt-freebsd-11/ws/bui…'> /usr/local/bin/gmake test-entity test-device test-list test-devicelist test-filter test-product test-os test-oslist test-productfilter test-platform test-platformlist test-db test-loader test-isodetect test-install-script test-os-resources test-mediauris test-treeuris gmake[2]: Entering directory '/usr<https://ci.centos.org/job/libosinfo-check/systems=libvirt-freebsd-11/ws/bui…'> CC test_entity-test-entity.o CC test_device-test-device.o CC test_list-test-list.o CC test_devicelist-test-devicelist.o CC test_filter-test-filter.o CC test_product-test-product.o CC test_os-test-os.o CC test_oslist-test-oslist.o CC test_productfilter-test-productfilter.o CC test_platform-test-platform.o CC test_platformlist-test-platformlist.o CC test_db-test-db.o CC test_loader-test-loader.o CC test_isodetect-test-isodetect.o CC test_os_resources-test-os-resources.o CC test_install_script-test-install-script.o CC test_mediauris-test-mediauris.o CC test_treeuris-test-treeuris.o CCLD test-entity CCLD test-device CCLD test-list CCLD test-devicelist CCLD test-filter CCLD test-product CCLD test-os CCLD test-oslist CCLD test-productfilter CCLD test-platform CCLD test-platformlist CCLD test-db CCLD test-loader CCLD test-isodetect CCLD test-install-script CCLD test-os-resources CCLD test-mediauris CCLD test-treeuris gmake[2]: Leaving directory '/usr<https://ci.centos.org/job/libosinfo-check/systems=libvirt-freebsd-11/ws/bui…'> /usr/local/bin/gmake check-TESTS gmake[2]: Entering directory '/usr<https://ci.centos.org/job/libosinfo-check/systems=libvirt-freebsd-11/ws/bui…'> gmake[3]: Entering directory '/usr<https://ci.centos.org/job/libosinfo-check/systems=libvirt-freebsd-11/ws/bui…'> PASS: test-entity PASS: test-device PASS: test-list PASS: test-filter PASS: test-devicelist PASS: test-product PASS: test-oslist PASS: test-os PASS: test-productfilter PASS: test-platform PASS: test-platformlist PASS: test-db PASS: test-install-script PASS: test-loader PASS: test-os-resources PASS: test-treeuris Abort trap (core dumped) FAIL: test-isodetect PASS: test-mediauris ============================================================================ Testsuite summary for libosinfo 1.3.0 ============================================================================ # TOTAL: 18 # PASS: 17 # SKIP: 0 # XFAIL: 0 # FAIL: 1 # XPASS: 0 # ERROR: 0 ============================================================================ See tests/test-suite.log Please report to libosinfo(a)redhat.com ============================================================================ gmake[3]: *** [Makefile:1313: test-suite.log] Error 1 gmake[3]: Leaving directory '/usr<https://ci.centos.org/job/libosinfo-check/systems=libvirt-freebsd-11/ws/bui…'> gmake[2]: *** [Makefile:1421: check-TESTS] Error 2 gmake[2]: Leaving directory '/usr<https://ci.centos.org/job/libosinfo-check/systems=libvirt-freebsd-11/ws/bui…'> gmake[1]: *** [Makefile:1614: check-am] Error 2 gmake[1]: Leaving directory '/usr<https://ci.centos.org/job/libosinfo-check/systems=libvirt-freebsd-11/ws/bui…'> gmake: *** [Makefile:594: check-recursive] Error 1 + cat tests/test-suite.log =========================================== libosinfo 1.3.0: tests/test-suite.log =========================================== # TOTAL: 18 # PASS: 17 # SKIP: 0 # XFAIL: 0 # FAIL: 1 # XPASS: 0 # ERROR: 0 .. contents:: :depth: 2 FAIL: test-isodetect ==================== /isodetect/windows: OK /isodetect/ubuntu: OK /isodetect/sles: OK /isodetect/sled: OK /isodetect/rhel: OK /isodetect/popos: OK /isodetect/opensuse: OK /isodetect/openbsd: OK /isodetect/netbsd: OK /isodetect/mageia: OK /isodetect/haiku: OK /isodetect/gnome: OK /isodetect/freedos: OK /isodetect/freebsd: OK /isodetect/fedora: ** ERROR:../../tests/test-isodetect.c:408:test_one: assertion failed (shortid == info->shortid): ("fedora-unknown" == "fedora29") FAIL test-isodetect (exit status: 134) + exit 1 Build step 'Execute shell' marked build as failure
1 2
0 0
[Libvirt-ci] Build failed in Jenkins: libosinfo-check » libvirt-debian-8 #21
by ci@centos.org 11 Oct '18

11 Oct '18
See <https://ci.centos.org/job/libosinfo-check/systems=libvirt-debian-8/21/displ…> ------------------------------------------ Started by upstream project "libosinfo-check" build number 21 originally caused by: Started by upstream project "libosinfo-syntax-check" build number 21 originally caused by: Started by upstream project "libosinfo-build" build number 21 originally caused by: Started by an SCM change [EnvInject] - Loading node environment variables. Building remotely on libvirt-debian-8 (libvirt) in workspace <https://ci.centos.org/job/libosinfo-check/systems=libvirt-debian-8/ws/> [libosinfo] $ /bin/sh -xe /tmp/jenkins811061800944388534.sh + export LIBOSINFO_NETWORK_TESTS=1 + cd build + /usr/bin/make check GEN public-submodule-commit Making check in osinfo make[1]: Entering directory '<https://ci.centos.org/job/libosinfo-check/systems=libvirt-debian-8/ws/build…'> /usr/bin/make check-am make[2]: Entering directory '<https://ci.centos.org/job/libosinfo-check/systems=libvirt-debian-8/ws/build…'> /usr/bin/make check-local make[3]: Entering directory '<https://ci.centos.org/job/libosinfo-check/systems=libvirt-debian-8/ws/build…'> GEN check-symsorting GEN check-symfile make[3]: Leaving directory '<https://ci.centos.org/job/libosinfo-check/systems=libvirt-debian-8/ws/build…'> make[2]: Leaving directory '<https://ci.centos.org/job/libosinfo-check/systems=libvirt-debian-8/ws/build…'> make[1]: Leaving directory '<https://ci.centos.org/job/libosinfo-check/systems=libvirt-debian-8/ws/build…'> Making check in tools make[1]: Entering directory '<https://ci.centos.org/job/libosinfo-check/systems=libvirt-debian-8/ws/build…'> make[1]: Nothing to be done for 'check'. make[1]: Leaving directory '<https://ci.centos.org/job/libosinfo-check/systems=libvirt-debian-8/ws/build…'> Making check in docs make[1]: Entering directory '<https://ci.centos.org/job/libosinfo-check/systems=libvirt-debian-8/ws/build…'> Making check in reference make[2]: Entering directory '<https://ci.centos.org/job/libosinfo-check/systems=libvirt-debian-8/ws/build…'> make[2]: Nothing to be done for 'check'. make[2]: Leaving directory '<https://ci.centos.org/job/libosinfo-check/systems=libvirt-debian-8/ws/build…'> make[2]: Entering directory '<https://ci.centos.org/job/libosinfo-check/systems=libvirt-debian-8/ws/build…'> make[2]: Nothing to be done for 'check-am'. make[2]: Leaving directory '<https://ci.centos.org/job/libosinfo-check/systems=libvirt-debian-8/ws/build…'> make[1]: Leaving directory '<https://ci.centos.org/job/libosinfo-check/systems=libvirt-debian-8/ws/build…'> Making check in po make[1]: Entering directory '<https://ci.centos.org/job/libosinfo-check/systems=libvirt-debian-8/ws/build…'> INTLTOOL_EXTRACT="/usr/bin/intltool-extract" XGETTEXT="/usr/bin/xgettext" srcdir=../../po /usr/bin/intltool-update --gettext-package libosinfo --pot rm -f missing notexist srcdir=../../po /usr/bin/intltool-update -m if [ -r missing -o -r notexist ]; then \ exit 1; \ fi make[1]: Leaving directory '<https://ci.centos.org/job/libosinfo-check/systems=libvirt-debian-8/ws/build…'> Making check in examples make[1]: Entering directory '<https://ci.centos.org/job/libosinfo-check/systems=libvirt-debian-8/ws/build…'> make[1]: Nothing to be done for 'check'. make[1]: Leaving directory '<https://ci.centos.org/job/libosinfo-check/systems=libvirt-debian-8/ws/build…'> Making check in tests make[1]: Entering directory '<https://ci.centos.org/job/libosinfo-check/systems=libvirt-debian-8/ws/build…'> /usr/bin/make test-entity test-device test-list test-devicelist test-filter test-product test-os test-oslist test-productfilter test-platform test-platformlist test-db test-loader test-isodetect test-install-script test-os-resources test-mediauris test-treeuris make[2]: Entering directory '<https://ci.centos.org/job/libosinfo-check/systems=libvirt-debian-8/ws/build…'> CC test_device-test-device.o CC test_entity-test-entity.o CC test_list-test-list.o CC test_devicelist-test-devicelist.o CC test_filter-test-filter.o CC test_product-test-product.o CC test_os-test-os.o CC test_oslist-test-oslist.o CC test_productfilter-test-productfilter.o CC test_platform-test-platform.o CC test_platformlist-test-platformlist.o CC test_db-test-db.o CC test_isodetect-test-isodetect.o CC test_loader-test-loader.o CC test_install_script-test-install-script.o CC test_os_resources-test-os-resources.o CC test_mediauris-test-mediauris.o CC test_treeuris-test-treeuris.o CCLD test-entity CCLD test-list CCLD test-device CCLD test-devicelist CCLD test-filter CCLD test-product CCLD test-os CCLD test-oslist CCLD test-productfilter CCLD test-platform CCLD test-platformlist CCLD test-db CCLD test-loader CCLD test-isodetect CCLD test-install-script CCLD test-os-resources CCLD test-mediauris CCLD test-treeuris make[2]: Leaving directory '<https://ci.centos.org/job/libosinfo-check/systems=libvirt-debian-8/ws/build…'> /usr/bin/make check-TESTS make[2]: Entering directory '<https://ci.centos.org/job/libosinfo-check/systems=libvirt-debian-8/ws/build…'> make[3]: Entering directory '<https://ci.centos.org/job/libosinfo-check/systems=libvirt-debian-8/ws/build…'> PASS: test-list PASS: test-entity PASS: test-device PASS: test-devicelist PASS: test-filter PASS: test-product PASS: test-oslist PASS: test-os PASS: test-productfilter PASS: test-platformlist PASS: test-platform PASS: test-db PASS: test-install-script PASS: test-loader PASS: test-os-resources PASS: test-treeuris ../../build-aux/test-driver: line 107: 3600 Aborted "$@" > $log_file 2>&1 FAIL: test-isodetect PASS: test-mediauris make[4]: Entering directory '<https://ci.centos.org/job/libosinfo-check/systems=libvirt-debian-8/ws/build…'> make[4]: Nothing to be done for 'all'. make[4]: Leaving directory '<https://ci.centos.org/job/libosinfo-check/systems=libvirt-debian-8/ws/build…'> ============================================================================ Testsuite summary for libosinfo 1.3.0 ============================================================================ # TOTAL: 18 # PASS: 17 # SKIP: 0 # XFAIL: 0 # FAIL: 1 # XPASS: 0 # ERROR: 0 ============================================================================ See tests/test-suite.log Please report to libosinfo(a)redhat.com ============================================================================ Makefile:1278: recipe for target 'test-suite.log' failed make[3]: *** [test-suite.log] Error 1 make[3]: Leaving directory '<https://ci.centos.org/job/libosinfo-check/systems=libvirt-debian-8/ws/build…'> Makefile:1384: recipe for target 'check-TESTS' failed make[2]: *** [check-TESTS] Error 2 make[2]: Leaving directory '<https://ci.centos.org/job/libosinfo-check/systems=libvirt-debian-8/ws/build…'> Makefile:1576: recipe for target 'check-am' failed make[1]: *** [check-am] Error 2 make[1]: Leaving directory '<https://ci.centos.org/job/libosinfo-check/systems=libvirt-debian-8/ws/build…'> Makefile:584: recipe for target 'check-recursive' failed make: *** [check-recursive] Error 1 + cat tests/test-suite.log =========================================== libosinfo 1.3.0: tests/test-suite.log =========================================== # TOTAL: 18 # PASS: 17 # SKIP: 0 # XFAIL: 0 # FAIL: 1 # XPASS: 0 # ERROR: 0 .. contents:: :depth: 2 FAIL: test-isodetect ==================== /isodetect/haiku: OK /isodetect/dragonflybsd: OK /isodetect/windows: OK /isodetect/ubuntu: OK /isodetect/sles: OK /isodetect/sled: OK /isodetect/rhel: OK /isodetect/popos: OK /isodetect/opensuse: OK /isodetect/openbsd: OK /isodetect/netbsd: OK /isodetect/mageia: OK /isodetect/gnome: OK /isodetect/freedos: OK /isodetect/freebsd: OK /isodetect/fedora: ** ERROR:../../tests/test-isodetect.c:408:test_one: assertion failed (shortid == info->shortid): ("fedora-unknown" == "fedora29") + exit 1 Build step 'Execute shell' marked build as failure
1 2
0 0
[Libvirt-ci] Build failed in Jenkins: libvirt-check » libvirt-freebsd-10 #63
by ci@centos.org 11 Oct '18

11 Oct '18
See <https://ci.centos.org/job/libvirt-check/systems=libvirt-freebsd-10/63/displ…> ------------------------------------------ [...truncated 46.45 KB...] # PASS: 0 # SKIP: 0 # XFAIL: 0 # FAIL: 0 # XPASS: 0 # ERROR: 0 ============================================================================ gmake[5]: Leaving directory '/usr<https://ci.centos.org/job/libvirt-check/systems=libvirt-freebsd-10/ws/build…'> gmake[4]: Leaving directory '/usr<https://ci.centos.org/job/libvirt-check/systems=libvirt-freebsd-10/ws/build…'> gmake[3]: Leaving directory '/usr<https://ci.centos.org/job/libvirt-check/systems=libvirt-freebsd-10/ws/build…'> gmake[2]: Leaving directory '/usr<https://ci.centos.org/job/libvirt-check/systems=libvirt-freebsd-10/ws/build…'> gmake[1]: Leaving directory '/usr<https://ci.centos.org/job/libvirt-check/systems=libvirt-freebsd-10/ws/build…'> Making check in tests gmake[1]: Entering directory '/usr<https://ci.centos.org/job/libvirt-check/systems=libvirt-freebsd-10/ws/build…'> /usr/local/bin/gmake gmake[2]: Entering directory '/usr<https://ci.centos.org/job/libvirt-check/systems=libvirt-freebsd-10/ws/build…'> gmake[2]: Nothing to be done for 'all'. gmake[2]: Leaving directory '/usr<https://ci.centos.org/job/libvirt-check/systems=libvirt-freebsd-10/ws/build…'> /usr/local/bin/gmake check-TESTS gmake[2]: Entering directory '/usr<https://ci.centos.org/job/libvirt-check/systems=libvirt-freebsd-10/ws/build…'> gmake[3]: Entering directory '/usr<https://ci.centos.org/job/libvirt-check/systems=libvirt-freebsd-10/ws/build…'> PASS: sockettest SKIP: virhostcputest PASS: virbuftest PASS: seclabeltest PASS: virhashtest PASS: virconftest PASS: commandtest PASS: utiltest SKIP: shunloadtest PASS: virtimetest PASS: viruritest PASS: virkeyfiletest PASS: viralloctest PASS: virauthconfigtest PASS: virbitmaptest SKIP: vircgrouptest PASS: vircryptotest SKIP: virpcitest PASS: virendiantest PASS: viratomictest PASS: virfilecachetest FAIL: virfiletest PASS: viriscsitest SKIP: virfirewalltest PASS: virkeycodetest PASS: virlockspacetest PASS: virrotatingfiletest PASS: virlogtest PASS: virstringtest SKIP: virportallocatortest PASS: sysinfotest SKIP: virkmodtest PASS: vircapstest PASS: domaincapstest PASS: domainconftest SKIP: virhostdevtest SKIP: virnetdevtest PASS: virtypedparamtest PASS: vshtabletest PASS: virnetmessagetest PASS: virnetsockettest PASS: virnetdaemontest PASS: virnetserverclienttest SKIP: virnettlscontexttest SKIP: virnettlssessiontest PASS: fdstreamtest PASS: virdbustest SKIP: virsystemdtest PASS: virpolkittest PASS: qemuxml2argvtest PASS: qemuxml2xmltest PASS: virschematest PASS: qemuargv2xmltest PASS: domainsnapshotxml2xmltest PASS: qemumonitorjsontest PASS: qemuagenttest PASS: qemuhotplugtest PASS: qemucaps2xmltest PASS: qemumemlocktest PASS: qemucommandutiltest PASS: qemublocktest PASS: qemumigparamstest PASS: esxutilstest PASS: vboxsnapshotxmltest PASS: qemucapabilitiestest PASS: vmx2xmltest PASS: vmwarevertest PASS: xml2vmxtest PASS: bhyvexml2argvtest PASS: bhyvexml2xmltest PASS: virjsontest PASS: networkxml2xmltest PASS: bhyveargv2xmltest PASS: networkxml2xmlupdatetest PASS: networkxml2conftest SKIP: networkxml2firewalltest PASS: virnwfilterbindingxml2xmltest PASS: nwfilterxml2xmltest PASS: storagevolxml2argvtest PASS: virstorageutiltest PASS: nssguesttest PASS: nsstest PASS: storagepoolxml2xmltest PASS: storagevolxml2xmltest PASS: nodedevxml2xmltest PASS: interfacexml2xmltest PASS: metadatatest PASS: secretxml2xmltest PASS: genericxml2xmltest PASS: eventtest PASS: virdrivermoduletest PASS: objecteventtest PASS: virmacmaptest PASS: libvirtd-fail PASS: libvirtd-pool PASS: virsh-cpuset PASS: virsh-define-dev-segfault PASS: virsh-int-overflow SKIP: virsh-optparse PASS: virsh-read-bufsiz PASS: virsh-read-non-seekable PASS: virsh-schedinfo PASS: cputest PASS: virsh-self-test PASS: virt-admin-self-test PASS: virsh-start PASS: virsh-undefine PASS: virsh-vcpupin PASS: virsh-uriprecedence PASS: virshtest ============================================================================ Testsuite summary for libvirt 4.9.0 ============================================================================ # TOTAL: 110 # PASS: 95 # SKIP: 14 # XFAIL: 0 # FAIL: 1 # XPASS: 0 # ERROR: 0 ============================================================================ See tests/test-suite.log Please report to libvir-list(a)redhat.com ============================================================================ gmake[3]: *** [Makefile:5864: test-suite.log] Error 1 gmake[3]: Leaving directory '/usr<https://ci.centos.org/job/libvirt-check/systems=libvirt-freebsd-10/ws/build…'> gmake[2]: *** [Makefile:5972: check-TESTS] Error 2 gmake[2]: Leaving directory '/usr<https://ci.centos.org/job/libvirt-check/systems=libvirt-freebsd-10/ws/build…'> gmake[1]: *** [Makefile:6977: check-am] Error 2 gmake[1]: Leaving directory '/usr<https://ci.centos.org/job/libvirt-check/systems=libvirt-freebsd-10/ws/build…'> gmake: *** [Makefile:2111: check-recursive] Error 1 + cat tests/test-suite.log ========================================= libvirt 4.9.0: tests/test-suite.log ========================================= # TOTAL: 110 # PASS: 95 # SKIP: 14 # XFAIL: 0 # FAIL: 1 # XPASS: 0 # ERROR: 0 .. contents:: :depth: 2 SKIP: virhostcputest ==================== SKIP virhostcputest (exit status: 77) SKIP: shunloadtest ================== SKIP shunloadtest (exit status: 77) SKIP: vircgrouptest =================== SKIP vircgrouptest (exit status: 77) SKIP: virpcitest ================ SKIP virpcitest (exit status: 77) FAIL: virfiletest ================= /usr<https://ci.centos.org/job/libvirt-check/systems=libvirt-freebsd-10/ws/build…>: No such file or directory FAIL virfiletest (exit status: 1) SKIP: virfirewalltest ===================== SKIP virfirewalltest (exit status: 77) SKIP: virportallocatortest ========================== SKIP virportallocatortest (exit status: 77) SKIP: virkmodtest ================= SKIP virkmodtest (exit status: 77) SKIP: virhostdevtest ==================== SKIP virhostdevtest (exit status: 77) SKIP: virnetdevtest =================== SKIP virnetdevtest (exit status: 77) SKIP: virnettlscontexttest ========================== SKIP virnettlscontexttest (exit status: 77) SKIP: virnettlssessiontest ========================== SKIP virnettlssessiontest (exit status: 77) SKIP: virsystemdtest ==================== SKIP virsystemdtest (exit status: 77) SKIP: networkxml2firewalltest ============================= SKIP networkxml2firewalltest (exit status: 77) SKIP: virsh-optparse ==================== ../../tests/virsh-optparse: skipping test: This test is very expensive, so it is disabled by default. To run it anyway, rerun: make check VIR_TEST_EXPENSIVE=1 SKIP virsh-optparse (exit status: 77) + exit 1 Build step 'Execute shell' marked build as failure
1 1
0 0
[Libvirt-ci] Build failed in Jenkins: libvirt-check » libvirt-freebsd-11 #63
by ci@centos.org 11 Oct '18

11 Oct '18
See <https://ci.centos.org/job/libvirt-check/systems=libvirt-freebsd-11/63/displ…> ------------------------------------------ [...truncated 22.62 KB...] # PASS: 0 # SKIP: 0 # XFAIL: 0 # FAIL: 0 # XPASS: 0 # ERROR: 0 ============================================================================ gmake[5]: Leaving directory '/usr<https://ci.centos.org/job/libvirt-check/systems=libvirt-freebsd-11/ws/build…'> gmake[4]: Leaving directory '/usr<https://ci.centos.org/job/libvirt-check/systems=libvirt-freebsd-11/ws/build…'> gmake[3]: Leaving directory '/usr<https://ci.centos.org/job/libvirt-check/systems=libvirt-freebsd-11/ws/build…'> gmake[2]: Leaving directory '/usr<https://ci.centos.org/job/libvirt-check/systems=libvirt-freebsd-11/ws/build…'> gmake[1]: Leaving directory '/usr<https://ci.centos.org/job/libvirt-check/systems=libvirt-freebsd-11/ws/build…'> Making check in tests gmake[1]: Entering directory '/usr<https://ci.centos.org/job/libvirt-check/systems=libvirt-freebsd-11/ws/build…'> /usr/local/bin/gmake gmake[2]: Entering directory '/usr<https://ci.centos.org/job/libvirt-check/systems=libvirt-freebsd-11/ws/build…'> gmake[2]: Nothing to be done for 'all'. gmake[2]: Leaving directory '/usr<https://ci.centos.org/job/libvirt-check/systems=libvirt-freebsd-11/ws/build…'> /usr/local/bin/gmake check-TESTS gmake[2]: Entering directory '/usr<https://ci.centos.org/job/libvirt-check/systems=libvirt-freebsd-11/ws/build…'> gmake[3]: Entering directory '/usr<https://ci.centos.org/job/libvirt-check/systems=libvirt-freebsd-11/ws/build…'> PASS: sockettest SKIP: virhostcputest PASS: virbuftest PASS: seclabeltest PASS: virhashtest PASS: virconftest PASS: commandtest PASS: utiltest SKIP: shunloadtest PASS: virtimetest PASS: viruritest PASS: virkeyfiletest PASS: viralloctest PASS: viratomictest PASS: virauthconfigtest PASS: virbitmaptest PASS: vircryptotest SKIP: virpcitest SKIP: vircgrouptest PASS: virendiantest FAIL: virfiletest PASS: virfilecachetest SKIP: virfirewalltest PASS: viriscsitest PASS: virkeycodetest PASS: virlogtest PASS: virlockspacetest PASS: virrotatingfiletest PASS: virstringtest SKIP: virportallocatortest PASS: sysinfotest SKIP: virkmodtest PASS: vircapstest PASS: domaincapstest PASS: domainconftest SKIP: virhostdevtest SKIP: virnetdevtest PASS: virtypedparamtest PASS: vshtabletest PASS: virnetmessagetest PASS: virnetsockettest PASS: virnetdaemontest PASS: virnetserverclienttest SKIP: virnettlscontexttest SKIP: virnettlssessiontest PASS: fdstreamtest PASS: virdbustest SKIP: virsystemdtest PASS: virpolkittest PASS: qemuxml2argvtest PASS: qemuxml2xmltest PASS: qemuargv2xmltest PASS: domainsnapshotxml2xmltest PASS: qemumonitorjsontest PASS: virschematest PASS: qemuagenttest PASS: qemuhotplugtest PASS: qemucaps2xmltest PASS: qemumemlocktest PASS: qemucommandutiltest PASS: qemucapabilitiestest PASS: qemublocktest PASS: esxutilstest PASS: qemumigparamstest PASS: vboxsnapshotxmltest PASS: vmx2xmltest PASS: vmwarevertest PASS: xml2vmxtest PASS: bhyvexml2argvtest PASS: bhyvexml2xmltest PASS: virjsontest PASS: networkxml2xmltest PASS: bhyveargv2xmltest PASS: networkxml2conftest SKIP: networkxml2firewalltest PASS: networkxml2xmlupdatetest PASS: virnwfilterbindingxml2xmltest PASS: storagevolxml2argvtest PASS: virstorageutiltest PASS: nwfilterxml2xmltest PASS: nsstest PASS: nssguesttest PASS: storagevolxml2xmltest PASS: storagepoolxml2xmltest PASS: interfacexml2xmltest PASS: nodedevxml2xmltest PASS: metadatatest PASS: secretxml2xmltest PASS: genericxml2xmltest PASS: eventtest PASS: virdrivermoduletest PASS: objecteventtest PASS: virmacmaptest PASS: libvirtd-fail PASS: libvirtd-pool PASS: virsh-cpuset PASS: virsh-define-dev-segfault PASS: virsh-int-overflow SKIP: virsh-optparse PASS: virsh-read-bufsiz PASS: virsh-read-non-seekable PASS: virsh-schedinfo PASS: cputest PASS: virsh-self-test PASS: virt-admin-self-test PASS: virsh-start PASS: virsh-undefine PASS: virsh-vcpupin PASS: virsh-uriprecedence PASS: virshtest ============================================================================ Testsuite summary for libvirt 4.9.0 ============================================================================ # TOTAL: 110 # PASS: 95 # SKIP: 14 # XFAIL: 0 # FAIL: 1 # XPASS: 0 # ERROR: 0 ============================================================================ See tests/test-suite.log Please report to libvir-list(a)redhat.com ============================================================================ gmake[3]: *** [Makefile:5864: test-suite.log] Error 1 gmake[3]: Leaving directory '/usr<https://ci.centos.org/job/libvirt-check/systems=libvirt-freebsd-11/ws/build…'> gmake[2]: *** [Makefile:5972: check-TESTS] Error 2 gmake[2]: Leaving directory '/usr<https://ci.centos.org/job/libvirt-check/systems=libvirt-freebsd-11/ws/build…'> gmake[1]: *** [Makefile:6977: check-am] Error 2 gmake[1]: Leaving directory '/usr<https://ci.centos.org/job/libvirt-check/systems=libvirt-freebsd-11/ws/build…'> gmake: *** [Makefile:2111: check-recursive] Error 1 + cat tests/test-suite.log ========================================= libvirt 4.9.0: tests/test-suite.log ========================================= # TOTAL: 110 # PASS: 95 # SKIP: 14 # XFAIL: 0 # FAIL: 1 # XPASS: 0 # ERROR: 0 .. contents:: :depth: 2 SKIP: virhostcputest ==================== SKIP virhostcputest (exit status: 77) SKIP: shunloadtest ================== SKIP shunloadtest (exit status: 77) SKIP: vircgrouptest =================== SKIP vircgrouptest (exit status: 77) SKIP: virpcitest ================ SKIP virpcitest (exit status: 77) FAIL: virfiletest ================= /usr<https://ci.centos.org/job/libvirt-check/systems=libvirt-freebsd-11/ws/build…>: No such file or directory FAIL virfiletest (exit status: 1) SKIP: virfirewalltest ===================== SKIP virfirewalltest (exit status: 77) SKIP: virportallocatortest ========================== SKIP virportallocatortest (exit status: 77) SKIP: virkmodtest ================= SKIP virkmodtest (exit status: 77) SKIP: virhostdevtest ==================== SKIP virhostdevtest (exit status: 77) SKIP: virnetdevtest =================== SKIP virnetdevtest (exit status: 77) SKIP: virnettlscontexttest ========================== SKIP virnettlscontexttest (exit status: 77) SKIP: virnettlssessiontest ========================== SKIP virnettlssessiontest (exit status: 77) SKIP: virsystemdtest ==================== SKIP virsystemdtest (exit status: 77) SKIP: networkxml2firewalltest ============================= SKIP networkxml2firewalltest (exit status: 77) SKIP: virsh-optparse ==================== ../../tests/virsh-optparse: skipping test: This test is very expensive, so it is disabled by default. To run it anyway, rerun: make check VIR_TEST_EXPENSIVE=1 SKIP virsh-optparse (exit status: 77) + exit 1 Build step 'Execute shell' marked build as failure
1 1
0 0
[Libvirt-ci] Fixed: libvirt/libvirt#1753 (master - c570d05)
by Travis CI 11 Oct '18

11 Oct '18
Build Update for libvirt/libvirt ------------------------------------- Build: #1753 Status: Fixed Duration: 20 mins and 42 secs Commit: c570d05 (master) Author: Michal Privoznik Message: virfiletest: Load mock on Linux only The mock is built on Linux only. Therefore we should load it only on Linux too. This fixes the FreeBSD build. Signed-off-by: Michal Privoznik <mprivozn(a)redhat.com> Reviewed-by: Andrea Bolognani <abologna(a)redhat.com> View the changeset: https://github.com/libvirt/libvirt/compare/1dbf6222dd5e...c570d05175b1 View the full build log and details: https://travis-ci.org/libvirt/libvirt/builds/440085632?utm_medium=notificat… -- You can unsubscribe from build emails from the libvirt/libvirt repository going to https://travis-ci.org/account/preferences/unsubscribe?repository=4872032&ut…. Or unsubscribe from *all* email updating your settings at https://travis-ci.org/account/preferences/unsubscribe?utm_medium=notificati…. Or configure specific recipients for build notifications in your .travis.yml file. See https://docs.travis-ci.com/user/notifications.
1 0
0 0
  • ← Newer
  • 1
  • 2
  • 3
  • 4
  • 5
  • 6
  • 7
  • 8
  • 9
  • 10
  • Older →

HyperKitty Powered by HyperKitty version 1.3.12.