libvirt List Archives
Sign In Sign Up
Manage this list Sign In Sign Up

Keyboard Shortcuts

Thread View

  • j: Next unread message
  • k: Previous unread message
  • j a: Jump to all threads
  • j l: Jump to MailingList overview

CI

Thread Start a new thread
Download
Threads by month
  • ----- 2025 -----
  • August
  • July
  • June
  • May
  • April
  • March
  • February
  • January
  • ----- 2024 -----
  • December
  • November
  • October
  • September
  • August
  • July
  • June
  • May
  • April
  • March
  • February
  • January
  • ----- 2023 -----
  • December
  • November
  • October
  • September
  • August
  • July
  • June
  • May
  • April
  • March
  • February
  • January
  • ----- 2022 -----
  • December
  • November
  • October
  • September
  • August
  • July
  • June
  • May
  • April
  • March
  • February
  • January
  • ----- 2021 -----
  • December
  • November
  • October
  • September
  • August
  • July
  • June
  • May
  • April
  • March
  • February
  • January
  • ----- 2020 -----
  • December
  • November
  • October
  • September
  • August
  • July
  • June
  • May
  • April
  • March
  • February
  • January
  • ----- 2019 -----
  • December
  • November
  • October
  • September
  • August
  • July
  • June
  • May
  • April
  • March
  • February
  • January
  • ----- 2018 -----
  • December
  • November
  • October
  • September
  • August
  • July
  • June
  • May
  • April
  • March
  • February
  • January
  • ----- 2017 -----
  • December
  • November
  • October
  • September
  • August
  • July
  • June
  • May
  • April
  • March
  • February
  • January
  • ----- 2016 -----
  • December
  • November
  • October
  • September
  • August
  • July
ci@lists.libvirt.org

December 2017

  • 2 participants
  • 48 discussions
[Libvirt-ci] Errored: libvirt/libvirt#738 (v3.10.0-rc2 - 9f0ccc7)
by Travis CI 01 Dec '17

01 Dec '17
Build Update for libvirt/libvirt ------------------------------------- Build: #738 Status: Errored Duration: 4 minutes and 32 seconds Commit: 9f0ccc7 (v3.10.0-rc2) Author: John Ferlan Message: conf: Fix memory leak for distances in virDomainNumaFree Commit id '74119a03f' neglected to clean up @distances when the numa definition is cleaned up. View the changeset: https://github.com/libvirt/libvirt/compare/v3.10.0-rc2 View the full build log and details: https://travis-ci.org/libvirt/libvirt/builds/310223666?utm_source=email&utm… -- You can configure recipients for build notifications in your .travis.yml file. See https://docs.travis-ci.com/user/notifications
1 0
0 0
[Libvirt-ci] Build failed in Jenkins: libvirt-go-xml-master-check » libvirt-freebsd-11 #46
by ci@centos.org 01 Dec '17

01 Dec '17
See <https://ci.centos.org/job/libvirt-go-xml-master-check/systems=libvirt-freeb…> ------------------------------------------ Started by upstream project "libvirt-go-xml-master-check" build number 46 originally caused by: Started by upstream project "libvirt-go-xml-master-build" build number 52 originally caused by: Started by an SCM change [EnvInject] - Loading node environment variables. Building remotely on libvirt-freebsd-11 (libvirt) in workspace <https://ci.centos.org/job/libvirt-go-xml-master-check/systems=libvirt-freeb…> [libvirt-go-xml-master] $ /bin/sh -xe /tmp/jenkins5434055043149714991.sh + MAKE=make + uname + unamestr=FreeBSD + [ FreeBSD '=' FreeBSD ] + MAKE=gmake + export 'PATH=/home/jenkins/build/libvirt/bin:/home/jenkins/build/libvirt/bin:/home/jenkins/build/libvirt/bin:/home/jenkins/build/libvirt/bin:/sbin:/bin:/usr/sbin:/usr/bin:/usr/local/sbin:/usr/local/bin:/home/jenkins/bin' + export 'TEST_ARGS=-tags xmlroundtrip' + go test -tags xmlroundtrip --- FAIL: TestRoundTrip (0.42s) xml_test.go:233: exit status 128 FAIL exit status 1 FAIL _/usr<https://ci.centos.org/job/libvirt-go-xml-master-check/systems=libvirt-freeb…> 0.440s Build step 'Execute shell' marked build as failure
1 1
0 0
[Libvirt-ci] Build failed in Jenkins: libvirt-go-xml-master-check » libvirt-freebsd-10 #46
by ci@centos.org 01 Dec '17

01 Dec '17
See <https://ci.centos.org/job/libvirt-go-xml-master-check/systems=libvirt-freeb…> ------------------------------------------ Started by upstream project "libvirt-go-xml-master-check" build number 46 originally caused by: Started by upstream project "libvirt-go-xml-master-build" build number 52 originally caused by: Started by an SCM change [EnvInject] - Loading node environment variables. Building remotely on libvirt-freebsd-10 (libvirt) in workspace <https://ci.centos.org/job/libvirt-go-xml-master-check/systems=libvirt-freeb…> [libvirt-go-xml-master] $ /bin/sh -xe /tmp/jenkins8541830782752272115.sh + MAKE=make + uname + unamestr=FreeBSD + [ FreeBSD = FreeBSD ] + MAKE=gmake + export PATH=/home/jenkins/build/libvirt/bin:/home/jenkins/build/libvirt/bin:/home/jenkins/build/libvirt/bin:/home/jenkins/build/libvirt/bin:/sbin:/bin:/usr/sbin:/usr/bin:/usr/games:/usr/local/sbin:/usr/local/bin:/home/jenkins/bin + export 'TEST_ARGS=-tags xmlroundtrip' + go test -tags xmlroundtrip --- FAIL: TestRoundTrip (0.36s) xml_test.go:233: exit status 128 FAIL exit status 1 FAIL _/usr<https://ci.centos.org/job/libvirt-go-xml-master-check/systems=libvirt-freeb…> 0.384s Build step 'Execute shell' marked build as failure
1 1
0 0
[Libvirt-ci] Build failed in Jenkins: libvirt-go-xml-master-check » libvirt-debian-9 #46
by ci@centos.org 01 Dec '17

01 Dec '17
See <https://ci.centos.org/job/libvirt-go-xml-master-check/systems=libvirt-debia…> ------------------------------------------ Started by upstream project "libvirt-go-xml-master-check" build number 46 originally caused by: Started by upstream project "libvirt-go-xml-master-build" build number 52 originally caused by: Started by an SCM change [EnvInject] - Loading node environment variables. Building remotely on libvirt-debian-9 (libvirt) in workspace <https://ci.centos.org/job/libvirt-go-xml-master-check/systems=libvirt-debia…> [libvirt-go-xml-master] $ /bin/sh -xe /tmp/jenkins8429781907056247918.sh + MAKE=make + uname + unamestr=Linux + [ Linux = FreeBSD ] + export PATH=/home/jenkins/build/libvirt/bin:/home/jenkins/build/libvirt/bin:/home/jenkins/build/libvirt/bin:/home/jenkins/build/libvirt/bin:/usr/local/bin:/usr/bin:/bin:/usr/local/games:/usr/games + export TEST_ARGS=-tags xmlroundtrip + go test -tags xmlroundtrip --- FAIL: TestRoundTrip (0.29s) xml_test.go:233: exit status 128 FAIL exit status 1 FAIL _<https://ci.centos.org/job/libvirt-go-xml-master-check/systems=libvirt-debia…> 0.313s Build step 'Execute shell' marked build as failure
1 1
0 0
[Libvirt-ci] Errored: libvirt/libvirt#736 (master - 3eb8409)
by Travis CI 01 Dec '17

01 Dec '17
Build Update for libvirt/libvirt ------------------------------------- Build: #736 Status: Errored Duration: 4 minutes and 36 seconds Commit: 3eb8409 (master) Author: Michal Privoznik Message: qemuStateInitialize: Don't leak @memoryBackingPath ==899== 39 bytes in 1 blocks are definitely lost in loss record 732 of 1,003 ==899== at 0x4C2AEDF: malloc (vg_replace_malloc.c:299) ==899== by 0x8B68CE7: vasprintf (in /lib64/libc-2.25.so) ==899== by 0x55498D2: virVasprintfInternal (virstring.c:708) ==899== by 0x55499E7: virAsprintfInternal (virstring.c:729) ==899== by 0x2BECFFF0: qemuGetMemoryBackingBasePath (qemu_conf.c:1757) ==899== by 0x2BF23225: qemuStateInitialize (qemu_driver.c:893) ==899== by 0x563073D: virStateInitialize (libvirt.c:770) ==899== by 0x124CC4: daemonRunStateInit (libvirtd.c:834) ==899== by 0x55521CD: virThreadHelper (virthread.c:206) ==899== by 0x88D9686: start_thread (in /lib64/libpthread-2.25.so) ==899== by 0x8BEAEFE: clone (in /lib64/libc-2.25.so) Signed-off-by: Michal Privoznik <mprivozn(a)redhat.com> View the changeset: https://github.com/libvirt/libvirt/compare/adcc31bb89e4...3eb840904a08 View the full build log and details: https://travis-ci.org/libvirt/libvirt/builds/309958343?utm_source=email&utm… -- You can configure recipients for build notifications in your .travis.yml file. See https://docs.travis-ci.com/user/notifications
1 0
0 0
[Libvirt-ci] Errored: libvirt/libvirt#736 (master - 3eb8409)
by Travis CI 01 Dec '17

01 Dec '17
Build Update for libvirt/libvirt ------------------------------------- Build: #736 Status: Errored Duration: 4 minutes and 22 seconds Commit: 3eb8409 (master) Author: Michal Privoznik Message: qemuStateInitialize: Don't leak @memoryBackingPath ==899== 39 bytes in 1 blocks are definitely lost in loss record 732 of 1,003 ==899== at 0x4C2AEDF: malloc (vg_replace_malloc.c:299) ==899== by 0x8B68CE7: vasprintf (in /lib64/libc-2.25.so) ==899== by 0x55498D2: virVasprintfInternal (virstring.c:708) ==899== by 0x55499E7: virAsprintfInternal (virstring.c:729) ==899== by 0x2BECFFF0: qemuGetMemoryBackingBasePath (qemu_conf.c:1757) ==899== by 0x2BF23225: qemuStateInitialize (qemu_driver.c:893) ==899== by 0x563073D: virStateInitialize (libvirt.c:770) ==899== by 0x124CC4: daemonRunStateInit (libvirtd.c:834) ==899== by 0x55521CD: virThreadHelper (virthread.c:206) ==899== by 0x88D9686: start_thread (in /lib64/libpthread-2.25.so) ==899== by 0x8BEAEFE: clone (in /lib64/libc-2.25.so) Signed-off-by: Michal Privoznik <mprivozn(a)redhat.com> View the changeset: https://github.com/libvirt/libvirt/compare/adcc31bb89e4...3eb840904a08 View the full build log and details: https://travis-ci.org/libvirt/libvirt/builds/309958343?utm_source=email&utm… -- You can configure recipients for build notifications in your .travis.yml file. See https://docs.travis-ci.com/user/notifications
1 0
0 0
[Libvirt-ci] Errored: libvirt/libvirt#737 (master - 9f0ccc7)
by Travis CI 01 Dec '17

01 Dec '17
Build Update for libvirt/libvirt ------------------------------------- Build: #737 Status: Errored Duration: 22 minutes and 10 seconds Commit: 9f0ccc7 (master) Author: John Ferlan Message: conf: Fix memory leak for distances in virDomainNumaFree Commit id '74119a03f' neglected to clean up @distances when the numa definition is cleaned up. View the changeset: https://github.com/libvirt/libvirt/compare/3eb840904a08...9f0ccc717ba9 View the full build log and details: https://travis-ci.org/libvirt/libvirt/builds/309992485?utm_source=email&utm… -- You can configure recipients for build notifications in your .travis.yml file. See https://docs.travis-ci.com/user/notifications
1 0
0 0
[Libvirt-ci] Errored: libvirt/libvirt#733 (master - 65108d9)
by Travis CI 01 Dec '17

01 Dec '17
Build Update for libvirt/libvirt ------------------------------------- Build: #733 Status: Errored Duration: 4 minutes and 30 seconds Commit: 65108d9 (master) Author: Ján Tomko Message: virQEMUCapsHasPCIMultiBus: assume true if we have no version information In status XML, we do not store the QEMU version information, we only format all the capabilities. We dropped QEMU_CAPS_PCI_MULTIBUS in commit 5b783379 which was released in libvirt 3.2.0. Therefore the only way of telling if the already running domain at the time of daemon restart has been started with a QEMU that does use 'pci.0' or not on PPC is to look at the pci-root controller's alias. This is not an option if the domain has a user-specified alias for the pci-root. Instead of reintroducing the capability, assume 'pci.0' when we have no version information. That way the only left broken use case would be the combination of user aliases and very old QEMU. Partially reverts commit 3a37af1e4. https://bugzilla.redhat.com/show_bug.cgi?id=1518148 View the changeset: https://github.com/libvirt/libvirt/compare/c703913cc0b6...65108d94d093 View the full build log and details: https://travis-ci.org/libvirt/libvirt/builds/309581099?utm_source=email&utm… -- You can configure recipients for build notifications in your .travis.yml file. See https://docs.travis-ci.com/user/notifications
1 0
0 0
  • ← Newer
  • 1
  • 2
  • 3
  • 4
  • 5
  • Older →

HyperKitty Powered by HyperKitty version 1.3.12.