libvirt List Archives
Sign In Sign Up
Manage this list Sign In Sign Up

Keyboard Shortcuts

Thread View

  • j: Next unread message
  • k: Previous unread message
  • j a: Jump to all threads
  • j l: Jump to MailingList overview

CI

Thread Start a new thread
Download
Threads by month
  • ----- 2025 -----
  • August
  • July
  • June
  • May
  • April
  • March
  • February
  • January
  • ----- 2024 -----
  • December
  • November
  • October
  • September
  • August
  • July
  • June
  • May
  • April
  • March
  • February
  • January
  • ----- 2023 -----
  • December
  • November
  • October
  • September
  • August
  • July
  • June
  • May
  • April
  • March
  • February
  • January
  • ----- 2022 -----
  • December
  • November
  • October
  • September
  • August
  • July
  • June
  • May
  • April
  • March
  • February
  • January
  • ----- 2021 -----
  • December
  • November
  • October
  • September
  • August
  • July
  • June
  • May
  • April
  • March
  • February
  • January
  • ----- 2020 -----
  • December
  • November
  • October
  • September
  • August
  • July
  • June
  • May
  • April
  • March
  • February
  • January
  • ----- 2019 -----
  • December
  • November
  • October
  • September
  • August
  • July
  • June
  • May
  • April
  • March
  • February
  • January
  • ----- 2018 -----
  • December
  • November
  • October
  • September
  • August
  • July
  • June
  • May
  • April
  • March
  • February
  • January
  • ----- 2017 -----
  • December
  • November
  • October
  • September
  • August
  • July
  • June
  • May
  • April
  • March
  • February
  • January
  • ----- 2016 -----
  • December
  • November
  • October
  • September
  • August
  • July
ci@lists.libvirt.org

December 2017

  • 2 participants
  • 48 discussions
[Libvirt-ci] Build failed in Jenkins: libvirt-master-check » libvirt-fedora-rawhide #802
by ci@centos.org 14 Dec '17

14 Dec '17
See <https://ci.centos.org/job/libvirt-master-check/systems=libvirt-fedora-rawhi…> ------------------------------------------ [...truncated 175.89 KB...] 1789) Checking direct-net.xml against network.rng ... OK 1790) Checking host-bridge-net.xml against network.rng ... OK 1791) Checking isolated-network.xml against network.rng ... OK 1792) Checking passthrough-address-crash.xml against network.rng ... OK 1793) Checking hostdev.xml against network.rng ... OK 1794) Checking nat-network-dns-txt-record.xml against network.rng ... OK 1795) Checking netboot-proxy-network.xml against network.rng ... OK 1796) Checking nat-network-explicit-flood.xml against network.rng ... OK 1797) Checking empty-allow-ipv6.xml against network.rng ... OK 1798) Checking hostdev-pf.xml against network.rng ... OK 1799) Checking nat-network-dns-hosts.xml against network.rng ... OK 1800) Checking nat-network-dns-srv-records.xml against network.rng ... OK 1801) Checking dhcp6host-routed-network.xml against network.rng ... OK 1802) Checking set-mtu.xml against network.rng ... OK 1803) Checking 8021Qbh-net.xml against network.rng ... OK 1804) Checking netboot-network.xml against network.rng ... OK 1805) Checking nat-network-forward-nat-no-address.xml against network.rng ... OK 1806) Checking openvswitch-net.xml against network.rng ... OK 1807) Checking nat-network-dns-forwarders.xml against network.rng ... OK 1808) Checking nat-network-dns-srv-record-minimal.xml against network.rng ... OK 1809) Checking vepa-net.xml against network.rng ... OK 1810) Checking routed-network-no-dns.xml against network.rng ... OK 1811) Checking nat-network-dns-srv-record.xml against network.rng ... OK 1812) Checking nat-network-dns-forward-plain.xml against network.rng ... OK 1813) Checking nat-network.xml against network.rng ... OK 1814) Checking dhcp6-network.xml against network.rng ... OK 1815) Checking routed-network.xml against network.rng ... OK 1816) Checking dhcp6-nat-network.xml against network.rng ... OK 1817) Checking open-network.xml against network.rng ... OK 1818) Checking nat-network-dns-forwarder-no-resolv.xml against network.rng ... OK 1819) Checking isolated-network.xml against network.rng ... OK 1820) Checking nat-network-dns-txt-record.xml against network.rng ... OK 1821) Checking netboot-proxy-network.xml against network.rng ... OK 1822) Checking nat-network-dns-local-domain.xml against network.rng ... OK 1823) Checking nat-network-dns-hosts.xml against network.rng ... OK 1824) Checking ptr-domains-auto.xml against network.rng ... OK 1825) Checking dhcp6host-routed-network.xml against network.rng ... OK 1826) Checking netboot-network.xml against network.rng ... OK 1827) Checking nat-network-name-with-quotes.xml against network.rng ... OK 1828) Checking nat-network-dns-forwarders.xml against network.rng ... OK 1829) Checking nat-network-dns-srv-record-minimal.xml against network.rng ... OK 1830) Checking routed-network-no-dns.xml against network.rng ... OK 1831) Checking nat-network-dns-srv-record.xml against network.rng ... OK 1832) test schema grammar file: nodedev.rng ... OK 1833) Checking pci_0000_02_10_7_sriov_vfs.xml against nodedev.rng ... OK 1834) Checking pci_8086_27c5_scsi_host_0_unique_id.xml against nodedev.rng ... OK 1835) Checking pci_0000_02_10_7_sriov_zero_vfs_max_count.xml against nodedev.rng ... OK 1836) Checking net_00_15_58_2f_e9_55.xml against nodedev.rng ... OK 1837) Checking pci_8086_27c5_scsi_host_scsi_host.xml against nodedev.rng ... OK 1838) Checking net_00_13_02_b9_f9_d3.xml against nodedev.rng ... OK 1839) Checking pci_8086_0c0c_snd_hda_intel.xml against nodedev.rng ... OK 1840) Checking pci_8086_4238_pcie_wireless.xml against nodedev.rng ... OK 1841) Checking pci_8086_27c5_scsi_host.xml against nodedev.rng ... OK 1842) Checking usb_device_1d6b_1_0000_00_1d_0.xml against nodedev.rng ... OK 1843) Checking mdev_3627463d_b7f0_4fea_b468_f1da537d301b.xml against nodedev.rng ... OK 1844) Checking ccw_0_0_ffff.xml against nodedev.rng ... OK 1845) Checking computer.xml against nodedev.rng ... OK 1846) Checking pci_82579LM_network_adapter.xml against nodedev.rng ... OK 1847) Checking pci_1002_71c4.xml against nodedev.rng ... OK 1848) Checking pci_0000_02_10_7_sriov_pf_vfs_all_header_type.xml against nodedev.rng ... OK 1849) Checking scsi_target0_0_0.xml against nodedev.rng ... OK 1850) Checking pci_0000_02_10_7_sriov.xml against nodedev.rng ... OK 1851) Checking pci_0000_02_10_7_sriov_pf_vfs_all.xml against nodedev.rng ... OK 1852) Checking scsi_target1_0_0.xml against nodedev.rng ... OK 1853) Checking ccw_0_0_10000-invalid.xml against nodedev.rng ... libvirt: XML Util error : XML document failed to validate against schema: Unable to validate doc against <https://ci.centos.org/job/libvirt-master-check/systems=libvirt-fedora-rawhi…> Error validating datatype string Type int doesn't allow value '0x10000' Error validating datatype int Element devno failed to validate content Element capability failed to validate content OK 1854) Checking storage_serial_3600c0ff000d7a2a5d463ff4902000000.xml against nodedev.rng ... OK 1855) Checking pci_0000_02_10_7_mdev_types.xml against nodedev.rng ... OK 1856) Checking pci_8086_27c5_scsi_host_0.xml against nodedev.rng ... OK 1857) Checking pci_8086_10c9_sriov_pf.xml against nodedev.rng ... OK 1858) Checking drm_renderD129.xml against nodedev.rng ... OK 1859) Checking storage_serial_SATA_HTS721010G9SA00_MPCZ12Y0GNGWSE.xml against nodedev.rng ... OK 1860) Checking pci_8086_27c5_scsi_host_scsi_device_lun0.xml against nodedev.rng ... OK 1861) Checking DVD_with_media.xml against nodedev.rng ... OK 1862) Checking usb_device_1d6b_1_0000_00_1d_0_if0.xml against nodedev.rng ... OK 1863) Checking pci_0000_00_1c_0_header_type.xml against nodedev.rng ... OK 1864) Checking DVD_GCC_4247N.xml against nodedev.rng ... OK 1865) Checking pci_0000_00_02_0_header_type.xml against nodedev.rng ... OK 1866) test schema grammar file: nwfilter.rng ... OK 1867) Checking ref-rule-test.xml against nwfilter.rng ... OK 1868) Checking icmp-direction-test.xml against nwfilter.rng ... OK 1869) Checking vlan-test.xml against nwfilter.rng ... OK 1870) Checking igmp-test.xml against nwfilter.rng ... OK 1871) Checking ipset-test.xml against nwfilter.rng ... OK 1872) Checking mac-test.xml against nwfilter.rng ... OK 1873) Checking iter-test1.xml against nwfilter.rng ... OK 1874) Checking icmpv6-test.xml against nwfilter.rng ... OK 1875) Checking udp-ipv6-test.xml against nwfilter.rng ... OK 1876) Checking ah-ipv6-test.xml against nwfilter.rng ... OK 1877) Checking hex-data-test.xml against nwfilter.rng ... OK 1878) Checking ah-test.xml against nwfilter.rng ... OK 1879) Checking rarp-test.xml against nwfilter.rng ... OK 1880) Checking iter-test2.xml against nwfilter.rng ... OK 1881) Checking example-1.xml against nwfilter.rng ... OK 1882) Checking ipt-no-macspoof-test.xml against nwfilter.rng ... OK 1883) Checking icmp-direction2-test.xml against nwfilter.rng ... OK 1884) Checking attr-value-test.xml against nwfilter.rng ... OK 1885) Checking sctp-ipv6-test.xml against nwfilter.rng ... OK 1886) Checking example-2.xml against nwfilter.rng ... OK 1887) Checking tcp-ipv6-test.xml against nwfilter.rng ... OK 1888) Checking esp-test.xml against nwfilter.rng ... OK 1889) Checking esp-ipv6-test.xml against nwfilter.rng ... OK 1890) Checking udplite-ipv6-test.xml against nwfilter.rng ... OK 1891) Checking sctp-test.xml against nwfilter.rng ... OK 1892) Checking chain_prefixtest1.xml against nwfilter.rng ... OK 1893) Checking udplite-test.xml against nwfilter.rng ... OK 1894) Checking ref-test.xml against nwfilter.rng ... OK 1895) Checking iter-test3.xml against nwfilter.rng ... OK 1896) Checking arp-test.xml against nwfilter.rng ... OK 1897) Checking all-ipv6-test.xml against nwfilter.rng ... OK 1898) Checking stp-test.xml against nwfilter.rng ... OK 1899) Checking tcp-test.xml against nwfilter.rng ... OK 1900) Checking all-test.xml against nwfilter.rng ... OK 1901) Checking icmp-direction3-test.xml against nwfilter.rng ... OK 1902) Checking udp-test.xml against nwfilter.rng ... OK 1903) Checking comment-test.xml against nwfilter.rng ... OK 1904) Checking icmp-test.xml against nwfilter.rng ... OK 1905) Checking conntrack-test.xml against nwfilter.rng ... OK 1906) Checking ipv6-test.xml against nwfilter.rng ... OK 1907) Checking ip-test.xml against nwfilter.rng ... OK 1908) test schema grammar file: secret.rng ... OK 1909) Checking usage-volume.xml against secret.rng ... OK 1910) Checking usage-iscsi.xml against secret.rng ... OK 1911) Checking usage-tls.xml against secret.rng ... OK 1912) Checking ephemeral-usage-volume.xml against secret.rng ... OK 1913) Checking usage-ceph.xml against secret.rng ... OK 1914) test schema grammar file: storagepool.rng ... OK 1915) Checking pool-fs.xml against storagepool.rng ... OK 1916) Checking pool-logical-noname.xml against storagepool.rng ... OK 1917) Checking pool-scsi-type-scsi-host-stable.xml against storagepool.rng ... OK 1918) Checking pool-scsi-type-fc-host.xml against storagepool.rng ... OK 1919) Checking pool-dir.xml against storagepool.rng ... OK 1920) Checking pool-netfs-gluster.xml against storagepool.rng ... OK 1921) Checking pool-gluster-sub.xml against storagepool.rng ... OK 1922) Checking pool-mpath.xml against storagepool.rng ... OK 1923) Checking pool-logical-create.xml against storagepool.rng ... OK 1924) Checking pool-vstorage.xml against storagepool.rng ... OK 1925) Checking pool-netfs.xml against storagepool.rng ... OK 1926) Checking pool-iscsi-vendor-product.xml against storagepool.rng ... OK 1927) Checking pool-rbd.xml against storagepool.rng ... OK 1928) Checking pool-scsi-type-scsi-host.xml against storagepool.rng ... OK 1929) Checking pool-logical-nopath.xml against storagepool.rng ... OK 1930) Checking pool-scsi.xml against storagepool.rng ... OK 1931) Checking pool-scsi-type-fc-host-managed.xml against storagepool.rng ... OK 1932) Checking pool-sheepdog.xml against storagepool.rng ... OK 1933) Checking pool-gluster.xml against storagepool.rng ... OK 1934) Checking pool-zfs-sourcedev.xml against storagepool.rng ... OK 1935) Checking pool-netfs-gluster-without-slash.xml against storagepool.rng ... OK 1936) Checking pool-iscsi-multiiqn.xml against storagepool.rng ... OK 1937) Checking pool-iscsi-auth.xml against storagepool.rng ... OK 1938) Checking pool-dir-naming.xml against storagepool.rng ... OK 1939) Checking pool-iscsi.xml against storagepool.rng ... OK 1940) Checking pool-disk.xml against storagepool.rng ... OK 1941) Checking pool-disk-device-nopartsep.xml against storagepool.rng ... OK 1942) Checking pool-netfs-cifs.xml against storagepool.rng ... OK 1943) Checking pool-zfs.xml against storagepool.rng ... OK 1944) Checking pool-logical.xml against storagepool.rng ... OK 1945) Checking pool-fs.xml against storagepool.rng ... OK 1946) Checking pool-logical-noname.xml against storagepool.rng ... OK 1947) Checking pool-scsi-type-scsi-host-stable.xml against storagepool.rng ... OK 1948) Checking pool-scsi-type-fc-host.xml against storagepool.rng ... OK 1949) Checking pool-dir.xml against storagepool.rng ... OK 1950) Checking pool-netfs-gluster.xml against storagepool.rng ... OK 1951) Checking pool-gluster-sub.xml against storagepool.rng ... OK 1952) Checking pool-mpath.xml against storagepool.rng ... OK 1953) Checking pool-logical-create.xml against storagepool.rng ... OK 1954) Checking pool-vstorage.xml against storagepool.rng ... OK 1955) Checking pool-netfs.xml against storagepool.rng ... OK 1956) Checking pool-iscsi-vendor-product.xml against storagepool.rng ... OK 1957) Checking pool-rbd.xml against storagepool.rng ... OK 1958) Checking pool-scsi-type-scsi-host.xml against storagepool.rng ... OK 1959) Checking pool-logical-nopath.xml against storagepool.rng ... OK 1960) Checking pool-scsi.xml against storagepool.rng ... OK 1961) Checking pool-scsi-type-fc-host-managed.xml against storagepool.rng ... OK 1962) Checking pool-sheepdog.xml against storagepool.rng ... OK 1963) Checking pool-gluster.xml against storagepool.rng ... OK 1964) Checking pool-zfs-sourcedev.xml against storagepool.rng ... OK 1965) Checking pool-iscsi-multiiqn.xml against storagepool.rng ... OK 1966) Checking pool-iscsi-auth.xml against storagepool.rng ... OK 1967) Checking pool-dir-naming.xml against storagepool.rng ... OK 1968) Checking pool-iscsi.xml against storagepool.rng ... OK 1969) Checking pool-disk.xml against storagepool.rng ... OK 1970) Checking pool-disk-device-nopartsep.xml against storagepool.rng ... OK 1971) Checking pool-netfs-cifs.xml against storagepool.rng ... OK 1972) Checking pool-zfs.xml against storagepool.rng ... OK 1973) Checking pool-logical.xml against storagepool.rng ... OK 1974) Checking dir-missing-target-path-invalid.xml against storagepool.rng ... libvirt: XML Util error : XML document failed to validate against schema: Unable to validate doc against <https://ci.centos.org/job/libvirt-master-check/systems=libvirt-fedora-rawhi…> Expecting an element path, got nothing Invalid sequence in interleave Element target failed to validate content Invalid sequence in interleave Element pool failed to validate content OK 1975) test schema grammar file: storagevol.rng ... OK 1976) Checking vol-file-backing.xml against storagevol.rng ... OK 1977) Checking vol-logical-backing.xml against storagevol.rng ... OK 1978) Checking vol-qcow2-nocapacity.xml against storagevol.rng ... OK 1979) Checking vol-sheepdog.xml against storagevol.rng ... OK 1980) Checking vol-luks.xml against storagevol.rng ... OK 1981) Checking vol-qcow2.xml against storagevol.rng ... OK 1982) Checking vol-gluster-dir-neg-uid.xml against storagevol.rng ... OK 1983) Checking vol-gluster-dir.xml against storagevol.rng ... OK 1984) Checking vol-qcow2-nocapacity-backing.xml against storagevol.rng ... OK 1985) Checking vol-file-iso.xml against storagevol.rng ... OK 1986) Checking vol-qcow2-nocow.xml against storagevol.rng ... OK 1987) Checking vol-qcow2-nobacking.xml against storagevol.rng ... OK 1988) Checking vol-file.xml against storagevol.rng ... OK 1989) Checking vol-partition.xml against storagevol.rng ... OK 1990) Checking vol-qcow2-0.10-lazy.xml against storagevol.rng ... OK 1991) Checking vol-luks-cipher.xml against storagevol.rng ... OK 1992) Checking vol-qcow2-lazy.xml against storagevol.rng ... OK 1993) Checking vol-logical.xml against storagevol.rng ... OK 1994) Checking vol-qcow2-zerocapacity.xml against storagevol.rng ... OK 1995) Checking vol-qcow2-1.1.xml against storagevol.rng ... OK 1996) Checking vol-file-naming.xml against storagevol.rng ... OK 1997) Checking vol-file-backing.xml against storagevol.rng ... OK 1998) Checking vol-logical-backing.xml against storagevol.rng ... OK 1999) Checking vol-qcow2-nocapacity.xml against storagevol.rng ... OK 2000) Checking vol-sheepdog.xml against storagevol.rng ... OK 2001) Checking vol-luks.xml against storagevol.rng ... OK 2002) Checking vol-qcow2.xml against storagevol.rng ... OK 2003) Checking vol-gluster-dir-neg-uid.xml against storagevol.rng ... OK 2004) Checking vol-gluster-dir.xml against storagevol.rng ... OK 2005) Checking vol-file-iso.xml against storagevol.rng ... OK 2006) Checking vol-qcow2-nocow.xml against storagevol.rng ... OK 2007) Checking vol-qcow2-nobacking.xml against storagevol.rng ... OK 2008) Checking vol-file.xml against storagevol.rng ... OK 2009) Checking vol-partition.xml against storagevol.rng ... OK 2010) Checking vol-qcow2-0.10-lazy.xml against storagevol.rng ... OK 2011) Checking vol-luks-cipher.xml against storagevol.rng ... OK 2012) Checking vol-qcow2-lazy.xml against storagevol.rng ... OK 2013) Checking vol-logical.xml against storagevol.rng ... OK 2014) Checking vol-qcow2-1.1.xml against storagevol.rng ... OK 2015) Checking vol-file-naming.xml against storagevol.rng ... OK 2016) Checking qcow2-no-source.xml against storagevol.rng ... OK 2017) test schema grammar file: ../news.rng ... OK 2018) Checking ../docs/news.xml against ../news.rng ... libvirt: XML Util error : XML document failed to validate against schema: Unable to validate doc against <https://ci.centos.org/job/libvirt-master-check/systems=libvirt-fedora-rawhi…> Datatype element summary has child elements Element summary failed to validate content FAILED FAIL virschematest (exit status: 1) + exit 1 Build step 'Execute shell' marked build as failure
1 1
0 0
[Libvirt-ci] Build failed in Jenkins: libvirt-master-check » libvirt-fedora-27 #802
by ci@centos.org 14 Dec '17

14 Dec '17
See <https://ci.centos.org/job/libvirt-master-check/systems=libvirt-fedora-27/80…> ------------------------------------------ [...truncated 175.88 KB...] 1789) Checking set-mtu.xml against network.rng ... OK 1790) Checking vepa-net.xml against network.rng ... OK 1791) Checking nat-network-dns-forwarders.xml against network.rng ... OK 1792) Checking netboot-network.xml against network.rng ... OK 1793) Checking passthrough-address-crash.xml against network.rng ... OK 1794) Checking open-network.xml against network.rng ... OK 1795) Checking nat-network-dns-srv-record-minimal.xml against network.rng ... OK 1796) Checking nat-network-dns-srv-record.xml against network.rng ... OK 1797) Checking nat-network-dns-hosts.xml against network.rng ... OK 1798) Checking isolated-network.xml against network.rng ... OK 1799) Checking empty-allow-ipv6.xml against network.rng ... OK 1800) Checking nat-network-forward-nat-address.xml against network.rng ... OK 1801) Checking host-bridge-no-flood.xml against network.rng ... OK 1802) Checking passthrough-pf.xml against network.rng ... OK 1803) Checking nat-network-explicit-flood.xml against network.rng ... OK 1804) Checking nat-network-forward-nat-no-address.xml against network.rng ... OK 1805) Checking routed-network.xml against network.rng ... OK 1806) Checking direct-net.xml against network.rng ... OK 1807) Checking nat-network-dns-forwarder-no-resolv.xml against network.rng ... OK 1808) Checking metadata.xml against network.rng ... OK 1809) Checking openvswitch-net.xml against network.rng ... OK 1810) Checking host-bridge-net.xml against network.rng ... OK 1811) Checking bandwidth-network.xml against network.rng ... OK 1812) Checking dhcp6-nat-network.xml against network.rng ... OK 1813) Checking nat-network-dns-txt-record.xml against network.rng ... OK 1814) Checking dhcp6host-routed-network.xml against network.rng ... OK 1815) Checking routed-network-no-dns.xml against network.rng ... OK 1816) Checking nat-network-dns-forward-plain.xml against network.rng ... OK 1817) Checking nat-network.xml against network.rng ... OK 1818) Checking netboot-proxy-network.xml against network.rng ... OK 1819) Checking nat-network-dns-local-domain.xml against network.rng ... OK 1820) Checking dhcp6-network.xml against network.rng ... OK 1821) Checking nat-network-dns-forwarders.xml against network.rng ... OK 1822) Checking netboot-network.xml against network.rng ... OK 1823) Checking open-network.xml against network.rng ... OK 1824) Checking nat-network-dns-srv-record-minimal.xml against network.rng ... OK 1825) Checking nat-network-name-with-quotes.xml against network.rng ... OK 1826) Checking nat-network-dns-srv-record.xml against network.rng ... OK 1827) Checking nat-network-dns-hosts.xml against network.rng ... OK 1828) Checking isolated-network.xml against network.rng ... OK 1829) Checking ptr-domains-auto.xml against network.rng ... OK 1830) Checking routed-network.xml against network.rng ... OK 1831) Checking nat-network-dns-forwarder-no-resolv.xml against network.rng ... OK 1832) test schema grammar file: nodedev.rng ... OK 1833) Checking scsi_target1_0_0.xml against nodedev.rng ... OK 1834) Checking DVD_with_media.xml against nodedev.rng ... OK 1835) Checking pci_0000_02_10_7_sriov_vfs.xml against nodedev.rng ... OK 1836) Checking pci_0000_00_1c_0_header_type.xml against nodedev.rng ... OK 1837) Checking pci_8086_10c9_sriov_pf.xml against nodedev.rng ... OK 1838) Checking pci_0000_02_10_7_mdev_types.xml against nodedev.rng ... OK 1839) Checking net_00_13_02_b9_f9_d3.xml against nodedev.rng ... OK 1840) Checking pci_1002_71c4.xml against nodedev.rng ... OK 1841) Checking pci_8086_27c5_scsi_host_0_unique_id.xml against nodedev.rng ... OK 1842) Checking pci_0000_02_10_7_sriov_zero_vfs_max_count.xml against nodedev.rng ... OK 1843) Checking pci_8086_27c5_scsi_host_0.xml against nodedev.rng ... OK 1844) Checking pci_0000_02_10_7_sriov_pf_vfs_all.xml against nodedev.rng ... OK 1845) Checking storage_serial_SATA_HTS721010G9SA00_MPCZ12Y0GNGWSE.xml against nodedev.rng ... OK 1846) Checking net_00_15_58_2f_e9_55.xml against nodedev.rng ... OK 1847) Checking ccw_0_0_ffff.xml against nodedev.rng ... OK 1848) Checking ccw_0_0_10000-invalid.xml against nodedev.rng ... libvirt: XML Util error : XML document failed to validate against schema: Unable to validate doc against <https://ci.centos.org/job/libvirt-master-check/systems=libvirt-fedora-27/ws…> Error validating datatype string Type int doesn't allow value '0x10000' Error validating datatype int Element devno failed to validate content Element capability failed to validate content OK 1849) Checking scsi_target0_0_0.xml against nodedev.rng ... OK 1850) Checking pci_8086_27c5_scsi_host_scsi_device_lun0.xml against nodedev.rng ... OK 1851) Checking usb_device_1d6b_1_0000_00_1d_0.xml against nodedev.rng ... OK 1852) Checking pci_0000_00_02_0_header_type.xml against nodedev.rng ... OK 1853) Checking pci_0000_02_10_7_sriov_pf_vfs_all_header_type.xml against nodedev.rng ... OK 1854) Checking pci_8086_4238_pcie_wireless.xml against nodedev.rng ... OK 1855) Checking pci_8086_0c0c_snd_hda_intel.xml against nodedev.rng ... OK 1856) Checking pci_8086_27c5_scsi_host.xml against nodedev.rng ... OK 1857) Checking DVD_GCC_4247N.xml against nodedev.rng ... OK 1858) Checking computer.xml against nodedev.rng ... OK 1859) Checking usb_device_1d6b_1_0000_00_1d_0_if0.xml against nodedev.rng ... OK 1860) Checking pci_82579LM_network_adapter.xml against nodedev.rng ... OK 1861) Checking drm_renderD129.xml against nodedev.rng ... OK 1862) Checking pci_0000_02_10_7_sriov.xml against nodedev.rng ... OK 1863) Checking pci_8086_27c5_scsi_host_scsi_host.xml against nodedev.rng ... OK 1864) Checking mdev_3627463d_b7f0_4fea_b468_f1da537d301b.xml against nodedev.rng ... OK 1865) Checking storage_serial_3600c0ff000d7a2a5d463ff4902000000.xml against nodedev.rng ... OK 1866) test schema grammar file: nwfilter.rng ... OK 1867) Checking ah-ipv6-test.xml against nwfilter.rng ... OK 1868) Checking ref-test.xml against nwfilter.rng ... OK 1869) Checking udplite-ipv6-test.xml against nwfilter.rng ... OK 1870) Checking rarp-test.xml against nwfilter.rng ... OK 1871) Checking ref-rule-test.xml against nwfilter.rng ... OK 1872) Checking icmp-direction3-test.xml against nwfilter.rng ... OK 1873) Checking udp-ipv6-test.xml against nwfilter.rng ... OK 1874) Checking example-1.xml against nwfilter.rng ... OK 1875) Checking hex-data-test.xml against nwfilter.rng ... OK 1876) Checking icmpv6-test.xml against nwfilter.rng ... OK 1877) Checking vlan-test.xml against nwfilter.rng ... OK 1878) Checking icmp-direction2-test.xml against nwfilter.rng ... OK 1879) Checking stp-test.xml against nwfilter.rng ... OK 1880) Checking chain_prefixtest1.xml against nwfilter.rng ... OK 1881) Checking esp-ipv6-test.xml against nwfilter.rng ... OK 1882) Checking tcp-ipv6-test.xml against nwfilter.rng ... OK 1883) Checking igmp-test.xml against nwfilter.rng ... OK 1884) Checking icmp-test.xml against nwfilter.rng ... OK 1885) Checking esp-test.xml against nwfilter.rng ... OK 1886) Checking comment-test.xml against nwfilter.rng ... OK 1887) Checking icmp-direction-test.xml against nwfilter.rng ... OK 1888) Checking iter-test3.xml against nwfilter.rng ... OK 1889) Checking ipt-no-macspoof-test.xml against nwfilter.rng ... OK 1890) Checking iter-test1.xml against nwfilter.rng ... OK 1891) Checking conntrack-test.xml against nwfilter.rng ... OK 1892) Checking ah-test.xml against nwfilter.rng ... OK 1893) Checking all-ipv6-test.xml against nwfilter.rng ... OK 1894) Checking sctp-ipv6-test.xml against nwfilter.rng ... OK 1895) Checking udp-test.xml against nwfilter.rng ... OK 1896) Checking ipv6-test.xml against nwfilter.rng ... OK 1897) Checking example-2.xml against nwfilter.rng ... OK 1898) Checking sctp-test.xml against nwfilter.rng ... OK 1899) Checking mac-test.xml against nwfilter.rng ... OK 1900) Checking ip-test.xml against nwfilter.rng ... OK 1901) Checking iter-test2.xml against nwfilter.rng ... OK 1902) Checking all-test.xml against nwfilter.rng ... OK 1903) Checking ipset-test.xml against nwfilter.rng ... OK 1904) Checking tcp-test.xml against nwfilter.rng ... OK 1905) Checking attr-value-test.xml against nwfilter.rng ... OK 1906) Checking udplite-test.xml against nwfilter.rng ... OK 1907) Checking arp-test.xml against nwfilter.rng ... OK 1908) test schema grammar file: secret.rng ... OK 1909) Checking ephemeral-usage-volume.xml against secret.rng ... OK 1910) Checking usage-ceph.xml against secret.rng ... OK 1911) Checking usage-iscsi.xml against secret.rng ... OK 1912) Checking usage-tls.xml against secret.rng ... OK 1913) Checking usage-volume.xml against secret.rng ... OK 1914) test schema grammar file: storagepool.rng ... OK 1915) Checking pool-logical-noname.xml against storagepool.rng ... OK 1916) Checking pool-scsi-type-fc-host.xml against storagepool.rng ... OK 1917) Checking pool-disk.xml against storagepool.rng ... OK 1918) Checking pool-netfs.xml against storagepool.rng ... OK 1919) Checking pool-iscsi-auth.xml against storagepool.rng ... OK 1920) Checking pool-iscsi.xml against storagepool.rng ... OK 1921) Checking pool-logical-nopath.xml against storagepool.rng ... OK 1922) Checking pool-disk-device-nopartsep.xml against storagepool.rng ... OK 1923) Checking pool-logical-create.xml against storagepool.rng ... OK 1924) Checking pool-fs.xml against storagepool.rng ... OK 1925) Checking pool-netfs-cifs.xml against storagepool.rng ... OK 1926) Checking pool-iscsi-vendor-product.xml against storagepool.rng ... OK 1927) Checking pool-netfs-gluster.xml against storagepool.rng ... OK 1928) Checking pool-vstorage.xml against storagepool.rng ... OK 1929) Checking pool-gluster-sub.xml against storagepool.rng ... OK 1930) Checking pool-mpath.xml against storagepool.rng ... OK 1931) Checking pool-scsi-type-scsi-host-stable.xml against storagepool.rng ... OK 1932) Checking pool-dir-naming.xml against storagepool.rng ... OK 1933) Checking pool-rbd.xml against storagepool.rng ... OK 1934) Checking pool-scsi.xml against storagepool.rng ... OK 1935) Checking pool-logical.xml against storagepool.rng ... OK 1936) Checking pool-sheepdog.xml against storagepool.rng ... OK 1937) Checking pool-gluster.xml against storagepool.rng ... OK 1938) Checking pool-scsi-type-fc-host-managed.xml against storagepool.rng ... OK 1939) Checking pool-zfs.xml against storagepool.rng ... OK 1940) Checking pool-zfs-sourcedev.xml against storagepool.rng ... OK 1941) Checking pool-dir.xml against storagepool.rng ... OK 1942) Checking pool-scsi-type-scsi-host.xml against storagepool.rng ... OK 1943) Checking pool-netfs-gluster-without-slash.xml against storagepool.rng ... OK 1944) Checking pool-iscsi-multiiqn.xml against storagepool.rng ... OK 1945) Checking pool-logical-noname.xml against storagepool.rng ... OK 1946) Checking pool-scsi-type-fc-host.xml against storagepool.rng ... OK 1947) Checking pool-disk.xml against storagepool.rng ... OK 1948) Checking pool-netfs.xml against storagepool.rng ... OK 1949) Checking pool-iscsi-auth.xml against storagepool.rng ... OK 1950) Checking pool-iscsi.xml against storagepool.rng ... OK 1951) Checking pool-logical-nopath.xml against storagepool.rng ... OK 1952) Checking pool-disk-device-nopartsep.xml against storagepool.rng ... OK 1953) Checking pool-logical-create.xml against storagepool.rng ... OK 1954) Checking pool-fs.xml against storagepool.rng ... OK 1955) Checking pool-netfs-cifs.xml against storagepool.rng ... OK 1956) Checking pool-iscsi-vendor-product.xml against storagepool.rng ... OK 1957) Checking pool-netfs-gluster.xml against storagepool.rng ... OK 1958) Checking pool-vstorage.xml against storagepool.rng ... OK 1959) Checking pool-gluster-sub.xml against storagepool.rng ... OK 1960) Checking pool-mpath.xml against storagepool.rng ... OK 1961) Checking pool-scsi-type-scsi-host-stable.xml against storagepool.rng ... OK 1962) Checking pool-dir-naming.xml against storagepool.rng ... OK 1963) Checking pool-rbd.xml against storagepool.rng ... OK 1964) Checking pool-scsi.xml against storagepool.rng ... OK 1965) Checking pool-logical.xml against storagepool.rng ... OK 1966) Checking pool-sheepdog.xml against storagepool.rng ... OK 1967) Checking pool-gluster.xml against storagepool.rng ... OK 1968) Checking pool-scsi-type-fc-host-managed.xml against storagepool.rng ... OK 1969) Checking pool-zfs.xml against storagepool.rng ... OK 1970) Checking pool-zfs-sourcedev.xml against storagepool.rng ... OK 1971) Checking pool-dir.xml against storagepool.rng ... OK 1972) Checking pool-scsi-type-scsi-host.xml against storagepool.rng ... OK 1973) Checking pool-iscsi-multiiqn.xml against storagepool.rng ... OK 1974) Checking dir-missing-target-path-invalid.xml against storagepool.rng ... libvirt: XML Util error : XML document failed to validate against schema: Unable to validate doc against <https://ci.centos.org/job/libvirt-master-check/systems=libvirt-fedora-27/ws…> Expecting an element path, got nothing Invalid sequence in interleave Element target failed to validate content Invalid sequence in interleave Element pool failed to validate content OK 1975) test schema grammar file: storagevol.rng ... OK 1976) Checking vol-qcow2.xml against storagevol.rng ... OK 1977) Checking vol-file-iso.xml against storagevol.rng ... OK 1978) Checking vol-file-backing.xml against storagevol.rng ... OK 1979) Checking vol-qcow2-nocapacity.xml against storagevol.rng ... OK 1980) Checking vol-luks.xml against storagevol.rng ... OK 1981) Checking vol-sheepdog.xml against storagevol.rng ... OK 1982) Checking vol-gluster-dir.xml against storagevol.rng ... OK 1983) Checking vol-qcow2-lazy.xml against storagevol.rng ... OK 1984) Checking vol-gluster-dir-neg-uid.xml against storagevol.rng ... OK 1985) Checking vol-luks-cipher.xml against storagevol.rng ... OK 1986) Checking vol-qcow2-1.1.xml against storagevol.rng ... OK 1987) Checking vol-partition.xml against storagevol.rng ... OK 1988) Checking vol-qcow2-nocow.xml against storagevol.rng ... OK 1989) Checking vol-qcow2-zerocapacity.xml against storagevol.rng ... OK 1990) Checking vol-file.xml against storagevol.rng ... OK 1991) Checking vol-qcow2-nobacking.xml against storagevol.rng ... OK 1992) Checking vol-file-naming.xml against storagevol.rng ... OK 1993) Checking vol-logical.xml against storagevol.rng ... OK 1994) Checking vol-qcow2-nocapacity-backing.xml against storagevol.rng ... OK 1995) Checking vol-qcow2-0.10-lazy.xml against storagevol.rng ... OK 1996) Checking vol-logical-backing.xml against storagevol.rng ... OK 1997) Checking vol-qcow2.xml against storagevol.rng ... OK 1998) Checking vol-file-iso.xml against storagevol.rng ... OK 1999) Checking vol-file-backing.xml against storagevol.rng ... OK 2000) Checking vol-qcow2-nocapacity.xml against storagevol.rng ... OK 2001) Checking vol-luks.xml against storagevol.rng ... OK 2002) Checking vol-sheepdog.xml against storagevol.rng ... OK 2003) Checking vol-gluster-dir.xml against storagevol.rng ... OK 2004) Checking vol-qcow2-lazy.xml against storagevol.rng ... OK 2005) Checking vol-gluster-dir-neg-uid.xml against storagevol.rng ... OK 2006) Checking vol-luks-cipher.xml against storagevol.rng ... OK 2007) Checking vol-qcow2-1.1.xml against storagevol.rng ... OK 2008) Checking vol-partition.xml against storagevol.rng ... OK 2009) Checking vol-qcow2-nocow.xml against storagevol.rng ... OK 2010) Checking vol-file.xml against storagevol.rng ... OK 2011) Checking vol-qcow2-nobacking.xml against storagevol.rng ... OK 2012) Checking vol-file-naming.xml against storagevol.rng ... OK 2013) Checking vol-logical.xml against storagevol.rng ... OK 2014) Checking vol-qcow2-0.10-lazy.xml against storagevol.rng ... OK 2015) Checking vol-logical-backing.xml against storagevol.rng ... OK 2016) Checking qcow2-no-source.xml against storagevol.rng ... OK 2017) test schema grammar file: ../news.rng ... OK 2018) Checking ../docs/news.xml against ../news.rng ... libvirt: XML Util error : XML document failed to validate against schema: Unable to validate doc against <https://ci.centos.org/job/libvirt-master-check/systems=libvirt-fedora-27/ws…> Datatype element summary has child elements Element summary failed to validate content FAILED FAIL virschematest (exit status: 1) + exit 1 Build step 'Execute shell' marked build as failure
1 1
0 0
[Libvirt-ci] Build failed in Jenkins: libvirt-master-check » libvirt-fedora-26 #802
by ci@centos.org 14 Dec '17

14 Dec '17
See <https://ci.centos.org/job/libvirt-master-check/systems=libvirt-fedora-26/80…> ------------------------------------------ [...truncated 175.88 KB...] 1789) Checking nat-network-dns-forwarder-no-resolv.xml against network.rng ... OK 1790) Checking openvswitch-net.xml against network.rng ... OK 1791) Checking empty-allow-ipv6.xml against network.rng ... OK 1792) Checking direct-net.xml against network.rng ... OK 1793) Checking nat-network-dns-forwarders.xml against network.rng ... OK 1794) Checking set-mtu.xml against network.rng ... OK 1795) Checking bandwidth-network.xml against network.rng ... OK 1796) Checking dhcp6host-routed-network.xml against network.rng ... OK 1797) Checking metadata.xml against network.rng ... OK 1798) Checking 8021Qbh-net.xml against network.rng ... OK 1799) Checking vepa-net.xml against network.rng ... OK 1800) Checking open-network.xml against network.rng ... OK 1801) Checking nat-network-dns-srv-records.xml against network.rng ... OK 1802) Checking netboot-network.xml against network.rng ... OK 1803) Checking nat-network-dns-hosts.xml against network.rng ... OK 1804) Checking nat-network.xml against network.rng ... OK 1805) Checking routed-network-no-dns.xml against network.rng ... OK 1806) Checking routed-network.xml against network.rng ... OK 1807) Checking hostdev.xml against network.rng ... OK 1808) Checking host-bridge-no-flood.xml against network.rng ... OK 1809) Checking nat-network-forward-nat-address.xml against network.rng ... OK 1810) Checking nat-network-explicit-flood.xml against network.rng ... OK 1811) Checking nat-network-forward-nat-no-address.xml against network.rng ... OK 1812) Checking isolated-network.xml against network.rng ... OK 1813) Checking nat-network-dns-txt-record.xml against network.rng ... OK 1814) Checking nat-network-dns-srv-record-minimal.xml against network.rng ... OK 1815) Checking nat-network-dns-srv-record.xml against network.rng ... OK 1816) Checking dhcp6-nat-network.xml against network.rng ... OK 1817) Checking netboot-proxy-network.xml against network.rng ... OK 1818) Checking nat-network-dns-forward-plain.xml against network.rng ... OK 1819) Checking nat-network-dns-forwarder-no-resolv.xml against network.rng ... OK 1820) Checking nat-network-dns-forwarders.xml against network.rng ... OK 1821) Checking nat-network-dns-local-domain.xml against network.rng ... OK 1822) Checking dhcp6host-routed-network.xml against network.rng ... OK 1823) Checking open-network.xml against network.rng ... OK 1824) Checking netboot-network.xml against network.rng ... OK 1825) Checking nat-network-dns-hosts.xml against network.rng ... OK 1826) Checking nat-network.xml against network.rng ... OK 1827) Checking routed-network-no-dns.xml against network.rng ... OK 1828) Checking ptr-domains-auto.xml against network.rng ... OK 1829) Checking routed-network.xml against network.rng ... OK 1830) Checking nat-network-name-with-quotes.xml against network.rng ... OK 1831) Checking dhcp6-network.xml against network.rng ... OK 1832) test schema grammar file: nodedev.rng ... OK 1833) Checking storage_serial_SATA_HTS721010G9SA00_MPCZ12Y0GNGWSE.xml against nodedev.rng ... OK 1834) Checking pci_8086_27c5_scsi_host_0.xml against nodedev.rng ... OK 1835) Checking drm_renderD129.xml against nodedev.rng ... OK 1836) Checking pci_8086_27c5_scsi_host.xml against nodedev.rng ... OK 1837) Checking pci_0000_02_10_7_sriov_vfs.xml against nodedev.rng ... OK 1838) Checking usb_device_1d6b_1_0000_00_1d_0_if0.xml against nodedev.rng ... OK 1839) Checking DVD_with_media.xml against nodedev.rng ... OK 1840) Checking mdev_3627463d_b7f0_4fea_b468_f1da537d301b.xml against nodedev.rng ... OK 1841) Checking pci_0000_00_02_0_header_type.xml against nodedev.rng ... OK 1842) Checking pci_1002_71c4.xml against nodedev.rng ... OK 1843) Checking DVD_GCC_4247N.xml against nodedev.rng ... OK 1844) Checking usb_device_1d6b_1_0000_00_1d_0.xml against nodedev.rng ... OK 1845) Checking pci_8086_27c5_scsi_host_scsi_device_lun0.xml against nodedev.rng ... OK 1846) Checking scsi_target0_0_0.xml against nodedev.rng ... OK 1847) Checking pci_8086_4238_pcie_wireless.xml against nodedev.rng ... OK 1848) Checking pci_0000_02_10_7_mdev_types.xml against nodedev.rng ... OK 1849) Checking pci_8086_27c5_scsi_host_0_unique_id.xml against nodedev.rng ... OK 1850) Checking pci_82579LM_network_adapter.xml against nodedev.rng ... OK 1851) Checking pci_8086_10c9_sriov_pf.xml against nodedev.rng ... OK 1852) Checking net_00_13_02_b9_f9_d3.xml against nodedev.rng ... OK 1853) Checking net_00_15_58_2f_e9_55.xml against nodedev.rng ... OK 1854) Checking pci_8086_27c5_scsi_host_scsi_host.xml against nodedev.rng ... OK 1855) Checking pci_0000_02_10_7_sriov_pf_vfs_all_header_type.xml against nodedev.rng ... OK 1856) Checking pci_0000_00_1c_0_header_type.xml against nodedev.rng ... OK 1857) Checking pci_0000_02_10_7_sriov_zero_vfs_max_count.xml against nodedev.rng ... OK 1858) Checking pci_0000_02_10_7_sriov.xml against nodedev.rng ... OK 1859) Checking storage_serial_3600c0ff000d7a2a5d463ff4902000000.xml against nodedev.rng ... OK 1860) Checking ccw_0_0_ffff.xml against nodedev.rng ... OK 1861) Checking scsi_target1_0_0.xml against nodedev.rng ... OK 1862) Checking ccw_0_0_10000-invalid.xml against nodedev.rng ... libvirt: XML Util error : XML document failed to validate against schema: Unable to validate doc against <https://ci.centos.org/job/libvirt-master-check/systems=libvirt-fedora-26/ws…> Error validating datatype string Type int doesn't allow value '0x10000' Error validating datatype int Element devno failed to validate content Element capability failed to validate content OK 1863) Checking pci_8086_0c0c_snd_hda_intel.xml against nodedev.rng ... OK 1864) Checking pci_0000_02_10_7_sriov_pf_vfs_all.xml against nodedev.rng ... OK 1865) Checking computer.xml against nodedev.rng ... OK 1866) test schema grammar file: nwfilter.rng ... OK 1867) Checking ref-test.xml against nwfilter.rng ... OK 1868) Checking ip-test.xml against nwfilter.rng ... OK 1869) Checking udp-ipv6-test.xml against nwfilter.rng ... OK 1870) Checking ipset-test.xml against nwfilter.rng ... OK 1871) Checking icmp-direction3-test.xml against nwfilter.rng ... OK 1872) Checking rarp-test.xml against nwfilter.rng ... OK 1873) Checking vlan-test.xml against nwfilter.rng ... OK 1874) Checking conntrack-test.xml against nwfilter.rng ... OK 1875) Checking ref-rule-test.xml against nwfilter.rng ... OK 1876) Checking ipt-no-macspoof-test.xml against nwfilter.rng ... OK 1877) Checking esp-test.xml against nwfilter.rng ... OK 1878) Checking igmp-test.xml against nwfilter.rng ... OK 1879) Checking iter-test3.xml against nwfilter.rng ... OK 1880) Checking all-ipv6-test.xml against nwfilter.rng ... OK 1881) Checking tcp-test.xml against nwfilter.rng ... OK 1882) Checking icmpv6-test.xml against nwfilter.rng ... OK 1883) Checking stp-test.xml against nwfilter.rng ... OK 1884) Checking udplite-test.xml against nwfilter.rng ... OK 1885) Checking sctp-test.xml against nwfilter.rng ... OK 1886) Checking ipv6-test.xml against nwfilter.rng ... OK 1887) Checking sctp-ipv6-test.xml against nwfilter.rng ... OK 1888) Checking icmp-direction-test.xml against nwfilter.rng ... OK 1889) Checking udplite-ipv6-test.xml against nwfilter.rng ... OK 1890) Checking tcp-ipv6-test.xml against nwfilter.rng ... OK 1891) Checking attr-value-test.xml against nwfilter.rng ... OK 1892) Checking arp-test.xml against nwfilter.rng ... OK 1893) Checking ah-ipv6-test.xml against nwfilter.rng ... OK 1894) Checking chain_prefixtest1.xml against nwfilter.rng ... OK 1895) Checking iter-test1.xml against nwfilter.rng ... OK 1896) Checking example-1.xml against nwfilter.rng ... OK 1897) Checking mac-test.xml against nwfilter.rng ... OK 1898) Checking udp-test.xml against nwfilter.rng ... OK 1899) Checking esp-ipv6-test.xml against nwfilter.rng ... OK 1900) Checking icmp-test.xml against nwfilter.rng ... OK 1901) Checking hex-data-test.xml against nwfilter.rng ... OK 1902) Checking ah-test.xml against nwfilter.rng ... OK 1903) Checking example-2.xml against nwfilter.rng ... OK 1904) Checking iter-test2.xml against nwfilter.rng ... OK 1905) Checking comment-test.xml against nwfilter.rng ... OK 1906) Checking icmp-direction2-test.xml against nwfilter.rng ... OK 1907) Checking all-test.xml against nwfilter.rng ... OK 1908) test schema grammar file: secret.rng ... OK 1909) Checking usage-ceph.xml against secret.rng ... OK 1910) Checking usage-tls.xml against secret.rng ... OK 1911) Checking usage-iscsi.xml against secret.rng ... OK 1912) Checking usage-volume.xml against secret.rng ... OK 1913) Checking ephemeral-usage-volume.xml against secret.rng ... OK 1914) test schema grammar file: storagepool.rng ... OK 1915) Checking pool-dir-naming.xml against storagepool.rng ... OK 1916) Checking pool-netfs-gluster.xml against storagepool.rng ... OK 1917) Checking pool-disk.xml against storagepool.rng ... OK 1918) Checking pool-netfs-cifs.xml against storagepool.rng ... OK 1919) Checking pool-sheepdog.xml against storagepool.rng ... OK 1920) Checking pool-rbd.xml against storagepool.rng ... OK 1921) Checking pool-fs.xml against storagepool.rng ... OK 1922) Checking pool-iscsi.xml against storagepool.rng ... OK 1923) Checking pool-netfs-gluster-without-slash.xml against storagepool.rng ... OK 1924) Checking pool-iscsi-auth.xml against storagepool.rng ... OK 1925) Checking pool-zfs.xml against storagepool.rng ... OK 1926) Checking pool-logical.xml against storagepool.rng ... OK 1927) Checking pool-vstorage.xml against storagepool.rng ... OK 1928) Checking pool-scsi-type-scsi-host.xml against storagepool.rng ... OK 1929) Checking pool-scsi.xml against storagepool.rng ... OK 1930) Checking pool-disk-device-nopartsep.xml against storagepool.rng ... OK 1931) Checking pool-scsi-type-scsi-host-stable.xml against storagepool.rng ... OK 1932) Checking pool-zfs-sourcedev.xml against storagepool.rng ... OK 1933) Checking pool-iscsi-vendor-product.xml against storagepool.rng ... OK 1934) Checking pool-mpath.xml against storagepool.rng ... OK 1935) Checking pool-scsi-type-fc-host.xml against storagepool.rng ... OK 1936) Checking pool-logical-create.xml against storagepool.rng ... OK 1937) Checking pool-logical-noname.xml against storagepool.rng ... OK 1938) Checking pool-netfs.xml against storagepool.rng ... OK 1939) Checking pool-logical-nopath.xml against storagepool.rng ... OK 1940) Checking pool-scsi-type-fc-host-managed.xml against storagepool.rng ... OK 1941) Checking pool-gluster.xml against storagepool.rng ... OK 1942) Checking pool-dir.xml against storagepool.rng ... OK 1943) Checking pool-iscsi-multiiqn.xml against storagepool.rng ... OK 1944) Checking pool-gluster-sub.xml against storagepool.rng ... OK 1945) Checking pool-dir-naming.xml against storagepool.rng ... OK 1946) Checking pool-netfs-gluster.xml against storagepool.rng ... OK 1947) Checking pool-disk.xml against storagepool.rng ... OK 1948) Checking pool-netfs-cifs.xml against storagepool.rng ... OK 1949) Checking pool-sheepdog.xml against storagepool.rng ... OK 1950) Checking pool-rbd.xml against storagepool.rng ... OK 1951) Checking pool-fs.xml against storagepool.rng ... OK 1952) Checking pool-iscsi.xml against storagepool.rng ... OK 1953) Checking pool-iscsi-auth.xml against storagepool.rng ... OK 1954) Checking pool-zfs.xml against storagepool.rng ... OK 1955) Checking pool-logical.xml against storagepool.rng ... OK 1956) Checking pool-vstorage.xml against storagepool.rng ... OK 1957) Checking pool-scsi-type-scsi-host.xml against storagepool.rng ... OK 1958) Checking pool-scsi.xml against storagepool.rng ... OK 1959) Checking pool-disk-device-nopartsep.xml against storagepool.rng ... OK 1960) Checking pool-scsi-type-scsi-host-stable.xml against storagepool.rng ... OK 1961) Checking pool-zfs-sourcedev.xml against storagepool.rng ... OK 1962) Checking pool-iscsi-vendor-product.xml against storagepool.rng ... OK 1963) Checking pool-mpath.xml against storagepool.rng ... OK 1964) Checking pool-scsi-type-fc-host.xml against storagepool.rng ... OK 1965) Checking pool-logical-create.xml against storagepool.rng ... OK 1966) Checking pool-logical-noname.xml against storagepool.rng ... OK 1967) Checking pool-netfs.xml against storagepool.rng ... OK 1968) Checking pool-logical-nopath.xml against storagepool.rng ... OK 1969) Checking pool-scsi-type-fc-host-managed.xml against storagepool.rng ... OK 1970) Checking pool-gluster.xml against storagepool.rng ... OK 1971) Checking pool-dir.xml against storagepool.rng ... OK 1972) Checking pool-iscsi-multiiqn.xml against storagepool.rng ... OK 1973) Checking pool-gluster-sub.xml against storagepool.rng ... OK 1974) Checking dir-missing-target-path-invalid.xml against storagepool.rng ... libvirt: XML Util error : XML document failed to validate against schema: Unable to validate doc against <https://ci.centos.org/job/libvirt-master-check/systems=libvirt-fedora-26/ws…> Expecting an element path, got nothing Invalid sequence in interleave Element target failed to validate content Invalid sequence in interleave Element pool failed to validate content OK 1975) test schema grammar file: storagevol.rng ... OK 1976) Checking vol-qcow2-nobacking.xml against storagevol.rng ... OK 1977) Checking vol-file-naming.xml against storagevol.rng ... OK 1978) Checking vol-qcow2-1.1.xml against storagevol.rng ... OK 1979) Checking vol-partition.xml against storagevol.rng ... OK 1980) Checking vol-file.xml against storagevol.rng ... OK 1981) Checking vol-logical.xml against storagevol.rng ... OK 1982) Checking vol-file-backing.xml against storagevol.rng ... OK 1983) Checking vol-luks-cipher.xml against storagevol.rng ... OK 1984) Checking vol-gluster-dir.xml against storagevol.rng ... OK 1985) Checking vol-qcow2.xml against storagevol.rng ... OK 1986) Checking vol-luks.xml against storagevol.rng ... OK 1987) Checking vol-qcow2-lazy.xml against storagevol.rng ... OK 1988) Checking vol-qcow2-nocapacity.xml against storagevol.rng ... OK 1989) Checking vol-file-iso.xml against storagevol.rng ... OK 1990) Checking vol-qcow2-zerocapacity.xml against storagevol.rng ... OK 1991) Checking vol-sheepdog.xml against storagevol.rng ... OK 1992) Checking vol-qcow2-0.10-lazy.xml against storagevol.rng ... OK 1993) Checking vol-gluster-dir-neg-uid.xml against storagevol.rng ... OK 1994) Checking vol-qcow2-nocapacity-backing.xml against storagevol.rng ... OK 1995) Checking vol-qcow2-nocow.xml against storagevol.rng ... OK 1996) Checking vol-logical-backing.xml against storagevol.rng ... OK 1997) Checking vol-qcow2-nobacking.xml against storagevol.rng ... OK 1998) Checking vol-file-naming.xml against storagevol.rng ... OK 1999) Checking vol-qcow2-1.1.xml against storagevol.rng ... OK 2000) Checking vol-partition.xml against storagevol.rng ... OK 2001) Checking vol-file.xml against storagevol.rng ... OK 2002) Checking vol-logical.xml against storagevol.rng ... OK 2003) Checking vol-file-backing.xml against storagevol.rng ... OK 2004) Checking vol-luks-cipher.xml against storagevol.rng ... OK 2005) Checking vol-gluster-dir.xml against storagevol.rng ... OK 2006) Checking vol-qcow2.xml against storagevol.rng ... OK 2007) Checking vol-luks.xml against storagevol.rng ... OK 2008) Checking vol-qcow2-lazy.xml against storagevol.rng ... OK 2009) Checking vol-qcow2-nocapacity.xml against storagevol.rng ... OK 2010) Checking vol-file-iso.xml against storagevol.rng ... OK 2011) Checking vol-sheepdog.xml against storagevol.rng ... OK 2012) Checking vol-qcow2-0.10-lazy.xml against storagevol.rng ... OK 2013) Checking vol-gluster-dir-neg-uid.xml against storagevol.rng ... OK 2014) Checking vol-qcow2-nocow.xml against storagevol.rng ... OK 2015) Checking vol-logical-backing.xml against storagevol.rng ... OK 2016) Checking qcow2-no-source.xml against storagevol.rng ... OK 2017) test schema grammar file: ../news.rng ... OK 2018) Checking ../docs/news.xml against ../news.rng ... libvirt: XML Util error : XML document failed to validate against schema: Unable to validate doc against <https://ci.centos.org/job/libvirt-master-check/systems=libvirt-fedora-26/ws…> Datatype element summary has child elements Element summary failed to validate content FAILED FAIL virschematest (exit status: 1) + exit 1 Build step 'Execute shell' marked build as failure
1 1
0 0
[Libvirt-ci] Build failed in Jenkins: libvirt-master-check » libvirt-centos-7 #802
by ci@centos.org 14 Dec '17

14 Dec '17
See <https://ci.centos.org/job/libvirt-master-check/systems=libvirt-centos-7/802…> ------------------------------------------ [...truncated 177.25 KB...] 1788) Checking openvswitch-net.xml against network.rng ... OK 1789) Checking nat-network-dns-hosts.xml against network.rng ... OK 1790) Checking vepa-net.xml against network.rng ... OK 1791) Checking nat-network-dns-forwarders.xml against network.rng ... OK 1792) Checking nat-network-explicit-flood.xml against network.rng ... OK 1793) Checking host-bridge-no-flood.xml against network.rng ... OK 1794) Checking open-network.xml against network.rng ... OK 1795) Checking netboot-network.xml against network.rng ... OK 1796) Checking nat-network-dns-srv-record-minimal.xml against network.rng ... OK 1797) Checking empty-allow-ipv6.xml against network.rng ... OK 1798) Checking nat-network-forward-nat-address.xml against network.rng ... OK 1799) Checking nat-network-dns-txt-record.xml against network.rng ... OK 1800) Checking metadata.xml against network.rng ... OK 1801) Checking nat-network-dns-srv-records.xml against network.rng ... OK 1802) Checking netboot-proxy-network.xml against network.rng ... OK 1803) Checking nat-network-dns-forward-plain.xml against network.rng ... OK 1804) Checking routed-network.xml against network.rng ... OK 1805) Checking hostdev.xml against network.rng ... OK 1806) Checking passthrough-address-crash.xml against network.rng ... OK 1807) Checking direct-net.xml against network.rng ... OK 1808) Checking routed-network-no-dns.xml against network.rng ... OK 1809) Checking passthrough-pf.xml against network.rng ... OK 1810) Checking nat-network.xml against network.rng ... OK 1811) Checking nat-network-dns-forwarder-no-resolv.xml against network.rng ... OK 1812) Checking nat-network-dns-srv-record.xml against network.rng ... OK 1813) Checking dhcp6-network.xml against network.rng ... OK 1814) Checking isolated-network.xml against network.rng ... OK 1815) Checking dhcp6host-routed-network.xml against network.rng ... OK 1816) Checking nat-network-dns-local-domain.xml against network.rng ... OK 1817) Checking nat-network-dns-hosts.xml against network.rng ... OK 1818) Checking nat-network-dns-forwarders.xml against network.rng ... OK 1819) Checking open-network.xml against network.rng ... OK 1820) Checking netboot-network.xml against network.rng ... OK 1821) Checking nat-network-dns-srv-record-minimal.xml against network.rng ... OK 1822) Checking nat-network-dns-txt-record.xml against network.rng ... OK 1823) Checking netboot-proxy-network.xml against network.rng ... OK 1824) Checking nat-network-dns-forward-plain.xml against network.rng ... OK 1825) Checking routed-network.xml against network.rng ... OK 1826) Checking routed-network-no-dns.xml against network.rng ... OK 1827) Checking ptr-domains-auto.xml against network.rng ... OK 1828) Checking dhcp6-nat-network.xml against network.rng ... OK 1829) Checking nat-network.xml against network.rng ... OK 1830) Checking nat-network-dns-forwarder-no-resolv.xml against network.rng ... OK 1831) Checking nat-network-name-with-quotes.xml against network.rng ... OK 1832) test schema grammar file: nodedev.rng ... OK 1833) Checking drm_renderD129.xml against nodedev.rng ... OK 1834) Checking pci_0000_02_10_7_sriov_pf_vfs_all_header_type.xml against nodedev.rng ... OK 1835) Checking pci_0000_00_1c_0_header_type.xml against nodedev.rng ... OK 1836) Checking pci_8086_27c5_scsi_host.xml against nodedev.rng ... OK 1837) Checking usb_device_1d6b_1_0000_00_1d_0_if0.xml against nodedev.rng ... OK 1838) Checking pci_0000_02_10_7_sriov_vfs.xml against nodedev.rng ... OK 1839) Checking ccw_0_0_ffff.xml against nodedev.rng ... OK 1840) Checking pci_0000_00_02_0_header_type.xml against nodedev.rng ... OK 1841) Checking pci_0000_02_10_7_mdev_types.xml against nodedev.rng ... OK 1842) Checking pci_8086_27c5_scsi_host_scsi_device_lun0.xml against nodedev.rng ... OK 1843) Checking storage_serial_SATA_HTS721010G9SA00_MPCZ12Y0GNGWSE.xml against nodedev.rng ... OK 1844) Checking mdev_3627463d_b7f0_4fea_b468_f1da537d301b.xml against nodedev.rng ... OK 1845) Checking net_00_13_02_b9_f9_d3.xml against nodedev.rng ... OK 1846) Checking pci_0000_02_10_7_sriov_zero_vfs_max_count.xml against nodedev.rng ... OK 1847) Checking pci_8086_10c9_sriov_pf.xml against nodedev.rng ... OK 1848) Checking ccw_0_0_10000-invalid.xml against nodedev.rng ... libvirt: XML Util error : XML document failed to validate against schema: Unable to validate doc against <https://ci.centos.org/job/libvirt-master-check/systems=libvirt-centos-7/ws/…> Error validating datatype string Type int doesn't allow value '0x10000' Error validating datatype int Element devno failed to validate content Element capability failed to validate content OK 1849) Checking pci_0000_02_10_7_sriov_pf_vfs_all.xml against nodedev.rng ... OK 1850) Checking DVD_with_media.xml against nodedev.rng ... OK 1851) Checking pci_1002_71c4.xml against nodedev.rng ... OK 1852) Checking net_00_15_58_2f_e9_55.xml against nodedev.rng ... OK 1853) Checking DVD_GCC_4247N.xml against nodedev.rng ... OK 1854) Checking pci_8086_27c5_scsi_host_scsi_host.xml against nodedev.rng ... OK 1855) Checking pci_8086_4238_pcie_wireless.xml against nodedev.rng ... OK 1856) Checking scsi_target0_0_0.xml against nodedev.rng ... OK 1857) Checking computer.xml against nodedev.rng ... OK 1858) Checking usb_device_1d6b_1_0000_00_1d_0.xml against nodedev.rng ... OK 1859) Checking pci_8086_0c0c_snd_hda_intel.xml against nodedev.rng ... OK 1860) Checking pci_8086_27c5_scsi_host_0.xml against nodedev.rng ... OK 1861) Checking pci_8086_27c5_scsi_host_0_unique_id.xml against nodedev.rng ... OK 1862) Checking storage_serial_3600c0ff000d7a2a5d463ff4902000000.xml against nodedev.rng ... OK 1863) Checking pci_0000_02_10_7_sriov.xml against nodedev.rng ... OK 1864) Checking scsi_target1_0_0.xml against nodedev.rng ... OK 1865) Checking pci_82579LM_network_adapter.xml against nodedev.rng ... OK 1866) test schema grammar file: nwfilter.rng ... OK 1867) Checking tcp-ipv6-test.xml against nwfilter.rng ... OK 1868) Checking iter-test1.xml against nwfilter.rng ... OK 1869) Checking mac-test.xml against nwfilter.rng ... OK 1870) Checking udplite-test.xml against nwfilter.rng ... OK 1871) Checking udp-ipv6-test.xml against nwfilter.rng ... OK 1872) Checking all-ipv6-test.xml against nwfilter.rng ... OK 1873) Checking ipt-no-macspoof-test.xml against nwfilter.rng ... OK 1874) Checking chain_prefixtest1.xml against nwfilter.rng ... OK 1875) Checking arp-test.xml against nwfilter.rng ... OK 1876) Checking conntrack-test.xml against nwfilter.rng ... OK 1877) Checking esp-ipv6-test.xml against nwfilter.rng ... OK 1878) Checking icmp-direction2-test.xml against nwfilter.rng ... OK 1879) Checking tcp-test.xml against nwfilter.rng ... OK 1880) Checking vlan-test.xml against nwfilter.rng ... OK 1881) Checking iter-test3.xml against nwfilter.rng ... OK 1882) Checking ah-ipv6-test.xml against nwfilter.rng ... OK 1883) Checking udplite-ipv6-test.xml against nwfilter.rng ... OK 1884) Checking sctp-test.xml against nwfilter.rng ... OK 1885) Checking icmpv6-test.xml against nwfilter.rng ... OK 1886) Checking attr-value-test.xml against nwfilter.rng ... OK 1887) Checking icmp-direction3-test.xml against nwfilter.rng ... OK 1888) Checking ipv6-test.xml against nwfilter.rng ... OK 1889) Checking sctp-ipv6-test.xml against nwfilter.rng ... OK 1890) Checking ip-test.xml against nwfilter.rng ... OK 1891) Checking ipset-test.xml against nwfilter.rng ... OK 1892) Checking example-2.xml against nwfilter.rng ... OK 1893) Checking example-1.xml against nwfilter.rng ... OK 1894) Checking ref-test.xml against nwfilter.rng ... OK 1895) Checking comment-test.xml against nwfilter.rng ... OK 1896) Checking stp-test.xml against nwfilter.rng ... OK 1897) Checking all-test.xml against nwfilter.rng ... OK 1898) Checking rarp-test.xml against nwfilter.rng ... OK 1899) Checking esp-test.xml against nwfilter.rng ... OK 1900) Checking ref-rule-test.xml against nwfilter.rng ... OK 1901) Checking icmp-direction-test.xml against nwfilter.rng ... OK 1902) Checking igmp-test.xml against nwfilter.rng ... OK 1903) Checking iter-test2.xml against nwfilter.rng ... OK 1904) Checking hex-data-test.xml against nwfilter.rng ... OK 1905) Checking ah-test.xml against nwfilter.rng ... OK 1906) Checking icmp-test.xml against nwfilter.rng ... OK 1907) Checking udp-test.xml against nwfilter.rng ... OK 1908) test schema grammar file: secret.rng ... OK 1909) Checking usage-volume.xml against secret.rng ... OK 1910) Checking ephemeral-usage-volume.xml against secret.rng ... OK 1911) Checking usage-ceph.xml against secret.rng ... OK 1912) Checking usage-iscsi.xml against secret.rng ... OK 1913) Checking usage-tls.xml against secret.rng ... OK 1914) test schema grammar file: storagepool.rng ... OK 1915) Checking pool-scsi-type-scsi-host-stable.xml against storagepool.rng ... OK 1916) Checking pool-disk-device-nopartsep.xml against storagepool.rng ... OK 1917) Checking pool-dir-naming.xml against storagepool.rng ... OK 1918) Checking pool-logical.xml against storagepool.rng ... OK 1919) Checking pool-iscsi-multiiqn.xml against storagepool.rng ... OK 1920) Checking pool-mpath.xml against storagepool.rng ... OK 1921) Checking pool-netfs.xml against storagepool.rng ... OK 1922) Checking pool-gluster.xml against storagepool.rng ... OK 1923) Checking pool-dir.xml against storagepool.rng ... OK 1924) Checking pool-netfs-cifs.xml against storagepool.rng ... OK 1925) Checking pool-iscsi.xml against storagepool.rng ... OK 1926) Checking pool-netfs-gluster-without-slash.xml against storagepool.rng ... OK 1927) Checking pool-scsi-type-fc-host-managed.xml against storagepool.rng ... OK 1928) Checking pool-scsi.xml against storagepool.rng ... OK 1929) Checking pool-logical-noname.xml against storagepool.rng ... OK 1930) Checking pool-vstorage.xml against storagepool.rng ... OK 1931) Checking pool-zfs.xml against storagepool.rng ... OK 1932) Checking pool-netfs-gluster.xml against storagepool.rng ... OK 1933) Checking pool-disk.xml against storagepool.rng ... OK 1934) Checking pool-rbd.xml against storagepool.rng ... OK 1935) Checking pool-scsi-type-scsi-host.xml against storagepool.rng ... OK 1936) Checking pool-scsi-type-fc-host.xml against storagepool.rng ... OK 1937) Checking pool-fs.xml against storagepool.rng ... OK 1938) Checking pool-iscsi-vendor-product.xml against storagepool.rng ... OK 1939) Checking pool-gluster-sub.xml against storagepool.rng ... OK 1940) Checking pool-iscsi-auth.xml against storagepool.rng ... OK 1941) Checking pool-logical-nopath.xml against storagepool.rng ... OK 1942) Checking pool-zfs-sourcedev.xml against storagepool.rng ... OK 1943) Checking pool-sheepdog.xml against storagepool.rng ... OK 1944) Checking pool-logical-create.xml against storagepool.rng ... OK 1945) Checking pool-scsi-type-scsi-host-stable.xml against storagepool.rng ... OK 1946) Checking pool-disk-device-nopartsep.xml against storagepool.rng ... OK 1947) Checking pool-dir-naming.xml against storagepool.rng ... OK 1948) Checking pool-logical.xml against storagepool.rng ... OK 1949) Checking pool-iscsi-multiiqn.xml against storagepool.rng ... OK 1950) Checking pool-mpath.xml against storagepool.rng ... OK 1951) Checking pool-netfs.xml against storagepool.rng ... OK 1952) Checking pool-gluster.xml against storagepool.rng ... OK 1953) Checking pool-dir.xml against storagepool.rng ... OK 1954) Checking pool-netfs-cifs.xml against storagepool.rng ... OK 1955) Checking pool-iscsi.xml against storagepool.rng ... OK 1956) Checking pool-scsi-type-fc-host-managed.xml against storagepool.rng ... OK 1957) Checking pool-scsi.xml against storagepool.rng ... OK 1958) Checking pool-logical-noname.xml against storagepool.rng ... OK 1959) Checking pool-vstorage.xml against storagepool.rng ... OK 1960) Checking pool-zfs.xml against storagepool.rng ... OK 1961) Checking pool-netfs-gluster.xml against storagepool.rng ... OK 1962) Checking pool-disk.xml against storagepool.rng ... OK 1963) Checking pool-rbd.xml against storagepool.rng ... OK 1964) Checking pool-scsi-type-scsi-host.xml against storagepool.rng ... OK 1965) Checking pool-scsi-type-fc-host.xml against storagepool.rng ... OK 1966) Checking pool-fs.xml against storagepool.rng ... OK 1967) Checking pool-iscsi-vendor-product.xml against storagepool.rng ... OK 1968) Checking pool-gluster-sub.xml against storagepool.rng ... OK 1969) Checking pool-iscsi-auth.xml against storagepool.rng ... OK 1970) Checking pool-logical-nopath.xml against storagepool.rng ... OK 1971) Checking pool-zfs-sourcedev.xml against storagepool.rng ... OK 1972) Checking pool-sheepdog.xml against storagepool.rng ... OK 1973) Checking pool-logical-create.xml against storagepool.rng ... OK 1974) Checking dir-missing-target-path-invalid.xml against storagepool.rng ... libvirt: XML Util error : XML document failed to validate against schema: Unable to validate doc against <https://ci.centos.org/job/libvirt-master-check/systems=libvirt-centos-7/ws/…> Expecting an element path, got nothing Invalid sequence in interleave Element target failed to validate content Invalid sequence in interleave Element pool failed to validate content OK 1975) test schema grammar file: storagevol.rng ... OK 1976) Checking vol-file-iso.xml against storagevol.rng ... OK 1977) Checking vol-qcow2-nobacking.xml against storagevol.rng ... OK 1978) Checking vol-qcow2-nocapacity-backing.xml against storagevol.rng ... OK 1979) Checking vol-qcow2-1.1.xml against storagevol.rng ... OK 1980) Checking vol-qcow2-0.10-lazy.xml against storagevol.rng ... OK 1981) Checking vol-partition.xml against storagevol.rng ... OK 1982) Checking vol-qcow2-lazy.xml against storagevol.rng ... OK 1983) Checking vol-luks.xml against storagevol.rng ... OK 1984) Checking vol-luks-cipher.xml against storagevol.rng ... OK 1985) Checking vol-gluster-dir-neg-uid.xml against storagevol.rng ... OK 1986) Checking vol-logical.xml against storagevol.rng ... OK 1987) Checking vol-qcow2-zerocapacity.xml against storagevol.rng ... OK 1988) Checking vol-file-naming.xml against storagevol.rng ... OK 1989) Checking vol-file.xml against storagevol.rng ... OK 1990) Checking vol-qcow2-nocapacity.xml against storagevol.rng ... OK 1991) Checking vol-sheepdog.xml against storagevol.rng ... OK 1992) Checking vol-qcow2.xml against storagevol.rng ... OK 1993) Checking vol-gluster-dir.xml against storagevol.rng ... OK 1994) Checking vol-file-backing.xml against storagevol.rng ... OK 1995) Checking vol-qcow2-nocow.xml against storagevol.rng ... OK 1996) Checking vol-logical-backing.xml against storagevol.rng ... OK 1997) Checking vol-file-iso.xml against storagevol.rng ... OK 1998) Checking vol-qcow2-nobacking.xml against storagevol.rng ... OK 1999) Checking vol-qcow2-1.1.xml against storagevol.rng ... OK 2000) Checking vol-qcow2-0.10-lazy.xml against storagevol.rng ... OK 2001) Checking vol-partition.xml against storagevol.rng ... OK 2002) Checking vol-qcow2-lazy.xml against storagevol.rng ... OK 2003) Checking vol-luks.xml against storagevol.rng ... OK 2004) Checking vol-luks-cipher.xml against storagevol.rng ... OK 2005) Checking vol-gluster-dir-neg-uid.xml against storagevol.rng ... OK 2006) Checking vol-logical.xml against storagevol.rng ... OK 2007) Checking vol-file-naming.xml against storagevol.rng ... OK 2008) Checking vol-file.xml against storagevol.rng ... OK 2009) Checking vol-qcow2-nocapacity.xml against storagevol.rng ... OK 2010) Checking vol-sheepdog.xml against storagevol.rng ... OK 2011) Checking vol-qcow2.xml against storagevol.rng ... OK 2012) Checking vol-gluster-dir.xml against storagevol.rng ... OK 2013) Checking vol-file-backing.xml against storagevol.rng ... OK 2014) Checking vol-qcow2-nocow.xml against storagevol.rng ... OK 2015) Checking vol-logical-backing.xml against storagevol.rng ... OK 2016) Checking qcow2-no-source.xml against storagevol.rng ... OK 2017) test schema grammar file: ../news.rng ... OK 2018) Checking ../docs/news.xml against ../news.rng ... libvirt: XML Util error : XML document failed to validate against schema: Unable to validate doc against <https://ci.centos.org/job/libvirt-master-check/systems=libvirt-centos-7/ws/…> Datatype element summary has child elements Element summary failed to validate content FAILED + exit 1 Build step 'Execute shell' marked build as failure
1 1
0 0
[Libvirt-ci] Build failed in Jenkins: libvirt-master-check » libvirt-debian-9 #802
by ci@centos.org 14 Dec '17

14 Dec '17
See <https://ci.centos.org/job/libvirt-master-check/systems=libvirt-debian-9/802…> ------------------------------------------ [...truncated 176.38 KB...] 1789) Checking metadata.xml against network.rng ... OK 1790) Checking open-network.xml against network.rng ... OK 1791) Checking host-bridge-no-flood.xml against network.rng ... OK 1792) Checking nat-network-dns-forward-plain.xml against network.rng ... OK 1793) Checking nat-network-dns-srv-records.xml against network.rng ... OK 1794) Checking passthrough-pf.xml against network.rng ... OK 1795) Checking hostdev-pf.xml against network.rng ... OK 1796) Checking nat-network-dns-srv-record-minimal.xml against network.rng ... OK 1797) Checking routed-network-no-dns.xml against network.rng ... OK 1798) Checking direct-net.xml against network.rng ... OK 1799) Checking nat-network.xml against network.rng ... OK 1800) Checking nat-network-dns-txt-record.xml against network.rng ... OK 1801) Checking hostdev.xml against network.rng ... OK 1802) Checking openvswitch-net.xml against network.rng ... OK 1803) Checking nat-network-explicit-flood.xml against network.rng ... OK 1804) Checking netboot-network.xml against network.rng ... OK 1805) Checking nat-network-forward-nat-address.xml against network.rng ... OK 1806) Checking 8021Qbh-net.xml against network.rng ... OK 1807) Checking passthrough-address-crash.xml against network.rng ... OK 1808) Checking host-bridge-net.xml against network.rng ... OK 1809) Checking netboot-proxy-network.xml against network.rng ... OK 1810) Checking empty-allow-ipv6.xml against network.rng ... OK 1811) Checking nat-network-forward-nat-no-address.xml against network.rng ... OK 1812) Checking nat-network-dns-hosts.xml against network.rng ... OK 1813) Checking nat-network-dns-forwarder-no-resolv.xml against network.rng ... OK 1814) Checking nat-network-dns-local-domain.xml against network.rng ... OK 1815) Checking isolated-network.xml against network.rng ... OK 1816) Checking dhcp6host-routed-network.xml against network.rng ... OK 1817) Checking nat-network-dns-forwarders.xml against network.rng ... OK 1818) Checking routed-network.xml against network.rng ... OK 1819) Checking nat-network-dns-srv-record.xml against network.rng ... OK 1820) Checking ptr-domains-auto.xml against network.rng ... OK 1821) Checking nat-network-name-with-quotes.xml against network.rng ... OK 1822) Checking open-network.xml against network.rng ... OK 1823) Checking nat-network-dns-forward-plain.xml against network.rng ... OK 1824) Checking nat-network-dns-srv-record-minimal.xml against network.rng ... OK 1825) Checking routed-network-no-dns.xml against network.rng ... OK 1826) Checking nat-network.xml against network.rng ... OK 1827) Checking nat-network-dns-txt-record.xml against network.rng ... OK 1828) Checking dhcp6-nat-network.xml against network.rng ... OK 1829) Checking netboot-network.xml against network.rng ... OK 1830) Checking netboot-proxy-network.xml against network.rng ... OK 1831) Checking dhcp6-network.xml against network.rng ... OK 1832) test schema grammar file: nodedev.rng ... OK 1833) Checking storage_serial_SATA_HTS721010G9SA00_MPCZ12Y0GNGWSE.xml against nodedev.rng ... OK 1834) Checking usb_device_1d6b_1_0000_00_1d_0_if0.xml against nodedev.rng ... OK 1835) Checking ccw_0_0_ffff.xml against nodedev.rng ... OK 1836) Checking pci_8086_10c9_sriov_pf.xml against nodedev.rng ... OK 1837) Checking pci_8086_0c0c_snd_hda_intel.xml against nodedev.rng ... OK 1838) Checking pci_0000_02_10_7_mdev_types.xml against nodedev.rng ... OK 1839) Checking pci_0000_00_1c_0_header_type.xml against nodedev.rng ... OK 1840) Checking pci_0000_02_10_7_sriov_vfs.xml against nodedev.rng ... OK 1841) Checking pci_8086_27c5_scsi_host_0_unique_id.xml against nodedev.rng ... OK 1842) Checking pci_82579LM_network_adapter.xml against nodedev.rng ... OK 1843) Checking pci_8086_27c5_scsi_host_scsi_host.xml against nodedev.rng ... OK 1844) Checking net_00_15_58_2f_e9_55.xml against nodedev.rng ... OK 1845) Checking pci_8086_27c5_scsi_host_scsi_device_lun0.xml against nodedev.rng ... OK 1846) Checking drm_renderD129.xml against nodedev.rng ... OK 1847) Checking pci_1002_71c4.xml against nodedev.rng ... OK 1848) Checking pci_0000_02_10_7_sriov_zero_vfs_max_count.xml against nodedev.rng ... OK 1849) Checking scsi_target1_0_0.xml against nodedev.rng ... OK 1850) Checking computer.xml against nodedev.rng ... OK 1851) Checking pci_0000_02_10_7_sriov_pf_vfs_all.xml against nodedev.rng ... OK 1852) Checking DVD_with_media.xml against nodedev.rng ... OK 1853) Checking mdev_3627463d_b7f0_4fea_b468_f1da537d301b.xml against nodedev.rng ... OK 1854) Checking DVD_GCC_4247N.xml against nodedev.rng ... OK 1855) Checking storage_serial_3600c0ff000d7a2a5d463ff4902000000.xml against nodedev.rng ... OK 1856) Checking net_00_13_02_b9_f9_d3.xml against nodedev.rng ... OK 1857) Checking ccw_0_0_10000-invalid.xml against nodedev.rng ... libvirt: XML Util error : XML document failed to validate against schema: Unable to validate doc against <https://ci.centos.org/job/libvirt-master-check/systems=libvirt-debian-9/ws/…> Error validating datatype string Type int doesn't allow value '0x10000' Error validating datatype int Element devno failed to validate content Element capability failed to validate content OK 1858) Checking pci_0000_00_02_0_header_type.xml against nodedev.rng ... OK 1859) Checking pci_0000_02_10_7_sriov.xml against nodedev.rng ... OK 1860) Checking pci_8086_4238_pcie_wireless.xml against nodedev.rng ... OK 1861) Checking pci_8086_27c5_scsi_host_0.xml against nodedev.rng ... OK 1862) Checking pci_0000_02_10_7_sriov_pf_vfs_all_header_type.xml against nodedev.rng ... OK 1863) Checking pci_8086_27c5_scsi_host.xml against nodedev.rng ... OK 1864) Checking scsi_target0_0_0.xml against nodedev.rng ... OK 1865) Checking usb_device_1d6b_1_0000_00_1d_0.xml against nodedev.rng ... OK 1866) test schema grammar file: nwfilter.rng ... OK 1867) Checking iter-test1.xml against nwfilter.rng ... OK 1868) Checking mac-test.xml against nwfilter.rng ... OK 1869) Checking example-2.xml against nwfilter.rng ... OK 1870) Checking ref-rule-test.xml against nwfilter.rng ... OK 1871) Checking example-1.xml against nwfilter.rng ... OK 1872) Checking all-test.xml against nwfilter.rng ... OK 1873) Checking ah-ipv6-test.xml against nwfilter.rng ... OK 1874) Checking ah-test.xml against nwfilter.rng ... OK 1875) Checking igmp-test.xml against nwfilter.rng ... OK 1876) Checking iter-test3.xml against nwfilter.rng ... OK 1877) Checking ip-test.xml against nwfilter.rng ... OK 1878) Checking ref-test.xml against nwfilter.rng ... OK 1879) Checking ipv6-test.xml against nwfilter.rng ... OK 1880) Checking comment-test.xml against nwfilter.rng ... OK 1881) Checking arp-test.xml against nwfilter.rng ... OK 1882) Checking udp-ipv6-test.xml against nwfilter.rng ... OK 1883) Checking rarp-test.xml against nwfilter.rng ... OK 1884) Checking conntrack-test.xml against nwfilter.rng ... OK 1885) Checking sctp-test.xml against nwfilter.rng ... OK 1886) Checking tcp-test.xml against nwfilter.rng ... OK 1887) Checking icmpv6-test.xml against nwfilter.rng ... OK 1888) Checking vlan-test.xml against nwfilter.rng ... OK 1889) Checking tcp-ipv6-test.xml against nwfilter.rng ... OK 1890) Checking icmp-direction-test.xml against nwfilter.rng ... OK 1891) Checking esp-test.xml against nwfilter.rng ... OK 1892) Checking udplite-ipv6-test.xml against nwfilter.rng ... OK 1893) Checking attr-value-test.xml against nwfilter.rng ... OK 1894) Checking udplite-test.xml against nwfilter.rng ... OK 1895) Checking stp-test.xml against nwfilter.rng ... OK 1896) Checking ipset-test.xml against nwfilter.rng ... OK 1897) Checking icmp-direction2-test.xml against nwfilter.rng ... OK 1898) Checking all-ipv6-test.xml against nwfilter.rng ... OK 1899) Checking icmp-test.xml against nwfilter.rng ... OK 1900) Checking ipt-no-macspoof-test.xml against nwfilter.rng ... OK 1901) Checking sctp-ipv6-test.xml against nwfilter.rng ... OK 1902) Checking iter-test2.xml against nwfilter.rng ... OK 1903) Checking icmp-direction3-test.xml against nwfilter.rng ... OK 1904) Checking esp-ipv6-test.xml against nwfilter.rng ... OK 1905) Checking udp-test.xml against nwfilter.rng ... OK 1906) Checking hex-data-test.xml against nwfilter.rng ... OK 1907) Checking chain_prefixtest1.xml against nwfilter.rng ... OK 1908) test schema grammar file: secret.rng ... OK 1909) Checking usage-volume.xml against secret.rng ... OK 1910) Checking ephemeral-usage-volume.xml against secret.rng ... OK 1911) Checking usage-iscsi.xml against secret.rng ... OK 1912) Checking usage-tls.xml against secret.rng ... OK 1913) Checking usage-ceph.xml against secret.rng ... OK 1914) test schema grammar file: storagepool.rng ... OK 1915) Checking pool-netfs-cifs.xml against storagepool.rng ... OK 1916) Checking pool-gluster.xml against storagepool.rng ... OK 1917) Checking pool-scsi-type-fc-host.xml against storagepool.rng ... OK 1918) Checking pool-scsi-type-scsi-host.xml against storagepool.rng ... OK 1919) Checking pool-dir-naming.xml against storagepool.rng ... OK 1920) Checking pool-scsi-type-scsi-host-stable.xml against storagepool.rng ... OK 1921) Checking pool-logical-create.xml against storagepool.rng ... OK 1922) Checking pool-fs.xml against storagepool.rng ... OK 1923) Checking pool-logical-noname.xml against storagepool.rng ... OK 1924) Checking pool-zfs-sourcedev.xml against storagepool.rng ... OK 1925) Checking pool-iscsi-multiiqn.xml against storagepool.rng ... OK 1926) Checking pool-netfs-gluster.xml against storagepool.rng ... OK 1927) Checking pool-iscsi.xml against storagepool.rng ... OK 1928) Checking pool-iscsi-vendor-product.xml against storagepool.rng ... OK 1929) Checking pool-gluster-sub.xml against storagepool.rng ... OK 1930) Checking pool-logical.xml against storagepool.rng ... OK 1931) Checking pool-sheepdog.xml against storagepool.rng ... OK 1932) Checking pool-rbd.xml against storagepool.rng ... OK 1933) Checking pool-dir.xml against storagepool.rng ... OK 1934) Checking pool-vstorage.xml against storagepool.rng ... OK 1935) Checking pool-iscsi-auth.xml against storagepool.rng ... OK 1936) Checking pool-disk.xml against storagepool.rng ... OK 1937) Checking pool-scsi-type-fc-host-managed.xml against storagepool.rng ... OK 1938) Checking pool-logical-nopath.xml against storagepool.rng ... OK 1939) Checking pool-scsi.xml against storagepool.rng ... OK 1940) Checking pool-disk-device-nopartsep.xml against storagepool.rng ... OK 1941) Checking pool-zfs.xml against storagepool.rng ... OK 1942) Checking pool-netfs.xml against storagepool.rng ... OK 1943) Checking pool-netfs-gluster-without-slash.xml against storagepool.rng ... OK 1944) Checking pool-mpath.xml against storagepool.rng ... OK 1945) Checking pool-netfs-cifs.xml against storagepool.rng ... OK 1946) Checking pool-gluster.xml against storagepool.rng ... OK 1947) Checking pool-scsi-type-fc-host.xml against storagepool.rng ... OK 1948) Checking pool-scsi-type-scsi-host.xml against storagepool.rng ... OK 1949) Checking pool-dir-naming.xml against storagepool.rng ... OK 1950) Checking pool-scsi-type-scsi-host-stable.xml against storagepool.rng ... OK 1951) Checking pool-logical-create.xml against storagepool.rng ... OK 1952) Checking pool-fs.xml against storagepool.rng ... OK 1953) Checking pool-logical-noname.xml against storagepool.rng ... OK 1954) Checking pool-zfs-sourcedev.xml against storagepool.rng ... OK 1955) Checking pool-iscsi-multiiqn.xml against storagepool.rng ... OK 1956) Checking pool-netfs-gluster.xml against storagepool.rng ... OK 1957) Checking pool-iscsi.xml against storagepool.rng ... OK 1958) Checking pool-iscsi-vendor-product.xml against storagepool.rng ... OK 1959) Checking pool-gluster-sub.xml against storagepool.rng ... OK 1960) Checking pool-logical.xml against storagepool.rng ... OK 1961) Checking pool-sheepdog.xml against storagepool.rng ... OK 1962) Checking pool-rbd.xml against storagepool.rng ... OK 1963) Checking pool-dir.xml against storagepool.rng ... OK 1964) Checking pool-vstorage.xml against storagepool.rng ... OK 1965) Checking pool-iscsi-auth.xml against storagepool.rng ... OK 1966) Checking pool-disk.xml against storagepool.rng ... OK 1967) Checking pool-scsi-type-fc-host-managed.xml against storagepool.rng ... OK 1968) Checking pool-logical-nopath.xml against storagepool.rng ... OK 1969) Checking pool-scsi.xml against storagepool.rng ... OK 1970) Checking pool-disk-device-nopartsep.xml against storagepool.rng ... OK 1971) Checking pool-zfs.xml against storagepool.rng ... OK 1972) Checking pool-netfs.xml against storagepool.rng ... OK 1973) Checking pool-mpath.xml against storagepool.rng ... OK 1974) Checking dir-missing-target-path-invalid.xml against storagepool.rng ... libvirt: XML Util error : XML document failed to validate against schema: Unable to validate doc against <https://ci.centos.org/job/libvirt-master-check/systems=libvirt-debian-9/ws/…> Expecting an element path, got nothing Invalid sequence in interleave Element target failed to validate content Invalid sequence in interleave Element pool failed to validate content OK 1975) test schema grammar file: storagevol.rng ... OK 1976) Checking vol-gluster-dir-neg-uid.xml against storagevol.rng ... OK 1977) Checking vol-file.xml against storagevol.rng ... OK 1978) Checking vol-qcow2-0.10-lazy.xml against storagevol.rng ... OK 1979) Checking vol-gluster-dir.xml against storagevol.rng ... OK 1980) Checking vol-qcow2.xml against storagevol.rng ... OK 1981) Checking vol-file-backing.xml against storagevol.rng ... OK 1982) Checking vol-file-naming.xml against storagevol.rng ... OK 1983) Checking vol-sheepdog.xml against storagevol.rng ... OK 1984) Checking vol-qcow2-lazy.xml against storagevol.rng ... OK 1985) Checking vol-qcow2-1.1.xml against storagevol.rng ... OK 1986) Checking vol-qcow2-nocapacity.xml against storagevol.rng ... OK 1987) Checking vol-luks.xml against storagevol.rng ... OK 1988) Checking vol-logical-backing.xml against storagevol.rng ... OK 1989) Checking vol-qcow2-zerocapacity.xml against storagevol.rng ... OK 1990) Checking vol-luks-cipher.xml against storagevol.rng ... OK 1991) Checking vol-file-iso.xml against storagevol.rng ... OK 1992) Checking vol-qcow2-nocapacity-backing.xml against storagevol.rng ... OK 1993) Checking vol-qcow2-nocow.xml against storagevol.rng ... OK 1994) Checking vol-partition.xml against storagevol.rng ... OK 1995) Checking vol-qcow2-nobacking.xml against storagevol.rng ... OK 1996) Checking vol-logical.xml against storagevol.rng ... OK 1997) Checking vol-gluster-dir-neg-uid.xml against storagevol.rng ... OK 1998) Checking vol-file.xml against storagevol.rng ... OK 1999) Checking vol-qcow2-0.10-lazy.xml against storagevol.rng ... OK 2000) Checking vol-gluster-dir.xml against storagevol.rng ... OK 2001) Checking vol-qcow2.xml against storagevol.rng ... OK 2002) Checking vol-file-backing.xml against storagevol.rng ... OK 2003) Checking vol-file-naming.xml against storagevol.rng ... OK 2004) Checking vol-sheepdog.xml against storagevol.rng ... OK 2005) Checking vol-qcow2-lazy.xml against storagevol.rng ... OK 2006) Checking vol-qcow2-1.1.xml against storagevol.rng ... OK 2007) Checking vol-qcow2-nocapacity.xml against storagevol.rng ... OK 2008) Checking vol-luks.xml against storagevol.rng ... OK 2009) Checking vol-logical-backing.xml against storagevol.rng ... OK 2010) Checking vol-luks-cipher.xml against storagevol.rng ... OK 2011) Checking vol-file-iso.xml against storagevol.rng ... OK 2012) Checking vol-qcow2-nocow.xml against storagevol.rng ... OK 2013) Checking vol-partition.xml against storagevol.rng ... OK 2014) Checking vol-qcow2-nobacking.xml against storagevol.rng ... OK 2015) Checking vol-logical.xml against storagevol.rng ... OK 2016) Checking qcow2-no-source.xml against storagevol.rng ... OK 2017) test schema grammar file: ../news.rng ... OK 2018) Checking ../docs/news.xml against ../news.rng ... libvirt: XML Util error : XML document failed to validate against schema: Unable to validate doc against <https://ci.centos.org/job/libvirt-master-check/systems=libvirt-debian-9/ws/…> Datatype element summary has child elements Element summary failed to validate content FAILED FAIL virschematest (exit status: 1) + exit 1 Build step 'Execute shell' marked build as failure
1 1
0 0
[Libvirt-ci] Build failed in Jenkins: libvirt-master-check » libvirt-centos-6 #802
by ci@centos.org 14 Dec '17

14 Dec '17
See <https://ci.centos.org/job/libvirt-master-check/systems=libvirt-centos-6/802…> ------------------------------------------ [...truncated 616.80 KB...] PASS: cputest TEST: metadatatest 1) Assign metadata ... OK 2) Rewrite Metadata ... OK 3) Erase metadata ... libvirt: Domain Config error : metadata not found: Requested metadata element is not present OK 4) text metadata: TITLE 1 ... OK 5) text metadata: TITLE 2 ... libvirt: Domain Config error : metadata not found: Requested metadata element is not present libvirt: Domain Config error : metadata not found: Requested metadata element is not present OK 6) text metadata: TITLE 3 ... OK 7) text metadata: TITLE 4 ... libvirt: Domain Config error : metadata title can't contain newlines libvirt: Domain Config error : metadata title can't contain newlines OK 8) text metadata: TITLE 5 ... OK 9) text metadata: TITLE 6 ... libvirt: Domain Config error : metadata title can't contain newlines libvirt: Domain Config error : metadata title can't contain newlines OK 10) text metadata: TITLE 7 ... libvirt: Domain Config error : metadata title can't contain newlines libvirt: Domain Config error : metadata title can't contain newlines OK 11) text metadata: DESCRIPTION 1 ... OK 12) text metadata: DESCRIPTION 2 ... libvirt: Domain Config error : metadata not found: Requested metadata element is not present libvirt: Domain Config error : metadata not found: Requested metadata element is not present OK 13) text metadata: DESCRIPTION 3 ... OK 14) text metadata: DESCRIPTION 4 ... OK 15) text metadata: DESCRIPTION 5 ... OK PASS: metadatatest TEST: secretxml2xmltest 1) Secret XML->XML ephemeral-usage-volume ... OK 2) Secret XML->XML usage-volume ... OK 3) Secret XML->XML usage-ceph ... OK 4) Secret XML->XML usage-iscsi ... OK 5) Secret XML->XML usage-tls ... OK PASS: secretxml2xmltest TEST: genericxml2xmltest Generic driver capabilities: <capabilities> <host> <cpu> <arch>x86_64</arch> </cpu> <power_management/> </host> <guest> <os_type>hvm</os_type> <arch name='i686'> <wordsize>32</wordsize> <emulator>/usr/bin/acme-virt</emulator> <domain type='test'/> </arch> </guest> <guest> <os_type>hvm</os_type> <arch name='x86_64'> <wordsize>64</wordsize> <emulator>/usr/bin/acme-virt</emulator> <domain type='test'/> </arch> </guest> </capabilities> 1) GENERIC XML-2-XML disk-virtio ... OK 2) GENERIC XML-2-XML graphics-vnc-minimal ... OK 3) GENERIC XML-2-XML graphics-vnc-manual-port ... OK 4) GENERIC XML-2-XML graphics-vnc-socket ... OK 5) GENERIC XML-2-XML graphics-vnc-socket-listen ... OK 6) GENERIC XML-2-XML graphics-listen-back-compat ... OK 7) GENERIC XML-2-XML graphics-listen-back-compat-mismatch ... Got expected failure code=1 msg=unsupported configuration: graphics 'listen' attribute '192.168.123.123' must match 'address' attribute of first listen element (found '1.2.3.4')libvirt: Domain Config error : unsupported configuration: graphics 'listen' attribute '192.168.123.123' must match 'address' attribute of first listen element (found '1.2.3.4') OK 8) GENERIC XML-2-XML graphics-vnc-listen-attr-only ... OK 9) GENERIC XML-2-XML graphics-vnc-listen-element-minimal ... OK 10) GENERIC XML-2-XML graphics-vnc-listen-element-with-address ... OK 11) GENERIC XML-2-XML graphics-vnc-socket-attr-listen-address ... OK 12) GENERIC XML-2-XML graphics-vnc-socket-attr-listen-socket ... OK 13) GENERIC XML-2-XML graphics-vnc-socket-attr-listen-socket-mismatch ... Got expected failure code=1 msg=unsupported configuration: graphics 'socket' attribute '/tmp/vnc.sock' must match 'socket' attribute of first listen element (found '/tmp/mismatch.sock')libvirt: Domain Config error : unsupported configuration: graphics 'socket' attribute '/tmp/vnc.sock' must match 'socket' attribute of first listen element (found '/tmp/mismatch.sock') OK 14) GENERIC XML-2-XML graphics-vnc-autoport-no ... OK 15) GENERIC XML-2-XML name-slash-fail ... Got expected failure code=1 msg=XML error: name foo/bar cannot contain '/'libvirt: Domain Config error : XML error: name foo/bar cannot contain '/' OK 16) GENERIC XML-2-XML perf ... OK 17) GENERIC XML-2-XML vcpus-individual ... OK 18) GENERIC XML-2-XML disk-network-http ... OK 19) GENERIC XML-2-XML cpu-cache-emulate ... OK 20) GENERIC XML-2-XML cpu-cache-passthrough ... OK 21) GENERIC XML-2-XML cpu-cache-disable ... OK 22) GENERIC XML-2-XML chardev-tcp ... OK 23) GENERIC XML-2-XML chardev-tcp-missing-host ... Got expected failure code=1 msg=internal error: Missing source host attribute for char devicelibvirt: Domain Config error : internal error: Missing source host attribute for char device OK 24) GENERIC XML-2-XML chardev-tcp-missing-service ... Got expected failure code=1 msg=internal error: Missing source service attribute for char devicelibvirt: Domain Config error : internal error: Missing source service attribute for char device OK 25) GENERIC XML-2-XML chardev-tcp-multiple-source ... Got expected failure code=1 msg=XML error: only one source element is allowed for character devicelibvirt: Domain Config error : XML error: only one source element is allowed for character device OK 26) GENERIC XML-2-XML chardev-udp ... OK 27) GENERIC XML-2-XML chardev-udp-missing-connect-service ... Got expected failure code=1 msg=internal error: Missing source service attribute for char devicelibvirt: Domain Config error : internal error: Missing source service attribute for char device OK 28) GENERIC XML-2-XML chardev-udp-multiple-source ... Got expected failure code=1 msg=XML error: only two source elements are allowed for character devicelibvirt: Domain Config error : XML error: only two source elements are allowed for character device OK 29) GENERIC XML-2-XML chardev-unix ... OK 30) GENERIC XML-2-XML chardev-unix-smartcard-missing-path ... Got expected failure code=1 msg=internal error: Missing source path attribute for char devicelibvirt: Domain Config error : internal error: Missing source path attribute for char device OK 31) GENERIC XML-2-XML chardev-unix-redirdev-missing-path ... Got expected failure code=1 msg=internal error: Missing source path attribute for char devicelibvirt: Domain Config error : internal error: Missing source path attribute for char device OK 32) GENERIC XML-2-XML chardev-unix-rng-missing-path ... Got expected failure code=1 msg=internal error: Missing source path attribute for char devicelibvirt: Domain Config error : internal error: Missing source path attribute for char device OK 33) GENERIC XML-2-XML chardev-reconnect ... OK 34) GENERIC XML-2-XML chardev-reconnect-missing-timeout ... Got expected failure code=1 msg=XML error: missing timeout for chardev with reconnect enabledlibvirt: Domain Config error : XML error: missing timeout for chardev with reconnect enabled OK 35) GENERIC XML-2-XML chardev-reconnect-invalid-mode ... Got expected failure code=1 msg=internal error: chardev reconnect is possible only for connect modelibvirt: Domain Config error : internal error: chardev reconnect is possible only for connect mode OK PASS: genericxml2xmltest TEST: virusbtest 1) USBDeviceFind Nexus ... OK 2) USBDeviceFind Nexus wrong devnum ... libvirt: error : internal error: Did not find USB device 18d1:4e22 bus:1 device:25 OK 3) USBDeviceFind Bogus ... libvirt: error : internal error: Did not find USB device f00d:beef bus:1024 device:768 OK 4) USBDeviceFind integrated camera ... OK 5) USBDeviceFind wrong bus/devno combination ... libvirt: error : internal error: Did not find USB device bus:2 device:20 OK 6) USBDeviceFind missing bus ... libvirt: error : internal error: Did not find USB device bus:5 device:20 OK 7) USBDeviceFind missing devnum ... libvirt: error : internal error: Did not find USB device bus:1 device:158 OK 8) USBDeviceFind Nexus (multiple results) ... OK 9) USBDeviceFind Bogus vendor and product ... libvirt: error : internal error: Did not find USB device f00d:beef OK 10) USBDeviceFind Valid vendor ... libvirt: error : internal error: Did not find USB device 1d6b:beef OK 11) USB List test ... OK PASS: virusbtest TEST: virnetdevbandwidthtest 1) virNetDevBandwidthSet ... OK 2) virNetDevBandwidthSet ... OK 3) virNetDevBandwidthSet ... OK 4) virNetDevBandwidthSet ... OK 5) virNetDevBandwidthSet ... OK PASS: virnetdevbandwidthtest TEST: eventtest 1) Simple write ... OK 2) Deleted before poll ... OK 3) Interrupted during poll ... OK 4) Deleted during dispatch ... OK 5) Deleted during dispatch ... OK 6) Firing a timer ... OK 7) Deleted before poll ... OK 8) Interrupted during poll ... OK 9) Deleted during dispatch ... OK 10) Deleted during dispatch ... OK 11) Simple write ... OK 12) Simple write ... OK 13) Simple write ... OK 14) Simple write ... OK 15) Write duplicate ... OK PASS: eventtest TEST: virdrivermoduletest 1) Test driver "network" ... OK 2) Test driver "interface" ... OK 3) Test driver "storage" ... OK 4) Test driver "nodedev" ... OK 5) Test driver "secret" ... OK 6) Test driver "nwfilter" ... OK 7) Test driver "qemu" ... OK 8) Test driver "lxc" ... OK 9) Test driver "uml" ... OK 10) Test driver "vbox" ... OK PASS: virdrivermoduletest TEST: objecteventtest 1) Domain createXML start event (old API) ... OK 2) Domain createXML start event (new API) ... OK 3) Domain createXML start event (both API) ... libvirt: Test Driver error : Domain not found: no domain with matching uuid '77a6fc12-07b5-9415-8abb-a803613f2a40' (test-domain) OK 4) Domain (un)define events ... OK 5) Domain start stop events ... OK 6) Network createXML start event ... OK 7) Network (un)define events ... OK 8) Network start stop events ... OK 9) Storage pool createXML start event ... OK 10) Storage pool (un)define events ... OK 11) Storage pool start stop events ... OK 12) Storage pool build event ... OK 13) Storage pool delete event ... OK 14) Node device createXML add event ... OK PASS: objecteventtest TEST: virmacmaptest 1) Lookup "none" in "empty" ... OK 2) Remove "none" in "empty" ... OK 3) Lookup "f24" in "simple" ... OK 4) Remove "f24" in "simple" ... OK 5) Lookup "f24" in "simple2" ... OK 6) Remove "f24" in "simple2" ... OK 7) Lookup "f25" in "simple2" ... OK 8) Remove "f25" in "simple2" ... OK 9) Flush "empty" ... OK 10) Flush "simple" ... OK 11) Flush "simple2" ... OK 12) Flush "complex" ... OK PASS: virmacmaptest PASS: libvirtd-fail PASS: libvirtd-pool PASS: virsh-cpuset PASS: virsh-define-dev-segfault PASS: virsh-int-overflow PASS: virsh-optparse PASS: virsh-read-bufsiz PASS: virsh-read-non-seekable PASS: virsh-schedinfo 1) ../../tests/virsh-self-test ... OK PASS: virsh-self-test 1) ../../tests/virt-admin-self-test ... OK PASS: virt-admin-self-test PASS: virsh-start PASS: virsh-undefine Running '<https://ci.centos.org/job/libvirt-master-check/systems=libvirt-centos-6/ws/…> "connect; uri"' 1) User config file ... OK Running '<https://ci.centos.org/job/libvirt-master-check/systems=libvirt-centos-6/ws/…> "uri"' 2) User config file ... OK Running '<https://ci.centos.org/job/libvirt-master-check/systems=libvirt-centos-6/ws/…> "connect; uri"' 3) LIBVIRT_DEFAULT_URI ... OK Running '<https://ci.centos.org/job/libvirt-master-check/systems=libvirt-centos-6/ws/…> "uri"' 4) LIBVIRT_DEFAULT_URI ... OK Running '<https://ci.centos.org/job/libvirt-master-check/systems=libvirt-centos-6/ws/…> "connect; uri"' 5) VIRSH_DEFAULT_CONNECT_URI ... OK Running '<https://ci.centos.org/job/libvirt-master-check/systems=libvirt-centos-6/ws/…> "uri"' 6) VIRSH_DEFAULT_CONNECT_URI ... OK Running '<https://ci.centos.org/job/libvirt-master-check/systems=libvirt-centos-6/ws/…> --connect test:///default?good_uri "connect; uri"' 7) Parameter ... OK Running '<https://ci.centos.org/job/libvirt-master-check/systems=libvirt-centos-6/ws/…> --connect test:///default?good_uri "uri"' 8) Parameter ... OK PASS: virsh-uriprecedence PASS: virsh-vcpupin ======================================= 1 of 121 tests failed Please report to libvir-list(a)redhat.com ======================================= make[2]: *** [check-TESTS] Error 1 make[2]: Leaving directory `<https://ci.centos.org/job/libvirt-master-check/systems=libvirt-centos-6/ws/…'> make[1]: *** [check-am] Error 2 make[1]: Leaving directory `<https://ci.centos.org/job/libvirt-master-check/systems=libvirt-centos-6/ws/…'> make: *** [check-recursive] Error 1 + cat tests/test-suite.log cat: tests/test-suite.log: No such file or directory + true + exit 1 Build step 'Execute shell' marked build as failure
1 1
0 0
[Libvirt-ci] Build failed in Jenkins: libvirt-master-check » libvirt-debian-8 #802
by ci@centos.org 14 Dec '17

14 Dec '17
See <https://ci.centos.org/job/libvirt-master-check/systems=libvirt-debian-8/802…> ------------------------------------------ [...truncated 176.66 KB...] 1792) Checking nat-network-forward-nat-no-address.xml against network.rng ... OK 1793) Checking routed-network.xml against network.rng ... OK 1794) Checking passthrough-address-crash.xml against network.rng ... OK 1795) Checking netboot-proxy-network.xml against network.rng ... OK 1796) Checking nat-network-dns-forwarders.xml against network.rng ... OK 1797) Checking metadata.xml against network.rng ... OK 1798) Checking openvswitch-net.xml against network.rng ... OK 1799) Checking empty-allow-ipv6.xml against network.rng ... OK 1800) Checking nat-network-dns-srv-records.xml against network.rng ... OK 1801) Checking hostdev.xml against network.rng ... OK 1802) Checking set-mtu.xml against network.rng ... OK 1803) Checking nat-network-forward-nat-address.xml against network.rng ... OK 1804) Checking host-bridge-no-flood.xml against network.rng ... OK 1805) Checking nat-network-dns-srv-record.xml against network.rng ... OK 1806) Checking host-bridge-net.xml against network.rng ... OK 1807) Checking hostdev-pf.xml against network.rng ... OK 1808) Checking nat-network-dns-forwarder-no-resolv.xml against network.rng ... OK 1809) Checking bandwidth-network.xml against network.rng ... OK 1810) Checking isolated-network.xml against network.rng ... OK 1811) Checking passthrough-pf.xml against network.rng ... OK 1812) Checking nat-network-dns-forward-plain.xml against network.rng ... OK 1813) Checking dhcp6host-routed-network.xml against network.rng ... OK 1814) Checking routed-network-no-dns.xml against network.rng ... OK 1815) Checking nat-network-name-with-quotes.xml against network.rng ... OK 1816) Checking ptr-domains-auto.xml against network.rng ... OK 1817) Checking nat-network-dns-txt-record.xml against network.rng ... OK 1818) Checking nat-network-dns-hosts.xml against network.rng ... OK 1819) Checking nat-network.xml against network.rng ... OK 1820) Checking nat-network-dns-srv-record-minimal.xml against network.rng ... OK 1821) Checking netboot-network.xml against network.rng ... OK 1822) Checking open-network.xml against network.rng ... OK 1823) Checking routed-network.xml against network.rng ... OK 1824) Checking netboot-proxy-network.xml against network.rng ... OK 1825) Checking nat-network-dns-local-domain.xml against network.rng ... OK 1826) Checking dhcp6-network.xml against network.rng ... OK 1827) Checking nat-network-dns-forwarders.xml against network.rng ... OK 1828) Checking nat-network-dns-srv-record.xml against network.rng ... OK 1829) Checking nat-network-dns-forwarder-no-resolv.xml against network.rng ... OK 1830) Checking isolated-network.xml against network.rng ... OK 1831) Checking dhcp6-nat-network.xml against network.rng ... OK 1832) test schema grammar file: nodedev.rng ... OK 1833) Checking storage_serial_SATA_HTS721010G9SA00_MPCZ12Y0GNGWSE.xml against nodedev.rng ... OK 1834) Checking pci_8086_27c5_scsi_host_0.xml against nodedev.rng ... OK 1835) Checking pci_0000_00_02_0_header_type.xml against nodedev.rng ... OK 1836) Checking scsi_target1_0_0.xml against nodedev.rng ... OK 1837) Checking pci_8086_4238_pcie_wireless.xml against nodedev.rng ... OK 1838) Checking storage_serial_3600c0ff000d7a2a5d463ff4902000000.xml against nodedev.rng ... OK 1839) Checking pci_8086_10c9_sriov_pf.xml against nodedev.rng ... OK 1840) Checking usb_device_1d6b_1_0000_00_1d_0_if0.xml against nodedev.rng ... OK 1841) Checking pci_8086_27c5_scsi_host.xml against nodedev.rng ... OK 1842) Checking computer.xml against nodedev.rng ... OK 1843) Checking pci_0000_02_10_7_sriov_zero_vfs_max_count.xml against nodedev.rng ... OK 1844) Checking ccw_0_0_ffff.xml against nodedev.rng ... OK 1845) Checking pci_0000_02_10_7_mdev_types.xml against nodedev.rng ... OK 1846) Checking drm_renderD129.xml against nodedev.rng ... OK 1847) Checking mdev_3627463d_b7f0_4fea_b468_f1da537d301b.xml against nodedev.rng ... OK 1848) Checking DVD_with_media.xml against nodedev.rng ... OK 1849) Checking ccw_0_0_10000-invalid.xml against nodedev.rng ... libvirt: XML Util error : XML document failed to validate against schema: Unable to validate doc against <https://ci.centos.org/job/libvirt-master-check/systems=libvirt-debian-8/ws/…> Error validating datatype string Type int doesn't allow value '0x10000' Error validating datatype int Element devno failed to validate content Element capability failed to validate content OK 1850) Checking pci_0000_02_10_7_sriov_pf_vfs_all_header_type.xml against nodedev.rng ... OK 1851) Checking pci_0000_02_10_7_sriov_vfs.xml against nodedev.rng ... OK 1852) Checking net_00_13_02_b9_f9_d3.xml against nodedev.rng ... OK 1853) Checking pci_0000_02_10_7_sriov.xml against nodedev.rng ... OK 1854) Checking usb_device_1d6b_1_0000_00_1d_0.xml against nodedev.rng ... OK 1855) Checking pci_82579LM_network_adapter.xml against nodedev.rng ... OK 1856) Checking pci_0000_00_1c_0_header_type.xml against nodedev.rng ... OK 1857) Checking pci_8086_27c5_scsi_host_0_unique_id.xml against nodedev.rng ... OK 1858) Checking net_00_15_58_2f_e9_55.xml against nodedev.rng ... OK 1859) Checking pci_8086_27c5_scsi_host_scsi_host.xml against nodedev.rng ... OK 1860) Checking pci_8086_27c5_scsi_host_scsi_device_lun0.xml against nodedev.rng ... OK 1861) Checking DVD_GCC_4247N.xml against nodedev.rng ... OK 1862) Checking scsi_target0_0_0.xml against nodedev.rng ... OK 1863) Checking pci_0000_02_10_7_sriov_pf_vfs_all.xml against nodedev.rng ... OK 1864) Checking pci_8086_0c0c_snd_hda_intel.xml against nodedev.rng ... OK 1865) Checking pci_1002_71c4.xml against nodedev.rng ... OK 1866) test schema grammar file: nwfilter.rng ... OK 1867) Checking all-test.xml against nwfilter.rng ... OK 1868) Checking vlan-test.xml against nwfilter.rng ... OK 1869) Checking igmp-test.xml against nwfilter.rng ... OK 1870) Checking conntrack-test.xml against nwfilter.rng ... OK 1871) Checking ip-test.xml against nwfilter.rng ... OK 1872) Checking attr-value-test.xml against nwfilter.rng ... OK 1873) Checking ah-test.xml against nwfilter.rng ... OK 1874) Checking comment-test.xml against nwfilter.rng ... OK 1875) Checking icmpv6-test.xml against nwfilter.rng ... OK 1876) Checking tcp-ipv6-test.xml against nwfilter.rng ... OK 1877) Checking arp-test.xml against nwfilter.rng ... OK 1878) Checking udp-ipv6-test.xml against nwfilter.rng ... OK 1879) Checking udplite-ipv6-test.xml against nwfilter.rng ... OK 1880) Checking sctp-test.xml against nwfilter.rng ... OK 1881) Checking all-ipv6-test.xml against nwfilter.rng ... OK 1882) Checking stp-test.xml against nwfilter.rng ... OK 1883) Checking udp-test.xml against nwfilter.rng ... OK 1884) Checking rarp-test.xml against nwfilter.rng ... OK 1885) Checking ipv6-test.xml against nwfilter.rng ... OK 1886) Checking esp-test.xml against nwfilter.rng ... OK 1887) Checking icmp-direction-test.xml against nwfilter.rng ... OK 1888) Checking iter-test2.xml against nwfilter.rng ... OK 1889) Checking ref-rule-test.xml against nwfilter.rng ... OK 1890) Checking udplite-test.xml against nwfilter.rng ... OK 1891) Checking icmp-direction2-test.xml against nwfilter.rng ... OK 1892) Checking ref-test.xml against nwfilter.rng ... OK 1893) Checking example-2.xml against nwfilter.rng ... OK 1894) Checking mac-test.xml against nwfilter.rng ... OK 1895) Checking icmp-direction3-test.xml against nwfilter.rng ... OK 1896) Checking esp-ipv6-test.xml against nwfilter.rng ... OK 1897) Checking chain_prefixtest1.xml against nwfilter.rng ... OK 1898) Checking iter-test3.xml against nwfilter.rng ... OK 1899) Checking icmp-test.xml against nwfilter.rng ... OK 1900) Checking tcp-test.xml against nwfilter.rng ... OK 1901) Checking example-1.xml against nwfilter.rng ... OK 1902) Checking iter-test1.xml against nwfilter.rng ... OK 1903) Checking hex-data-test.xml against nwfilter.rng ... OK 1904) Checking ipset-test.xml against nwfilter.rng ... OK 1905) Checking ipt-no-macspoof-test.xml against nwfilter.rng ... OK 1906) Checking sctp-ipv6-test.xml against nwfilter.rng ... OK 1907) Checking ah-ipv6-test.xml against nwfilter.rng ... OK 1908) test schema grammar file: secret.rng ... OK 1909) Checking usage-volume.xml against secret.rng ... OK 1910) Checking ephemeral-usage-volume.xml against secret.rng ... OK 1911) Checking usage-iscsi.xml against secret.rng ... OK 1912) Checking usage-ceph.xml against secret.rng ... OK 1913) Checking usage-tls.xml against secret.rng ... OK 1914) test schema grammar file: storagepool.rng ... OK 1915) Checking pool-zfs.xml against storagepool.rng ... OK 1916) Checking pool-rbd.xml against storagepool.rng ... OK 1917) Checking pool-scsi-type-fc-host-managed.xml against storagepool.rng ... OK 1918) Checking pool-disk-device-nopartsep.xml against storagepool.rng ... OK 1919) Checking pool-netfs-cifs.xml against storagepool.rng ... OK 1920) Checking pool-scsi.xml against storagepool.rng ... OK 1921) Checking pool-disk.xml against storagepool.rng ... OK 1922) Checking pool-logical.xml against storagepool.rng ... OK 1923) Checking pool-logical-noname.xml against storagepool.rng ... OK 1924) Checking pool-netfs-gluster.xml against storagepool.rng ... OK 1925) Checking pool-dir-naming.xml against storagepool.rng ... OK 1926) Checking pool-scsi-type-scsi-host-stable.xml against storagepool.rng ... OK 1927) Checking pool-vstorage.xml against storagepool.rng ... OK 1928) Checking pool-gluster-sub.xml against storagepool.rng ... OK 1929) Checking pool-scsi-type-scsi-host.xml against storagepool.rng ... OK 1930) Checking pool-zfs-sourcedev.xml against storagepool.rng ... OK 1931) Checking pool-iscsi.xml against storagepool.rng ... OK 1932) Checking pool-iscsi-auth.xml against storagepool.rng ... OK 1933) Checking pool-netfs-gluster-without-slash.xml against storagepool.rng ... OK 1934) Checking pool-logical-nopath.xml against storagepool.rng ... OK 1935) Checking pool-fs.xml against storagepool.rng ... OK 1936) Checking pool-gluster.xml against storagepool.rng ... OK 1937) Checking pool-mpath.xml against storagepool.rng ... OK 1938) Checking pool-dir.xml against storagepool.rng ... OK 1939) Checking pool-iscsi-multiiqn.xml against storagepool.rng ... OK 1940) Checking pool-logical-create.xml against storagepool.rng ... OK 1941) Checking pool-iscsi-vendor-product.xml against storagepool.rng ... OK 1942) Checking pool-scsi-type-fc-host.xml against storagepool.rng ... OK 1943) Checking pool-netfs.xml against storagepool.rng ... OK 1944) Checking pool-sheepdog.xml against storagepool.rng ... OK 1945) Checking pool-zfs.xml against storagepool.rng ... OK 1946) Checking pool-rbd.xml against storagepool.rng ... OK 1947) Checking pool-scsi-type-fc-host-managed.xml against storagepool.rng ... OK 1948) Checking pool-disk-device-nopartsep.xml against storagepool.rng ... OK 1949) Checking pool-netfs-cifs.xml against storagepool.rng ... OK 1950) Checking pool-scsi.xml against storagepool.rng ... OK 1951) Checking pool-disk.xml against storagepool.rng ... OK 1952) Checking pool-logical.xml against storagepool.rng ... OK 1953) Checking pool-logical-noname.xml against storagepool.rng ... OK 1954) Checking pool-netfs-gluster.xml against storagepool.rng ... OK 1955) Checking pool-dir-naming.xml against storagepool.rng ... OK 1956) Checking pool-scsi-type-scsi-host-stable.xml against storagepool.rng ... OK 1957) Checking pool-vstorage.xml against storagepool.rng ... OK 1958) Checking pool-gluster-sub.xml against storagepool.rng ... OK 1959) Checking pool-scsi-type-scsi-host.xml against storagepool.rng ... OK 1960) Checking pool-zfs-sourcedev.xml against storagepool.rng ... OK 1961) Checking pool-iscsi.xml against storagepool.rng ... OK 1962) Checking pool-iscsi-auth.xml against storagepool.rng ... OK 1963) Checking pool-logical-nopath.xml against storagepool.rng ... OK 1964) Checking pool-fs.xml against storagepool.rng ... OK 1965) Checking pool-gluster.xml against storagepool.rng ... OK 1966) Checking pool-mpath.xml against storagepool.rng ... OK 1967) Checking pool-dir.xml against storagepool.rng ... OK 1968) Checking pool-iscsi-multiiqn.xml against storagepool.rng ... OK 1969) Checking pool-logical-create.xml against storagepool.rng ... OK 1970) Checking pool-iscsi-vendor-product.xml against storagepool.rng ... OK 1971) Checking pool-scsi-type-fc-host.xml against storagepool.rng ... OK 1972) Checking pool-netfs.xml against storagepool.rng ... OK 1973) Checking pool-sheepdog.xml against storagepool.rng ... OK 1974) Checking dir-missing-target-path-invalid.xml against storagepool.rng ... libvirt: XML Util error : XML document failed to validate against schema: Unable to validate doc against <https://ci.centos.org/job/libvirt-master-check/systems=libvirt-debian-8/ws/…> Expecting an element path, got nothing Invalid sequence in interleave Element target failed to validate content Invalid sequence in interleave Element pool failed to validate content OK 1975) test schema grammar file: storagevol.rng ... OK 1976) Checking vol-qcow2.xml against storagevol.rng ... OK 1977) Checking vol-file-naming.xml against storagevol.rng ... OK 1978) Checking vol-qcow2-1.1.xml against storagevol.rng ... OK 1979) Checking vol-qcow2-0.10-lazy.xml against storagevol.rng ... OK 1980) Checking vol-qcow2-nocapacity.xml against storagevol.rng ... OK 1981) Checking vol-partition.xml against storagevol.rng ... OK 1982) Checking vol-luks-cipher.xml against storagevol.rng ... OK 1983) Checking vol-file.xml against storagevol.rng ... OK 1984) Checking vol-logical-backing.xml against storagevol.rng ... OK 1985) Checking vol-qcow2-nocapacity-backing.xml against storagevol.rng ... OK 1986) Checking vol-logical.xml against storagevol.rng ... OK 1987) Checking vol-qcow2-nocow.xml against storagevol.rng ... OK 1988) Checking vol-qcow2-lazy.xml against storagevol.rng ... OK 1989) Checking vol-luks.xml against storagevol.rng ... OK 1990) Checking vol-qcow2-nobacking.xml against storagevol.rng ... OK 1991) Checking vol-sheepdog.xml against storagevol.rng ... OK 1992) Checking vol-gluster-dir-neg-uid.xml against storagevol.rng ... OK 1993) Checking vol-file-iso.xml against storagevol.rng ... OK 1994) Checking vol-file-backing.xml against storagevol.rng ... OK 1995) Checking vol-gluster-dir.xml against storagevol.rng ... OK 1996) Checking vol-qcow2-zerocapacity.xml against storagevol.rng ... OK 1997) Checking vol-qcow2.xml against storagevol.rng ... OK 1998) Checking vol-file-naming.xml against storagevol.rng ... OK 1999) Checking vol-qcow2-1.1.xml against storagevol.rng ... OK 2000) Checking vol-qcow2-0.10-lazy.xml against storagevol.rng ... OK 2001) Checking vol-qcow2-nocapacity.xml against storagevol.rng ... OK 2002) Checking vol-partition.xml against storagevol.rng ... OK 2003) Checking vol-luks-cipher.xml against storagevol.rng ... OK 2004) Checking vol-file.xml against storagevol.rng ... OK 2005) Checking vol-logical-backing.xml against storagevol.rng ... OK 2006) Checking vol-logical.xml against storagevol.rng ... OK 2007) Checking vol-qcow2-nocow.xml against storagevol.rng ... OK 2008) Checking vol-qcow2-lazy.xml against storagevol.rng ... OK 2009) Checking vol-luks.xml against storagevol.rng ... OK 2010) Checking vol-qcow2-nobacking.xml against storagevol.rng ... OK 2011) Checking vol-sheepdog.xml against storagevol.rng ... OK 2012) Checking vol-gluster-dir-neg-uid.xml against storagevol.rng ... OK 2013) Checking vol-file-iso.xml against storagevol.rng ... OK 2014) Checking vol-file-backing.xml against storagevol.rng ... OK 2015) Checking vol-gluster-dir.xml against storagevol.rng ... OK 2016) Checking qcow2-no-source.xml against storagevol.rng ... OK 2017) test schema grammar file: ../news.rng ... OK 2018) Checking ../docs/news.xml against ../news.rng ... libvirt: XML Util error : XML document failed to validate against schema: Unable to validate doc against <https://ci.centos.org/job/libvirt-master-check/systems=libvirt-debian-8/ws/…> Datatype element summary has child elements Element summary failed to validate content FAILED SKIP: libxlxml2domconfigtest ============================ + exit 1 Build step 'Execute shell' marked build as failure
1 1
0 0
[Libvirt-ci] Fixed: libvirt/libvirt#771 (master - 7db2515)
by Travis CI 14 Dec '17

14 Dec '17
Build Update for libvirt/libvirt ------------------------------------- Build: #771 Status: Fixed Duration: 24 minutes and 33 seconds Commit: 7db2515 (master) Author: John Ferlan Message: docs: Fix news.xml syntax Commit id '1241e487' used <code>&lt;interface&gt;</code> which is not valid syntax for a <summary>. View the changeset: https://github.com/libvirt/libvirt/compare/1241e487a45a...7db2515900d0 View the full build log and details: https://travis-ci.org/libvirt/libvirt/builds/316232784?utm_source=email&utm… -- You can configure recipients for build notifications in your .travis.yml file. See https://docs.travis-ci.com/user/notifications
1 0
0 0
[Libvirt-ci] Broken: libvirt/libvirt#770 (master - 1241e48)
by Travis CI 14 Dec '17

14 Dec '17
Build Update for libvirt/libvirt ------------------------------------- Build: #770 Status: Broken Duration: 2 hours, 33 minutes, and 53 seconds Commit: 1241e48 (master) Author: Jim Fehlig Message: news: mention multiple IP addresses support for Xen View the changeset: https://github.com/libvirt/libvirt/compare/211415492266...1241e487a45a View the full build log and details: https://travis-ci.org/libvirt/libvirt/builds/316113484?utm_source=email&utm… -- You can configure recipients for build notifications in your .travis.yml file. See https://docs.travis-ci.com/user/notifications
1 0
0 0
[Libvirt-ci] Build failed in Jenkins: libvirt-go-xml-master-check » libvirt-fedora-rawhide #52
by ci@centos.org 07 Dec '17

07 Dec '17
See <https://ci.centos.org/job/libvirt-go-xml-master-check/systems=libvirt-fedor…> ------------------------------------------ Started by upstream project "libvirt-go-xml-master-check" build number 52 originally caused by: Started by upstream project "libvirt-go-xml-master-build" build number 57 originally caused by: Started by upstream project "libvirt-master-build" build number 1045 originally caused by: Started by an SCM change [EnvInject] - Loading node environment variables. Building remotely on libvirt-fedora-rawhide (libvirt) in workspace <https://ci.centos.org/job/libvirt-go-xml-master-check/systems=libvirt-fedor…> [libvirt-go-xml-master] $ /bin/sh -xe /tmp/jenkins1076314097618572100.sh + MAKE=make ++ uname + unamestr=Linux + '[' Linux = FreeBSD ']' + export PATH=/home/jenkins/build/libvirt/bin:/home/jenkins/build/libvirt/bin:/home/jenkins/build/libvirt/bin:/home/jenkins/build/libvirt/bin:/usr/lib64/ccache:/usr/local/sbin:/usr/local/bin:/usr/sbin:/usr/bin:/home/jenkins/.local/bin:/home/jenkins/bin + PATH=/home/jenkins/build/libvirt/bin:/home/jenkins/build/libvirt/bin:/home/jenkins/build/libvirt/bin:/home/jenkins/build/libvirt/bin:/usr/lib64/ccache:/usr/local/sbin:/usr/local/bin:/usr/sbin:/usr/bin:/home/jenkins/.local/bin:/home/jenkins/bin + export 'TEST_ARGS=-tags xmlroundtrip' + TEST_ARGS='-tags xmlroundtrip' + go test -tags xmlroundtrip --- FAIL: TestRoundTrip (24.71s) xml_test.go:345: testdata/libvirt/tests/nwfilterxml2firewalldata/arp.xml: /filter[0]/rule[0]/arp[0]/@protocolid: attribute 'arp' in expected XML missing in actual XML FAIL exit status 1 FAIL _<https://ci.centos.org/job/libvirt-go-xml-master-check/systems=libvirt-fedor…> 25.022s Build step 'Execute shell' marked build as failure
1 2
0 0
  • ← Newer
  • 1
  • 2
  • 3
  • 4
  • 5
  • Older →

HyperKitty Powered by HyperKitty version 1.3.12.