libvirt List Archives
Sign In Sign Up
Manage this list Sign In Sign Up

Keyboard Shortcuts

Thread View

  • j: Next unread message
  • k: Previous unread message
  • j a: Jump to all threads
  • j l: Jump to MailingList overview

CI

Thread Start a new thread
Download
Threads by month
  • ----- 2025 -----
  • August
  • July
  • June
  • May
  • April
  • March
  • February
  • January
  • ----- 2024 -----
  • December
  • November
  • October
  • September
  • August
  • July
  • June
  • May
  • April
  • March
  • February
  • January
  • ----- 2023 -----
  • December
  • November
  • October
  • September
  • August
  • July
  • June
  • May
  • April
  • March
  • February
  • January
  • ----- 2022 -----
  • December
  • November
  • October
  • September
  • August
  • July
  • June
  • May
  • April
  • March
  • February
  • January
  • ----- 2021 -----
  • December
  • November
  • October
  • September
  • August
  • July
  • June
  • May
  • April
  • March
  • February
  • January
  • ----- 2020 -----
  • December
  • November
  • October
  • September
  • August
  • July
  • June
  • May
  • April
  • March
  • February
  • January
  • ----- 2019 -----
  • December
  • November
  • October
  • September
  • August
  • July
  • June
  • May
  • April
  • March
  • February
  • January
  • ----- 2018 -----
  • December
  • November
  • October
  • September
  • August
  • July
  • June
  • May
  • April
  • March
  • February
  • January
  • ----- 2017 -----
  • December
  • November
  • October
  • September
  • August
  • July
  • June
  • May
  • April
  • March
  • February
  • January
  • ----- 2016 -----
  • December
  • November
  • October
  • September
  • August
  • July
ci@lists.libvirt.org

November 2017

  • 2 participants
  • 83 discussions
[Libvirt-ci] Build failed in Jenkins: virt-viewer-master-rpm » libvirt-centos-7 #723
by ci@centos.org 01 Nov '17

01 Nov '17
See <https://ci.centos.org/job/virt-viewer-master-rpm/systems=libvirt-centos-7/7…> ------------------------------------------ Started by upstream project "virt-viewer-master-rpm" build number 723 originally caused by: Started by upstream project "virt-viewer-master-check" build number 722 originally caused by: Started by upstream project "virt-viewer-master-syntax-check" build number 725 originally caused by: Started by upstream project "virt-viewer-master-build" build number 737 originally caused by: Started by upstream project "libvirt-glib-master-build" build number 721 originally caused by: Started by user Libvirt [EnvInject] - Loading node environment variables. Building remotely on libvirt-centos-7 (libvirt) in workspace <https://ci.centos.org/job/virt-viewer-master-rpm/systems=libvirt-centos-7/w…> [virt-viewer-master] $ /bin/sh -xe /tmp/jenkins5265487903364404550.sh + MAKE=make ++ uname + unamestr=Linux + '[' Linux = FreeBSD ']' + cd build + sed -i -e 's/BuildRequires: osinfo-db.*//' virt-viewer.spec + sed -i -e 's/BuildRequires: libvirt.*devel.*//' virt-viewer.spec + sed -i -e 's/BuildRequires: pkgconfig(libvirt.*).*//' virt-viewer.spec + rm -f '*.tar.gz' + make -j3 dist make dist-gzip am__post_remove_distdir='@:' make[1]: Entering directory `<https://ci.centos.org/job/virt-viewer-master-rpm/systems=libvirt-centos-7/w…'> if test -d "virt-viewer-7.0"; then find "virt-viewer-7.0" -type d ! -perm -200 -exec chmod u+w {} ';' && rm -rf "virt-viewer-7.0" || { sleep 5 && rm -rf "virt-viewer-7.0"; }; else :; fi test -d "virt-viewer-7.0" || mkdir "virt-viewer-7.0" (cd icons && make top_distdir=../virt-viewer-7.0 distdir=../virt-viewer-7.0/icons \ am__remove_distdir=: am__skip_length_check=: am__skip_mode_fix=: distdir) make[2]: Entering directory `<https://ci.centos.org/job/virt-viewer-master-rpm/systems=libvirt-centos-7/w…'> (cd 16x16 && make top_distdir=../../virt-viewer-7.0 distdir=../../virt-viewer-7.0/icons/16x16 \ am__remove_distdir=: am__skip_length_check=: am__skip_mode_fix=: distdir) make[3]: Entering directory `<https://ci.centos.org/job/virt-viewer-master-rpm/systems=libvirt-centos-7/w…'> make[3]: Leaving directory `<https://ci.centos.org/job/virt-viewer-master-rpm/systems=libvirt-centos-7/w…'> (cd 22x22 && make top_distdir=../../virt-viewer-7.0 distdir=../../virt-viewer-7.0/icons/22x22 \ am__remove_distdir=: am__skip_length_check=: am__skip_mode_fix=: distdir) make[3]: Entering directory `<https://ci.centos.org/job/virt-viewer-master-rpm/systems=libvirt-centos-7/w…'> make[3]: Leaving directory `<https://ci.centos.org/job/virt-viewer-master-rpm/systems=libvirt-centos-7/w…'> (cd 24x24 && make top_distdir=../../virt-viewer-7.0 distdir=../../virt-viewer-7.0/icons/24x24 \ am__remove_distdir=: am__skip_length_check=: am__skip_mode_fix=: distdir) make[3]: Entering directory `<https://ci.centos.org/job/virt-viewer-master-rpm/systems=libvirt-centos-7/w…'> make[3]: Leaving directory `<https://ci.centos.org/job/virt-viewer-master-rpm/systems=libvirt-centos-7/w…'> (cd 32x32 && make top_distdir=../../virt-viewer-7.0 distdir=../../virt-viewer-7.0/icons/32x32 \ am__remove_distdir=: am__skip_length_check=: am__skip_mode_fix=: distdir) make[3]: Entering directory `<https://ci.centos.org/job/virt-viewer-master-rpm/systems=libvirt-centos-7/w…'> make[3]: Leaving directory `<https://ci.centos.org/job/virt-viewer-master-rpm/systems=libvirt-centos-7/w…'> (cd 48x48 && make top_distdir=../../virt-viewer-7.0 distdir=../../virt-viewer-7.0/icons/48x48 \ am__remove_distdir=: am__skip_length_check=: am__skip_mode_fix=: distdir) make[3]: Entering directory `<https://ci.centos.org/job/virt-viewer-master-rpm/systems=libvirt-centos-7/w…'> make[3]: Leaving directory `<https://ci.centos.org/job/virt-viewer-master-rpm/systems=libvirt-centos-7/w…'> (cd 256x256 && make top_distdir=../../virt-viewer-7.0 distdir=../../virt-viewer-7.0/icons/256x256 \ am__remove_distdir=: am__skip_length_check=: am__skip_mode_fix=: distdir) make[3]: Entering directory `<https://ci.centos.org/job/virt-viewer-master-rpm/systems=libvirt-centos-7/w…'> make[3]: Leaving directory `<https://ci.centos.org/job/virt-viewer-master-rpm/systems=libvirt-centos-7/w…'> make[2]: Leaving directory `<https://ci.centos.org/job/virt-viewer-master-rpm/systems=libvirt-centos-7/w…'> (cd src && make top_distdir=../virt-viewer-7.0 distdir=../virt-viewer-7.0/src \ am__remove_distdir=: am__skip_length_check=: am__skip_mode_fix=: distdir) make[2]: Entering directory `<https://ci.centos.org/job/virt-viewer-master-rpm/systems=libvirt-centos-7/w…'> make[2]: Leaving directory `<https://ci.centos.org/job/virt-viewer-master-rpm/systems=libvirt-centos-7/w…'> (cd man && make top_distdir=../virt-viewer-7.0 distdir=../virt-viewer-7.0/man \ am__remove_distdir=: am__skip_length_check=: am__skip_mode_fix=: distdir) make[2]: Entering directory `<https://ci.centos.org/job/virt-viewer-master-rpm/systems=libvirt-centos-7/w…'> make[2]: Leaving directory `<https://ci.centos.org/job/virt-viewer-master-rpm/systems=libvirt-centos-7/w…'> (cd po && make top_distdir=../virt-viewer-7.0 distdir=../virt-viewer-7.0/po \ am__remove_distdir=: am__skip_length_check=: am__skip_mode_fix=: distdir) make[2]: Entering directory `<https://ci.centos.org/job/virt-viewer-master-rpm/systems=libvirt-centos-7/w…'> dists="Makefile.in.in POTFILES.in af.po am.po anp.po ar.po as.po ast.po bal.po be.po bg.po bn_IN.po bn.po bo.po br.po brx.po bs.po ca.po cs.po cy.po da.po de_CH.po de.po el.po en_GB.po eo.po es.po et.po eu.po fa.po fi.po fr.po gl.po gu.po he.po hi.po hr.po hu.po ia.po id.po ilo.po is.po it.po ja.po ka.po kk.po km.po kn.po ko.po kw_GB.po kw(a)kkcor.po kw.po kw(a)uccor.po ky.po lt.po lv.po mai.po mk.po ml.po mn.po mr.po ms.po nb.po nds.po ne.po nl.po nn.po nso.po or.po pa.po pl.po pt_BR.po pt.po ro.po ru.po si.po sk.po sl.po sq.po sr(a)latin.po sr.po sv.po ta.po te.po tg.po th.po tr.po tw.po uk.po ur.po vi.po wba.po yo.po zh_CN.po zh_HK.po zh_TW.po zu.po "; \ extra_dists="ChangeLog POTFILES.skip Makevars LINGUAS"; \ for file in $extra_dists; do \ test -f ../../po/$file && dists="$dists ../../po/$file"; \ done; \ for file in $dists; do \ test -f $file || file="../../po/$file"; \ ln $file ../virt-viewer-7.0/po 2> /dev/null \ || cp -p $file ../virt-viewer-7.0/po; \ done make[2]: Leaving directory `<https://ci.centos.org/job/virt-viewer-master-rpm/systems=libvirt-centos-7/w…'> (cd data && make top_distdir=../virt-viewer-7.0 distdir=../virt-viewer-7.0/data \ am__remove_distdir=: am__skip_length_check=: am__skip_mode_fix=: distdir) make[2]: Entering directory `<https://ci.centos.org/job/virt-viewer-master-rpm/systems=libvirt-centos-7/w…'> make[2]: Leaving directory `<https://ci.centos.org/job/virt-viewer-master-rpm/systems=libvirt-centos-7/w…'> (cd tests && make top_distdir=../virt-viewer-7.0 distdir=../virt-viewer-7.0/tests \ am__remove_distdir=: am__skip_length_check=: am__skip_mode_fix=: distdir) make[2]: Entering directory `<https://ci.centos.org/job/virt-viewer-master-rpm/systems=libvirt-centos-7/w…'> make[2]: Leaving directory `<https://ci.centos.org/job/virt-viewer-master-rpm/systems=libvirt-centos-7/w…'> make \ top_distdir="virt-viewer-7.0" distdir="virt-viewer-7.0" \ dist-hook make[2]: Entering directory `<https://ci.centos.org/job/virt-viewer-master-rpm/systems=libvirt-centos-7/w…'> if test -d .git || test -d ../.git; then \ ../build-aux/gitlog-to-changelog \ > virt-viewer-7.0/cl-t; \ rm -f virt-viewer-7.0/ChangeLog; \ mv virt-viewer-7.0/cl-t virt-viewer-7.0/ChangeLog; \ fi GEN gen-AUTHORS make[2]: Leaving directory `<https://ci.centos.org/job/virt-viewer-master-rpm/systems=libvirt-centos-7/w…'> test -n "" \ || find "virt-viewer-7.0" -type d ! -perm -755 \ -exec chmod u+rwx,go+rx {} \; -o \ ! -type d ! -perm -444 -links 1 -exec chmod a+r {} \; -o \ ! -type d ! -perm -400 -exec chmod a+r {} \; -o \ ! -type d ! -perm -444 -exec /bin/sh <https://ci.centos.org/job/virt-viewer-master-rpm/systems=libvirt-centos-7/w…> -c -m a+r {} {} \; \ || chmod -R a+r "virt-viewer-7.0" tardir=virt-viewer-7.0 && ${TAR-tar} chof - "$tardir" | GZIP='--no-name --best --rsyncable' gzip -c >virt-viewer-7.0.tar.gz make[1]: Leaving directory `<https://ci.centos.org/job/virt-viewer-master-rpm/systems=libvirt-centos-7/w…'> if test -d "virt-viewer-7.0"; then find "virt-viewer-7.0" -type d ! -perm -200 -exec chmod u+w {} ';' && rm -rf "virt-viewer-7.0" || { sleep 5 && rm -rf "virt-viewer-7.0"; }; else :; fi ++ pwd + rpmbuild --define '_topdir <https://ci.centos.org/job/virt-viewer-master-rpm/systems=libvirt-centos-7/w…'> -ta virt-viewer-7.0.tar.gz error: Failed build dependencies: pkgconfig(govirt-1.0) >= 0.3.2 is needed by virt-viewer-7.0-1.el7.centos.x86_64 Build step 'Execute shell' marked build as failure
1 1
0 0
[Libvirt-ci] Build failed in Jenkins: virt-manager-master-check » libvirt-freebsd-10 #916
by ci@centos.org 01 Nov '17

01 Nov '17
See <https://ci.centos.org/job/virt-manager-master-check/systems=libvirt-freebsd…> ------------------------------------------ Started by upstream project "virt-manager-master-check" build number 916 originally caused by: Started by upstream project "virt-manager-master-build" build number 926 originally caused by: Started by user Libvirt [EnvInject] - Loading node environment variables. Building remotely on libvirt-freebsd-10 (libvirt) in workspace <https://ci.centos.org/job/virt-manager-master-check/systems=libvirt-freebsd…> [virt-manager-master] $ /bin/sh -xe /tmp/jenkins3370598942131114366.sh + python2 setup.py test running test Traceback (most recent call last): File "setup.py", line 686, in <module> distclass=VMMDistribution, File "/usr/local/lib/python2.7/distutils/core.py", line 151, in setup dist.run_commands() File "/usr/local/lib/python2.7/distutils/dist.py", line 953, in run_commands self.run_command(cmd) File "/usr/local/lib/python2.7/distutils/dist.py", line 972, in run_command cmd_obj.run() File "setup.py", line 518, in run TestBaseCommand.run(self) File "setup.py", line 437, in run import tests as testsmodule File "/usr<https://ci.centos.org/job/virt-manager-master-check/systems=libvirt-freebsd…",> line 33, in <module> from tests import utils File "/usr<https://ci.centos.org/job/virt-manager-master-check/systems=libvirt-freebsd…",> line 21, in <module> import virtinst File "/usr<https://ci.centos.org/job/virt-manager-master-check/systems=libvirt-freebsd…",> line 39, in <module> from virtinst import util File "/usr<https://ci.centos.org/job/virt-manager-master-check/systems=libvirt-freebsd…",> line 27, in <module> import libvirt ImportError: No module named libvirt Build step 'Execute shell' marked build as failure
1 4
0 0
[Libvirt-ci] Build failed in Jenkins: virt-manager-master-check » libvirt-freebsd-11 #916
by ci@centos.org 01 Nov '17

01 Nov '17
See <https://ci.centos.org/job/virt-manager-master-check/systems=libvirt-freebsd…> ------------------------------------------ Started by upstream project "virt-manager-master-check" build number 916 originally caused by: Started by upstream project "virt-manager-master-build" build number 926 originally caused by: Started by user Libvirt [EnvInject] - Loading node environment variables. Building remotely on libvirt-freebsd-11 (libvirt) in workspace <https://ci.centos.org/job/virt-manager-master-check/systems=libvirt-freebsd…> [virt-manager-master] $ /bin/sh -xe /tmp/jenkins688376423386471679.sh + python2 setup.py test running test Traceback (most recent call last): File "setup.py", line 686, in <module> distclass=VMMDistribution, File "/usr/local/lib/python2.7/distutils/core.py", line 151, in setup dist.run_commands() File "/usr/local/lib/python2.7/distutils/dist.py", line 953, in run_commands self.run_command(cmd) File "/usr/local/lib/python2.7/distutils/dist.py", line 972, in run_command cmd_obj.run() File "setup.py", line 518, in run TestBaseCommand.run(self) File "setup.py", line 437, in run import tests as testsmodule File "/usr<https://ci.centos.org/job/virt-manager-master-check/systems=libvirt-freebsd…",> line 33, in <module> from tests import utils File "/usr<https://ci.centos.org/job/virt-manager-master-check/systems=libvirt-freebsd…",> line 21, in <module> import virtinst File "/usr<https://ci.centos.org/job/virt-manager-master-check/systems=libvirt-freebsd…",> line 39, in <module> from virtinst import util File "/usr<https://ci.centos.org/job/virt-manager-master-check/systems=libvirt-freebsd…",> line 27, in <module> import libvirt ImportError: No module named libvirt Build step 'Execute shell' marked build as failure
1 4
0 0
[Libvirt-ci] Build failed in Jenkins: virt-manager-master-check » libvirt-debian-9 #916
by ci@centos.org 01 Nov '17

01 Nov '17
See <https://ci.centos.org/job/virt-manager-master-check/systems=libvirt-debian-…> ------------------------------------------ Started by upstream project "virt-manager-master-check" build number 916 originally caused by: Started by upstream project "virt-manager-master-build" build number 926 originally caused by: Started by user Libvirt [EnvInject] - Loading node environment variables. Building remotely on libvirt-debian-9 (libvirt) in workspace <https://ci.centos.org/job/virt-manager-master-check/systems=libvirt-debian-…> [virt-manager-master] $ /bin/sh -xe /tmp/jenkins8497233641601290400.sh + python2 setup.py test running test Traceback (most recent call last): File "setup.py", line 686, in <module> distclass=VMMDistribution, File "/usr/lib/python2.7/distutils/core.py", line 151, in setup dist.run_commands() File "/usr/lib/python2.7/distutils/dist.py", line 953, in run_commands self.run_command(cmd) File "/usr/lib/python2.7/distutils/dist.py", line 972, in run_command cmd_obj.run() File "setup.py", line 518, in run TestBaseCommand.run(self) File "setup.py", line 437, in run import tests as testsmodule File "<https://ci.centos.org/job/virt-manager-master-check/systems=libvirt-debian-…",> line 33, in <module> from tests import utils File "<https://ci.centos.org/job/virt-manager-master-check/systems=libvirt-debian-…",> line 21, in <module> import virtinst File "<https://ci.centos.org/job/virt-manager-master-check/systems=libvirt-debian-…",> line 39, in <module> from virtinst import util File "<https://ci.centos.org/job/virt-manager-master-check/systems=libvirt-debian-…",> line 27, in <module> import libvirt ImportError: No module named libvirt Build step 'Execute shell' marked build as failure
1 4
0 0
[Libvirt-ci] Build failed in Jenkins: virt-manager-master-check » libvirt-debian-8 #916
by ci@centos.org 01 Nov '17

01 Nov '17
See <https://ci.centos.org/job/virt-manager-master-check/systems=libvirt-debian-…> ------------------------------------------ Started by upstream project "virt-manager-master-check" build number 916 originally caused by: Started by upstream project "virt-manager-master-build" build number 926 originally caused by: Started by user Libvirt [EnvInject] - Loading node environment variables. Building remotely on libvirt-debian-8 (libvirt) in workspace <https://ci.centos.org/job/virt-manager-master-check/systems=libvirt-debian-…> [virt-manager-master] $ /bin/sh -xe /tmp/jenkins6806715026121281338.sh + python2 setup.py test running test Traceback (most recent call last): File "setup.py", line 686, in <module> distclass=VMMDistribution, File "/usr/lib/python2.7/distutils/core.py", line 151, in setup dist.run_commands() File "/usr/lib/python2.7/distutils/dist.py", line 953, in run_commands self.run_command(cmd) File "/usr/lib/python2.7/distutils/dist.py", line 972, in run_command cmd_obj.run() File "setup.py", line 518, in run TestBaseCommand.run(self) File "setup.py", line 437, in run import tests as testsmodule File "<https://ci.centos.org/job/virt-manager-master-check/systems=libvirt-debian-…",> line 33, in <module> from tests import utils File "<https://ci.centos.org/job/virt-manager-master-check/systems=libvirt-debian-…",> line 21, in <module> import virtinst File "<https://ci.centos.org/job/virt-manager-master-check/systems=libvirt-debian-…",> line 39, in <module> from virtinst import util File "<https://ci.centos.org/job/virt-manager-master-check/systems=libvirt-debian-…",> line 27, in <module> import libvirt ImportError: No module named libvirt Build step 'Execute shell' marked build as failure
1 4
0 0
[Libvirt-ci] Build failed in Jenkins: virt-manager-master-build » libvirt-freebsd-10 #924
by ci@centos.org 01 Nov '17

01 Nov '17
See <https://ci.centos.org/job/virt-manager-master-build/systems=libvirt-freebsd…> ------------------------------------------ Started by upstream project "virt-manager-master-build" build number 924 originally caused by: Started by upstream project "libosinfo-master-build" build number 105 originally caused by: Started by upstream project "osinfo-db-master-build" build number 221 originally caused by: Started by upstream project "osinfo-db-tools-master-build" build number 30 originally caused by: Started by user Libvirt [EnvInject] - Loading node environment variables. Building remotely on libvirt-freebsd-10 (libvirt) in workspace <https://ci.centos.org/job/virt-manager-master-build/systems=libvirt-freebsd…> > git rev-parse --is-inside-work-tree # timeout=10 Fetching changes from the remote Git repository > git config remote.origin.url git://n64.pufty.ci.centos.org/virt-manager.git # timeout=10 Fetching upstream changes from git://n64.pufty.ci.centos.org/virt-manager.git > git --version # timeout=10 > git fetch --tags --progress git://n64.pufty.ci.centos.org/virt-manager.git +refs/heads/*:refs/remotes/origin/* Checking out Revision 4e93ad09cbf2dc79225f39102e485e5039c84cfc (refs/remotes/origin/master) Commit message: "news: Fix typo" > git config core.sparsecheckout # timeout=10 > git checkout -f 4e93ad09cbf2dc79225f39102e485e5039c84cfc > git rev-list 4e93ad09cbf2dc79225f39102e485e5039c84cfc # timeout=10 Cleaning workspace > git rev-parse --verify HEAD # timeout=10 Resetting working tree > git reset --hard # timeout=10 > git clean -fdx # timeout=10 [virt-manager-master] $ /bin/sh -xe /tmp/jenkins3645255218415646194.sh + python setup.py configure --prefix=/home/jenkins/build/libvirt /tmp/jenkins3645255218415646194.sh: python: not found Build step 'Execute shell' marked build as failure
1 2
0 0
[Libvirt-ci] Build failed in Jenkins: virt-manager-master-build » libvirt-freebsd-11 #924
by ci@centos.org 01 Nov '17

01 Nov '17
See <https://ci.centos.org/job/virt-manager-master-build/systems=libvirt-freebsd…> ------------------------------------------ Started by upstream project "virt-manager-master-build" build number 924 originally caused by: Started by upstream project "libosinfo-master-build" build number 105 originally caused by: Started by upstream project "osinfo-db-master-build" build number 221 originally caused by: Started by upstream project "osinfo-db-tools-master-build" build number 30 originally caused by: Started by user Libvirt [EnvInject] - Loading node environment variables. Building remotely on libvirt-freebsd-11 (libvirt) in workspace <https://ci.centos.org/job/virt-manager-master-build/systems=libvirt-freebsd…> > git rev-parse --is-inside-work-tree # timeout=10 Fetching changes from the remote Git repository > git config remote.origin.url git://n64.pufty.ci.centos.org/virt-manager.git # timeout=10 Fetching upstream changes from git://n64.pufty.ci.centos.org/virt-manager.git > git --version # timeout=10 > git fetch --tags --progress git://n64.pufty.ci.centos.org/virt-manager.git +refs/heads/*:refs/remotes/origin/* Checking out Revision 4e93ad09cbf2dc79225f39102e485e5039c84cfc (refs/remotes/origin/master) Commit message: "news: Fix typo" > git config core.sparsecheckout # timeout=10 > git checkout -f 4e93ad09cbf2dc79225f39102e485e5039c84cfc First time build. Skipping changelog. Cleaning workspace > git rev-parse --verify HEAD # timeout=10 Resetting working tree > git reset --hard # timeout=10 > git clean -fdx # timeout=10 [virt-manager-master] $ /bin/sh -xe /tmp/jenkins8583795340763926599.sh + python setup.py configure '--prefix=/home/jenkins/build/libvirt' /tmp/jenkins8583795340763926599.sh: python: not found Build step 'Execute shell' marked build as failure
1 2
0 0
[Libvirt-ci] Build failed in Jenkins: libosinfo-master-check » libvirt-debian-8 #89
by ci@centos.org 01 Nov '17

01 Nov '17
See <https://ci.centos.org/job/libosinfo-master-check/systems=libvirt-debian-8/8…> ------------------------------------------ Started by upstream project "libosinfo-master-check" build number 89 originally caused by: Started by upstream project "libosinfo-master-syntax-check" build number 92 originally caused by: Started by upstream project "libosinfo-master-build" build number 104 originally caused by: Started by upstream project "osinfo-db-master-build" build number 220 originally caused by: Started by upstream project "osinfo-db-tools-master-build" build number 29 originally caused by: Started by user Libvirt [EnvInject] - Loading node environment variables. Building remotely on libvirt-debian-8 (libvirt) in workspace <https://ci.centos.org/job/libosinfo-master-check/systems=libvirt-debian-8/w…> [libosinfo-master] $ /bin/sh -xe /tmp/jenkins611953010852051259.sh + MAKE=make + uname + unamestr=Linux + [ Linux = FreeBSD ] + export OSINFO_SYSTEM_DIR=/home/jenkins/build/libvirt/share/osinfo + cd build + make -j3 check GEN public-submodule-commit Making check in osinfo make[1]: Entering directory '<https://ci.centos.org/job/libosinfo-master-check/systems=libvirt-debian-8/w…'> make check-am make[2]: Entering directory '<https://ci.centos.org/job/libosinfo-master-check/systems=libvirt-debian-8/w…'> make check-local make[3]: Entering directory '<https://ci.centos.org/job/libosinfo-master-check/systems=libvirt-debian-8/w…'> GEN check-symfile GEN check-symsorting make[3]: Leaving directory '<https://ci.centos.org/job/libosinfo-master-check/systems=libvirt-debian-8/w…'> make[2]: Leaving directory '<https://ci.centos.org/job/libosinfo-master-check/systems=libvirt-debian-8/w…'> make[1]: Leaving directory '<https://ci.centos.org/job/libosinfo-master-check/systems=libvirt-debian-8/w…'> Making check in tools make[1]: Entering directory '<https://ci.centos.org/job/libosinfo-master-check/systems=libvirt-debian-8/w…'> make[1]: Nothing to be done for 'check'. make[1]: Leaving directory '<https://ci.centos.org/job/libosinfo-master-check/systems=libvirt-debian-8/w…'> Making check in docs make[1]: Entering directory '<https://ci.centos.org/job/libosinfo-master-check/systems=libvirt-debian-8/w…'> Making check in reference make[2]: Entering directory '<https://ci.centos.org/job/libosinfo-master-check/systems=libvirt-debian-8/w…'> make[2]: Nothing to be done for 'check'. make[2]: Leaving directory '<https://ci.centos.org/job/libosinfo-master-check/systems=libvirt-debian-8/w…'> make[2]: Entering directory '<https://ci.centos.org/job/libosinfo-master-check/systems=libvirt-debian-8/w…'> make[2]: Nothing to be done for 'check-am'. make[2]: Leaving directory '<https://ci.centos.org/job/libosinfo-master-check/systems=libvirt-debian-8/w…'> make[1]: Leaving directory '<https://ci.centos.org/job/libosinfo-master-check/systems=libvirt-debian-8/w…'> Making check in po make[1]: Entering directory '<https://ci.centos.org/job/libosinfo-master-check/systems=libvirt-debian-8/w…'> INTLTOOL_EXTRACT="/usr/bin/intltool-extract" XGETTEXT="/usr/bin/xgettext" srcdir=../../po /usr/bin/intltool-update --gettext-package libosinfo --pot rm -f missing notexist srcdir=../../po /usr/bin/intltool-update -m if [ -r missing -o -r notexist ]; then \ exit 1; \ fi make[1]: Leaving directory '<https://ci.centos.org/job/libosinfo-master-check/systems=libvirt-debian-8/w…'> Making check in examples make[1]: Entering directory '<https://ci.centos.org/job/libosinfo-master-check/systems=libvirt-debian-8/w…'> make[1]: Nothing to be done for 'check'. make[1]: Leaving directory '<https://ci.centos.org/job/libosinfo-master-check/systems=libvirt-debian-8/w…'> Making check in tests make[1]: Entering directory '<https://ci.centos.org/job/libosinfo-master-check/systems=libvirt-debian-8/w…'> make test-entity test-device test-list test-devicelist test-filter test-product test-os test-oslist test-productfilter test-platform test-platformlist test-db test-loader test-isodetect test-install-script test-mediauris test-treeuris make[2]: Entering directory '<https://ci.centos.org/job/libosinfo-master-check/systems=libvirt-debian-8/w…'> CC test_list-test-list.o CC test_entity-test-entity.o CC test_device-test-device.o CC test_devicelist-test-devicelist.o CC test_filter-test-filter.o CC test_product-test-product.o CC test_os-test-os.o CC test_oslist-test-oslist.o CC test_productfilter-test-productfilter.o CC test_platform-test-platform.o CC test_platformlist-test-platformlist.o CC test_db-test-db.o CC test_loader-test-loader.o CC test_isodetect-test-isodetect.o CC test_install_script-test-install-script.o CC test_mediauris-test-mediauris.o CC test_treeuris-test-treeuris.o CCLD test-entity CCLD test-device CCLD test-list CCLD test-devicelist CCLD test-filter CCLD test-product CCLD test-os CCLD test-oslist CCLD test-productfilter CCLD test-platform CCLD test-platformlist CCLD test-db CCLD test-loader CCLD test-isodetect CCLD test-install-script CCLD test-mediauris CCLD test-treeuris make[2]: Leaving directory '<https://ci.centos.org/job/libosinfo-master-check/systems=libvirt-debian-8/w…'> make check-TESTS make[2]: Entering directory '<https://ci.centos.org/job/libosinfo-master-check/systems=libvirt-debian-8/w…'> make[3]: Entering directory '<https://ci.centos.org/job/libosinfo-master-check/systems=libvirt-debian-8/w…'> PASS: test-entity PASS: test-device PASS: test-list PASS: test-devicelist PASS: test-filter PASS: test-product PASS: test-os PASS: test-productfilter PASS: test-oslist PASS: test-platform PASS: test-db PASS: test-platformlist PASS: test-install-script PASS: test-loader SKIP: test-mediauris SKIP: test-treeuris ../../build-aux/test-driver: line 107: 21761 Aborted "$@" > $log_file 2>&1 FAIL: test-isodetect make[4]: Entering directory '<https://ci.centos.org/job/libosinfo-master-check/systems=libvirt-debian-8/w…'> make[4]: Nothing to be done for 'all'. make[4]: Leaving directory '<https://ci.centos.org/job/libosinfo-master-check/systems=libvirt-debian-8/w…'> ============================================================================ Testsuite summary for libosinfo 1.2.0 ============================================================================ # TOTAL: 17 # PASS: 14 # SKIP: 2 # XFAIL: 0 # FAIL: 1 # XPASS: 0 # ERROR: 0 ============================================================================ See tests/test-suite.log Please report to libosinfo(a)redhat.com ============================================================================ Makefile:1246: recipe for target 'test-suite.log' failed make[3]: *** [test-suite.log] Error 1 make[3]: Leaving directory '<https://ci.centos.org/job/libosinfo-master-check/systems=libvirt-debian-8/w…'> Makefile:1352: recipe for target 'check-TESTS' failed make[2]: *** [check-TESTS] Error 2 make[2]: Leaving directory '<https://ci.centos.org/job/libosinfo-master-check/systems=libvirt-debian-8/w…'> Makefile:1537: recipe for target 'check-am' failed make[1]: *** [check-am] Error 2 make[1]: Leaving directory '<https://ci.centos.org/job/libosinfo-master-check/systems=libvirt-debian-8/w…'> Makefile:584: recipe for target 'check-recursive' failed make: *** [check-recursive] Error 1 + cat tests/test-suite.log =========================================== libosinfo 1.2.0: tests/test-suite.log =========================================== # TOTAL: 17 # PASS: 14 # SKIP: 2 # XFAIL: 0 # FAIL: 1 # XPASS: 0 # ERROR: 0 .. contents:: :depth: 2 FAIL: test-isodetect ==================== /isodetect/fedora: ** ERROR:../../tests/test-isodetect.c:359:test_one: 'matched' should be TRUE SKIP: test-mediauris ==================== SKIP: test-treeuris =================== + exit 1 Build step 'Execute shell' marked build as failure
1 2
0 0
[Libvirt-ci] Build failed in Jenkins: libvirt-sandbox-master-build » libvirt-centos-7 #715
by ci@centos.org 01 Nov '17

01 Nov '17
See <https://ci.centos.org/job/libvirt-sandbox-master-build/systems=libvirt-cent…> ------------------------------------------ [...truncated 11.04 KB...] checking whether C compiler handles -Wopenmp-simd... no checking whether C compiler handles -Woverflow... yes checking whether C compiler handles -Woverlength-strings... yes checking whether C compiler handles -Woverride-init... yes checking whether C compiler handles -Wpacked... yes checking whether C compiler handles -Wpacked-bitfield-compat... yes checking whether C compiler handles -Wparentheses... yes checking whether C compiler handles -Wpointer-arith... yes checking whether C compiler handles -Wpointer-sign... yes checking whether C compiler handles -Wpointer-to-int-cast... yes checking whether C compiler handles -Wpragmas... yes checking whether C compiler handles -Wreturn-local-addr... yes checking whether C compiler handles -Wreturn-type... yes checking whether C compiler handles -Wsequence-point... yes checking whether C compiler handles -Wshadow... yes checking whether C compiler handles -Wsizeof-pointer-memaccess... yes checking whether C compiler handles -Wstack-protector... yes checking whether C compiler handles -Wstrict-aliasing... yes checking whether C compiler handles -Wstrict-overflow... yes checking whether C compiler handles -Wstrict-prototypes... yes checking whether C compiler handles -Wsuggest-attribute=const... yes checking whether C compiler handles -Wsuggest-attribute=format... yes checking whether C compiler handles -Wsuggest-attribute=noreturn... yes checking whether C compiler handles -Wsuggest-attribute=pure... yes checking whether C compiler handles -Wswitch... yes checking whether C compiler handles -Wswitch-default... yes checking whether C compiler handles -Wsync-nand... yes checking whether C compiler handles -Wtrampolines... yes checking whether C compiler handles -Wtrigraphs... yes checking whether C compiler handles -Wtype-limits... yes checking whether C compiler handles -Wuninitialized... yes checking whether C compiler handles -Wunknown-pragmas... yes checking whether C compiler handles -Wunsafe-loop-optimizations... yes checking whether C compiler handles -Wunused... yes checking whether C compiler handles -Wunused-but-set-parameter... yes checking whether C compiler handles -Wunused-but-set-variable... yes checking whether C compiler handles -Wunused-function... yes checking whether C compiler handles -Wunused-label... yes checking whether C compiler handles -Wunused-local-typedefs... yes checking whether C compiler handles -Wunused-parameter... yes checking whether C compiler handles -Wunused-result... yes checking whether C compiler handles -Wunused-value... yes checking whether C compiler handles -Wunused-variable... yes checking whether C compiler handles -Wvarargs... yes checking whether C compiler handles -Wvariadic-macros... yes checking whether C compiler handles -Wvector-operation-performance... yes checking whether C compiler handles -Wvla... yes checking whether C compiler handles -Wvolatile-register-var... yes checking whether C compiler handles -Wwrite-strings... yes checking whether C compiler handles -Wnormalized=nfc... yes checking whether C compiler handles -Wno-sign-compare... yes checking whether C compiler handles -Wno-sign-conversion... yes checking whether C compiler handles -Wno-conversion... yes checking whether C compiler handles -Wno-unused-parameter... yes checking whether C compiler handles -Wno-format-nonliteral... yes checking whether C compiler handles -Wjump-misses-init... (cached) yes checking whether C compiler handles -Wframe-larger-than=4096... yes checking whether C compiler handles -fstack-protector-all... yes checking whether C compiler handles --param=ssp-buffer-size=4... yes checking whether C compiler handles -fexceptions... yes checking whether C compiler handles -fasynchronous-unwind-tables... yes checking whether C compiler handles -fdiagnostics-show-option... yes checking whether C compiler handles -funit-at-a-time... yes checking whether C compiler handles -fipa-pure-const... yes checking whether C compiler handles -Wno-suggest-attribute=pure... yes checking whether C compiler handles -Wno-suggest-attribute=const... yes checking whether C compiler handles -Werror... yes checking for pkg-config... /usr/bin/pkg-config checking pkg-config is at least version 0.9.0... yes checking for GIO_UNIX... yes checking for GOBJECT... yes checking for LIBVIRT... yes checking for LIBVIRT_GLIB... yes checking for LIBVIRT_GOBJECT... yes checking for LIBVIRT_GCONFIG... yes checking for ZLIB... yes checking for LZMA... yes checking cap-ng.h usability... yes checking cap-ng.h presence... yes checking for cap-ng.h... yes checking for capng_updatev in -lcap-ng... yes checking for gtk-doc... yes checking for gtkdoc-check... gtkdoc-check.test checking for gtkdoc-check... /usr/bin/gtkdoc-check checking for gtkdoc-rebase... /usr/bin/gtkdoc-rebase checking for gtkdoc-mkpdf... /usr/bin/gtkdoc-mkpdf checking whether to build gtk-doc documentation... yes checking for GTKDOC_DEPS... yes checking for perl... /usr/bin/perl checking for rpcgen... /usr/bin/rpcgen checking selinux/selinux.h usability... yes checking selinux/selinux.h presence... yes checking for selinux/selinux.h... yes checking for fgetfilecon in -lselinux... yes checking for static LIBC... yes checking for ldd... /usr/bin/ldd checking for gobject-introspection... yes checking whether NLS is requested... yes checking for intltool >= 0.35.0... 0.50.2 found checking for intltool-update... /usr/bin/intltool-update checking for intltool-merge... /usr/bin/intltool-merge checking for intltool-extract... /usr/bin/intltool-extract checking for xgettext... /usr/bin/xgettext checking for msgmerge... /usr/bin/msgmerge checking for msgfmt... /usr/bin/msgfmt checking for gmsgfmt... /usr/bin/msgfmt checking for perl... /usr/bin/perl checking for perl >= 5.8.1... 5.16.3 checking for XML::Parser... ok checking for python... /usr/bin/python checking for python version... 2.7 checking for python platform... linux2 checking for python script directory... ${prefix}/lib/python2.7/site-packages checking for python extension module directory... ${exec_prefix}/lib64/python2.7/site-packages checking that generated files are newer than configure... done configure: creating ./config.status config.status: creating Makefile config.status: creating libvirt-sandbox/Makefile config.status: creating libvirt-sandbox/tests/Makefile config.status: creating libvirt-sandbox/image/Makefile config.status: creating libvirt-sandbox/image/sources/Makefile config.status: creating bin/Makefile config.status: creating examples/Makefile config.status: creating docs/Makefile config.status: creating docs/libvirt-sandbox/Makefile config.status: creating po/Makefile.in config.status: creating libvirt-sandbox.spec config.status: creating libvirt-sandbox-1.0.pc config.status: creating config.h config.status: linking ../GNUmakefile to GNUmakefile config.status: executing depfiles commands config.status: executing libtool commands config.status: executing po/stamp-it commands configure: configure: Configuration summary configure: ===================== configure: configure: configure: Libraries: configure: configure: LZMA: -pthread -llzma configure: ZLIB: -lz configure: GOBJECT: -I/usr/include/glib-2.0 -I/usr/lib64/glib-2.0/include -lgobject-2.0 -lglib-2.0 configure: LIBVIRT_GOBJECT: -pthread -I/home/jenkins/build/libvirt/include/libvirt-gobject-1.0 -I/home/jenkins/build/libvirt/include/libvirt-gconfig-1.0 -I/usr/include/glib-2.0 -I/usr/lib64/glib-2.0/include -I/usr/include/libxml2 -L/home/jenkins/build/libvirt/lib -lvirt-gobject-1.0 -lgio-2.0 -lvirt-gconfig-1.0 -lvirt -lgobject-2.0 -lxml2 -lglib-2.0 configure: Now type 'make' to compile libvirt-sandbox. + make -j3 make all-recursive make[1]: Entering directory `<https://ci.centos.org/job/libvirt-sandbox-master-build/systems=libvirt-cent…'> Making all in libvirt-sandbox make[2]: Entering directory `<https://ci.centos.org/job/libvirt-sandbox-master-build/systems=libvirt-cent…'> GEN libvirt-sandbox-enum-types.h GEN libvirt-sandbox-enum-types.c GEN libvirt-sandbox-protocol.h GEN libvirt-sandbox-protocol.c make all-recursive make[3]: Entering directory `<https://ci.centos.org/job/libvirt-sandbox-master-build/systems=libvirt-cent…'> Making all in tests make[4]: Entering directory `<https://ci.centos.org/job/libvirt-sandbox-master-build/systems=libvirt-cent…'> make[4]: Nothing to be done for `all'. make[4]: Leaving directory `<https://ci.centos.org/job/libvirt-sandbox-master-build/systems=libvirt-cent…'> Making all in image make[4]: Entering directory `<https://ci.centos.org/job/libvirt-sandbox-master-build/systems=libvirt-cent…'> Making all in sources make[5]: Entering directory `<https://ci.centos.org/job/libvirt-sandbox-master-build/systems=libvirt-cent…'> make[5]: Nothing to be done for `all'. make[5]: Leaving directory `<https://ci.centos.org/job/libvirt-sandbox-master-build/systems=libvirt-cent…'> make[5]: Entering directory `<https://ci.centos.org/job/libvirt-sandbox-master-build/systems=libvirt-cent…'> make[5]: Nothing to be done for `all-am'. make[5]: Leaving directory `<https://ci.centos.org/job/libvirt-sandbox-master-build/systems=libvirt-cent…'> make[4]: Leaving directory `<https://ci.centos.org/job/libvirt-sandbox-master-build/systems=libvirt-cent…'> make[4]: Entering directory `<https://ci.centos.org/job/libvirt-sandbox-master-build/systems=libvirt-cent…'> CC libvirt_sandbox_1_0_la-libvirt-sandbox-main.lo CC libvirt_sandbox_1_0_la-libvirt-sandbox-builder.lo CC libvirt_sandbox_1_0_la-libvirt-sandbox-builder-initrd.lo CC libvirt_sandbox_1_0_la-libvirt-sandbox-builder-machine.lo CC libvirt_sandbox_1_0_la-libvirt-sandbox-builder-container.lo CC libvirt_sandbox_1_0_la-libvirt-sandbox-console.lo CC libvirt_sandbox_1_0_la-libvirt-sandbox-console-raw.lo CC libvirt_sandbox_1_0_la-libvirt-sandbox-console-rpc.lo CC libvirt_sandbox_1_0_la-libvirt-sandbox-context.lo CC libvirt_sandbox_1_0_la-libvirt-sandbox-context-interactive.lo CC libvirt_sandbox_1_0_la-libvirt-sandbox-context-service.lo CC libvirt_sandbox_1_0_la-libvirt-sandbox-util.lo CC libvirt_sandbox_1_0_la-libvirt-sandbox-config.lo CC libvirt_sandbox_1_0_la-libvirt-sandbox-config-disk.lo CC libvirt_sandbox_1_0_la-libvirt-sandbox-config-network.lo CC libvirt_sandbox_1_0_la-libvirt-sandbox-config-network-address.lo CC libvirt_sandbox_1_0_la-libvirt-sandbox-config-network-filterref.lo CC libvirt_sandbox_1_0_la-libvirt-sandbox-config-network-filterref-parameter.lo CC libvirt_sandbox_1_0_la-libvirt-sandbox-config-network-route.lo CC libvirt_sandbox_1_0_la-libvirt-sandbox-config-mount.lo CC libvirt_sandbox_1_0_la-libvirt-sandbox-config-mount-file.lo CC libvirt_sandbox_1_0_la-libvirt-sandbox-config-mount-host-bind.lo CC libvirt_sandbox_1_0_la-libvirt-sandbox-config-mount-host-image.lo CC libvirt_sandbox_1_0_la-libvirt-sandbox-config-mount-guest-bind.lo CC libvirt_sandbox_1_0_la-libvirt-sandbox-config-mount-ram.lo CC libvirt_sandbox_1_0_la-libvirt-sandbox-config-initrd.lo CC libvirt_sandbox_1_0_la-libvirt-sandbox-config-interactive.lo CC libvirt_sandbox_1_0_la-libvirt-sandbox-config-service.lo CC libvirt_sandbox_1_0_la-libvirt-sandbox-config-service-systemd.lo CC libvirt_sandbox_1_0_la-libvirt-sandbox-config-service-generic.lo CC libvirt_sandbox_1_0_la-libvirt-sandbox-rpcpacket.lo CC libvirt_sandbox_1_0_la-libvirt-sandbox-enum-types.lo CC libvirt_sandbox_1_0_la-libvirt-sandbox-protocol.lo CC libvirt_sandbox_init_common-libvirt-sandbox-init-common.o CC libvirt_sandbox_init_common-libvirt-sandbox-protocol.o CC libvirt_sandbox_init_common-libvirt-sandbox-rpcpacket.o CC libvirt_sandbox_init_common-libvirt-sandbox-util.o CC libvirt_sandbox_init_common-libvirt-sandbox-config.o CC libvirt_sandbox_init_common-libvirt-sandbox-config-disk.o CC libvirt_sandbox_init_common-libvirt-sandbox-config-network.o CC libvirt_sandbox_init_common-libvirt-sandbox-config-network-address.o CC libvirt_sandbox_init_common-libvirt-sandbox-config-network-filterref.o CC libvirt_sandbox_init_common-libvirt-sandbox-config-network-filterref-parameter.o CC libvirt_sandbox_init_common-libvirt-sandbox-config-network-route.o CC libvirt_sandbox_init_common-libvirt-sandbox-config-mount.o CC libvirt_sandbox_init_common-libvirt-sandbox-config-mount-file.o CC libvirt_sandbox_init_common-libvirt-sandbox-config-mount-host-bind.o CC libvirt_sandbox_init_common-libvirt-sandbox-config-mount-host-image.o CC libvirt_sandbox_init_common-libvirt-sandbox-config-mount-guest-bind.o CC libvirt_sandbox_init_common-libvirt-sandbox-config-mount-ram.o CC libvirt_sandbox_init_common-libvirt-sandbox-config-initrd.o CC libvirt_sandbox_init_common-libvirt-sandbox-config-interactive.o CC libvirt_sandbox_init_common-libvirt-sandbox-config-service.o CC libvirt_sandbox_init_common-libvirt-sandbox-config-service-systemd.o CC libvirt_sandbox_init_common-libvirt-sandbox-config-service-generic.o CC libvirt_sandbox_init_qemu-libvirt-sandbox-init-qemu.o CC libvirt_sandbox_init_lxc-libvirt-sandbox-init-lxc.o CCLD libvirt-sandbox-1.0.la CCLD libvirt-sandbox-init-common CCLD libvirt-sandbox-init-lxc CCLD libvirt-sandbox-init-qemu /usr/bin/ld: cannot find -llzma /usr/lib/gcc/x86_64-redhat-linux/4.8.5/../../../../lib64/libpthread.a(libpthread.o): In function `sem_open': (.text+0x6a23): warning: the use of `mktemp' is dangerous, better use `mkstemp' collect2: error: ld returned 1 exit status make[4]: *** [libvirt-sandbox-init-qemu] Error 1 make[4]: *** Waiting for unfinished jobs.... make[4]: Leaving directory `<https://ci.centos.org/job/libvirt-sandbox-master-build/systems=libvirt-cent…'> make[3]: *** [all-recursive] Error 1 make[3]: Leaving directory `<https://ci.centos.org/job/libvirt-sandbox-master-build/systems=libvirt-cent…'> make[2]: *** [all] Error 2 make[2]: Leaving directory `<https://ci.centos.org/job/libvirt-sandbox-master-build/systems=libvirt-cent…'> make[1]: *** [all-recursive] Error 1 make[1]: Leaving directory `<https://ci.centos.org/job/libvirt-sandbox-master-build/systems=libvirt-cent…'> make: *** [all] Error 2 Build step 'Execute shell' marked build as failure
1 0
0 0
[Libvirt-ci] Build failed in Jenkins: virt-viewer-master-build » libvirt-debian-9 #736
by ci@centos.org 01 Nov '17

01 Nov '17
See <https://ci.centos.org/job/virt-viewer-master-build/systems=libvirt-debian-9…> ------------------------------------------ Started by upstream project "virt-viewer-master-build" build number 736 originally caused by: Started by user Libvirt [EnvInject] - Loading node environment variables. Building remotely on libvirt-debian-9 (libvirt) in workspace <https://ci.centos.org/job/virt-viewer-master-build/systems=libvirt-debian-9…> Cloning the remote Git repository Cloning repository git://n64.pufty.ci.centos.org/virt-viewer.git > git init <https://ci.centos.org/job/virt-viewer-master-build/systems=libvirt-debian-9…> # timeout=10 Fetching upstream changes from git://n64.pufty.ci.centos.org/virt-viewer.git > git --version # timeout=10 > git fetch --tags --progress git://n64.pufty.ci.centos.org/virt-viewer.git +refs/heads/*:refs/remotes/origin/* > git config remote.origin.url git://n64.pufty.ci.centos.org/virt-viewer.git # timeout=10 > git config --add remote.origin.fetch +refs/heads/*:refs/remotes/origin/* # timeout=10 > git config remote.origin.url git://n64.pufty.ci.centos.org/virt-viewer.git # timeout=10 Fetching upstream changes from git://n64.pufty.ci.centos.org/virt-viewer.git > git fetch --tags --progress git://n64.pufty.ci.centos.org/virt-viewer.git +refs/heads/*:refs/remotes/origin/* Checking out Revision 905d84bd22847e720d10955242719714b87e0dcf (refs/remotes/origin/master) Commit message: "foreign-menu: Check if storage domain is active for data center" > git config core.sparsecheckout # timeout=10 > git checkout -f 905d84bd22847e720d10955242719714b87e0dcf First time build. Skipping changelog. Cleaning workspace > git rev-parse --verify HEAD # timeout=10 Resetting working tree > git reset --hard # timeout=10 > git clean -fdx # timeout=10 [virt-viewer-master] $ /bin/sh -xe /tmp/jenkins1763671699041913259.sh + MAKE=make + uname + unamestr=Linux + [ Linux = FreeBSD ] + mkdir build + cd build + ../autogen.sh --prefix=/home/jenkins/build/libvirt autoreconf: Entering directory `.' autoreconf: configure.ac: not using Gettext autoreconf: running: aclocal --force -I m4 autoreconf: configure.ac: tracing autoreconf: running: libtoolize --copy --force libtoolize: putting auxiliary files in AC_CONFIG_AUX_DIR, 'build-aux'. libtoolize: copying file 'build-aux/ltmain.sh' libtoolize: putting macros in AC_CONFIG_MACRO_DIRS, 'm4'. libtoolize: copying file 'm4/libtool.m4' libtoolize: copying file 'm4/ltoptions.m4' libtoolize: copying file 'm4/ltsugar.m4' libtoolize: copying file 'm4/ltversion.m4' libtoolize: copying file 'm4/lt~obsolete.m4' autoreconf: running: /usr/bin/autoconf --force autoreconf: running: /usr/bin/autoheader --force autoreconf: running: automake --add-missing --copy --force-missing configure.ac:62: installing 'build-aux/compile' configure.ac:9: installing 'build-aux/config.guess' configure.ac:9: installing 'build-aux/config.sub' configure.ac:8: installing 'build-aux/install-sh' configure.ac:8: installing 'build-aux/missing' src/Makefile.am: installing 'build-aux/depcomp' parallel-tests: installing 'build-aux/test-driver' autoreconf: Leaving directory `.' checking for a BSD-compatible install... /usr/bin/install -c checking whether build environment is sane... yes checking for a thread-safe mkdir -p... /bin/mkdir -p checking for gawk... no checking for mawk... mawk checking whether make sets $(MAKE)... yes checking whether make supports nested variables... yes checking build system type... x86_64-pc-linux-gnu checking host system type... x86_64-pc-linux-gnu checking whether make supports nested variables... (cached) yes checking for native Win32... no checking for gcc... gcc checking whether the C compiler works... yes checking for C compiler default output file name... a.out checking for suffix of executables... checking whether we are cross compiling... no checking for suffix of object files... o checking whether we are using the GNU C compiler... yes checking whether gcc accepts -g... yes checking for gcc option to accept ISO C89... none needed checking whether gcc understands -c and -o together... yes checking for style of include used by make... GNU checking dependency style of gcc... gcc3 checking how to print strings... printf checking for a sed that does not truncate output... /bin/sed checking for grep that handles long lines and -e... /bin/grep checking for egrep... /bin/grep -E checking for fgrep... /bin/grep -F checking for ld used by gcc... /usr/bin/ld checking if the linker (/usr/bin/ld) is GNU ld... yes checking for BSD- or MS-compatible name lister (nm)... /usr/bin/nm -B checking the name lister (/usr/bin/nm -B) interface... BSD nm checking whether ln -s works... yes checking the maximum length of command line arguments... 1572864 checking how to convert x86_64-pc-linux-gnu file names to x86_64-pc-linux-gnu format... func_convert_file_noop checking how to convert x86_64-pc-linux-gnu file names to toolchain format... func_convert_file_noop checking for /usr/bin/ld option to reload object files... -r checking for objdump... objdump checking how to recognize dependent libraries... pass_all checking for dlltool... no checking how to associate runtime and link libraries... printf %s\n checking for ar... ar checking for archiver @FILE support... @ checking for strip... strip checking for ranlib... ranlib checking command to parse /usr/bin/nm -B output from gcc object... ok checking for sysroot... no checking for a working dd... /bin/dd checking how to truncate binary pipes... /bin/dd bs=4096 count=1 checking for mt... mt checking if mt is a manifest tool... no checking how to run the C preprocessor... gcc -E checking for ANSI C header files... yes checking for sys/types.h... yes checking for sys/stat.h... yes checking for stdlib.h... yes checking for string.h... yes checking for memory.h... yes checking for strings.h... yes checking for inttypes.h... yes checking for stdint.h... yes checking for unistd.h... yes checking for dlfcn.h... yes checking for objdir... .libs checking if gcc supports -fno-rtti -fno-exceptions... no checking for gcc option to produce PIC... -fPIC -DPIC checking if gcc PIC flag -fPIC -DPIC works... yes checking if gcc static flag -static works... yes checking if gcc supports -c -o file.o... yes checking if gcc supports -c -o file.o... (cached) yes checking whether the gcc linker (/usr/bin/ld -m elf_x86_64) supports shared libraries... yes checking whether -lc should be explicitly linked in... no checking dynamic linker characteristics... GNU/Linux ld.so checking how to hardcode library paths into programs... immediate checking whether stripping libraries is possible... yes checking if libtool supports shared libraries... yes checking whether to build shared libraries... yes checking whether to build static libraries... yes checking for icotool... no checking whether gcc understands -fexceptions... yes checking whether gcc understands -fstack-protector... yes checking whether gcc understands --param=ssp-buffer-size=4... yes checking whether gcc understands -fasynchronous-unwind-tables... yes checking whether gcc understands -Wall... yes checking whether gcc understands -Wmissing-prototypes... yes checking whether gcc understands -std=c99... yes checking whether gcc understands -Wnested-externs... yes checking whether gcc understands -Wpointer-arith... yes checking whether gcc understands -Wextra... yes checking whether gcc understands -Wshadow... yes checking whether gcc understands -Wcast-align... yes checking whether gcc understands -Wwrite-strings... yes checking whether gcc understands -Waggregate-return... yes checking whether gcc understands -Winline... yes checking whether gcc understands -Wredundant-decls... yes checking whether gcc understands -Wdeprecated-declarations... yes checking whether gcc understands -Wno-sign-compare... yes checking what language compliance flags to pass to the C compiler... checking locale.h usability... yes checking locale.h presence... yes checking for locale.h... yes checking for LC_MESSAGES... yes checking libintl.h usability... yes checking libintl.h presence... yes checking for libintl.h... yes checking for ngettext in libc... yes checking for dgettext in libc... yes checking for bind_textdomain_codeset... yes checking for msgfmt... /usr/bin/msgfmt checking for dcgettext... yes checking if msgfmt accepts -c... yes checking for gmsgfmt... /usr/bin/msgfmt checking for xgettext... /usr/bin/xgettext checking whether NLS is requested... yes checking for intltool >= 0.35.0... 0.51.0 found checking for intltool-update... /usr/bin/intltool-update checking for intltool-merge... /usr/bin/intltool-merge checking for intltool-extract... /usr/bin/intltool-extract checking for xgettext... (cached) /usr/bin/xgettext checking for msgmerge... /usr/bin/msgmerge checking for msgfmt... (cached) /usr/bin/msgfmt checking for gmsgfmt... (cached) /usr/bin/msgfmt checking for perl... /usr/bin/perl checking for perl >= 5.8.1... 5.24.1 checking for XML::Parser... ok checking for pkg-config... /usr/bin/pkg-config checking pkg-config is at least version 0.9.0... yes checking for GLIB2... yes checking for glib-compile-resources... /usr/bin/glib-compile-resources checking for LIBXML2... yes checking for LIBVIRT... no configure: error: Package requirements (libvirt >= 0.10.0 libvirt-glib-1.0 >= 0.1.8) were not met: Package libvirt-glib-1.0 was not found in the pkg-config search path. Perhaps you should add the directory containing `libvirt-glib-1.0.pc' to the PKG_CONFIG_PATH environment variable Package 'libvirt-glib-1.0', required by 'world', not found Consider adjusting the PKG_CONFIG_PATH environment variable if you installed software in a non-standard prefix. Alternatively, you may set the environment variables LIBVIRT_CFLAGS and LIBVIRT_LIBS to avoid the need to call pkg-config. See the pkg-config man page for more details. Build step 'Execute shell' marked build as failure
1 1
0 0
  • ← Newer
  • 1
  • 2
  • 3
  • 4
  • 5
  • 6
  • 7
  • 8
  • 9
  • Older →

HyperKitty Powered by HyperKitty version 1.3.12.