[Libvirt-ci] Build failed in Jenkins: libvirt-go-check » libvirt-freebsd-11 #158

See <https://ci.centos.org/job/libvirt-go-check/systems=libvirt-freebsd-11/158/display/redirect> ------------------------------------------ Started by upstream project "libvirt-go-check" build number 158 originally caused by: Started by upstream project "libvirt-go-build" build number 162 originally caused by: Started by upstream project "libvirt-build" build number 189 originally caused by: Started by an SCM change [EnvInject] - Loading node environment variables. Building remotely on libvirt-freebsd-11 (libvirt) in workspace <https://ci.centos.org/job/libvirt-go-check/systems=libvirt-freebsd-11/ws/> [libvirt-go] $ /bin/sh -xe /tmp/jenkins5952691503526442077.sh + export 'TEST_ARGS=-tags api' + go test -tags api Missing macro 'VIR_DOMAIN_JOB_MEMORY_POSTCOPY_REQS' --- FAIL: TestAPICoverage (1.78s) panic: Missing symbols found [recovered] panic: Missing symbols found goroutine 19 [running]: testing.tRunner.func1(0xc0000c6100) /usr/local/go/src/testing/testing.go:792 +0x387 panic(0x5c8980, 0x635590) /usr/local/go/src/runtime/panic.go:513 +0x1b9 _/usr<https://ci.centos.org/job/libvirt-go-check/systems=libvirt-freebsd-11/ws/.TestAPICoverage(0xc0000c6100)> /usr<https://ci.centos.org/job/libvirt-go-check/systems=libvirt-freebsd-11/ws/api_test.go>:507 +0x554 testing.tRunner(0xc0000c6100, 0x616c50) /usr/local/go/src/testing/testing.go:827 +0xbf created by testing.(*T).Run /usr/local/go/src/testing/testing.go:878 +0x353 exit status 2 FAIL _/usr<https://ci.centos.org/job/libvirt-go-check/systems=libvirt-freebsd-11/ws/> 1.918s Build step 'Execute shell' marked build as failure

See <https://ci.centos.org/job/libvirt-go-check/systems=libvirt-freebsd-11/159/display/redirect> ------------------------------------------ Started by upstream project "libvirt-go-check" build number 159 originally caused by: Started by upstream project "libvirt-go-build" build number 163 originally caused by: Started by upstream project "libvirt-build" build number 190 originally caused by: Started by an SCM change Started by an SCM change Started by an SCM change Started by an SCM change Started by an SCM change [EnvInject] - Loading node environment variables. Building remotely on libvirt-freebsd-11 (libvirt) in workspace <https://ci.centos.org/job/libvirt-go-check/systems=libvirt-freebsd-11/ws/> [libvirt-go] $ /bin/sh -xe /tmp/jenkins707932552020590413.sh + export 'TEST_ARGS=-tags api' + go test -tags api Missing macro 'VIR_DOMAIN_JOB_MEMORY_POSTCOPY_REQS' --- FAIL: TestAPICoverage (0.34s) panic: Missing symbols found [recovered] panic: Missing symbols found goroutine 5 [running]: testing.tRunner.func1(0xc0000b2100) /usr/local/go/src/testing/testing.go:792 +0x387 panic(0x5c8980, 0x635590) /usr/local/go/src/runtime/panic.go:513 +0x1b9 _/usr<https://ci.centos.org/job/libvirt-go-check/systems=libvirt-freebsd-11/ws/.TestAPICoverage(0xc0000b2100)> /usr<https://ci.centos.org/job/libvirt-go-check/systems=libvirt-freebsd-11/ws/api_test.go>:507 +0x554 testing.tRunner(0xc0000b2100, 0x616c50) /usr/local/go/src/testing/testing.go:827 +0xbf created by testing.(*T).Run /usr/local/go/src/testing/testing.go:878 +0x353 exit status 2 FAIL _/usr<https://ci.centos.org/job/libvirt-go-check/systems=libvirt-freebsd-11/ws/> 0.432s Build step 'Execute shell' marked build as failure

See <https://ci.centos.org/job/libvirt-go-check/systems=libvirt-freebsd-11/160/display/redirect> ------------------------------------------ Started by upstream project "libvirt-go-check" build number 160 originally caused by: Started by upstream project "libvirt-go-build" build number 164 originally caused by: Started by upstream project "libvirt-build" build number 191 originally caused by: Started by an SCM change [EnvInject] - Loading node environment variables. Building remotely on libvirt-freebsd-11 (libvirt) in workspace <https://ci.centos.org/job/libvirt-go-check/systems=libvirt-freebsd-11/ws/> [libvirt-go] $ /bin/sh -xe /tmp/jenkins8668393110830986962.sh + export 'TEST_ARGS=-tags api' + go test -tags api Missing macro 'VIR_DOMAIN_JOB_MEMORY_POSTCOPY_REQS' --- FAIL: TestAPICoverage (0.56s) panic: Missing symbols found [recovered] panic: Missing symbols found goroutine 19 [running]: testing.tRunner.func1(0xc0000c6100) /usr/local/go/src/testing/testing.go:792 +0x387 panic(0x5c9960, 0x6364b0) /usr/local/go/src/runtime/panic.go:513 +0x1b9 _/usr<https://ci.centos.org/job/libvirt-go-check/systems=libvirt-freebsd-11/ws/.TestAPICoverage(0xc0000c6100)> /usr<https://ci.centos.org/job/libvirt-go-check/systems=libvirt-freebsd-11/ws/api_test.go>:507 +0x554 testing.tRunner(0xc0000c6100, 0x617b30) /usr/local/go/src/testing/testing.go:827 +0xbf created by testing.(*T).Run /usr/local/go/src/testing/testing.go:878 +0x35c exit status 2 FAIL _/usr<https://ci.centos.org/job/libvirt-go-check/systems=libvirt-freebsd-11/ws/> 1.020s Build step 'Execute shell' marked build as failure

See <https://ci.centos.org/job/libvirt-go-check/systems=libvirt-freebsd-11/161/display/redirect> ------------------------------------------ Started by upstream project "libvirt-go-check" build number 161 originally caused by: Started by upstream project "libvirt-go-build" build number 165 originally caused by: Started by upstream project "libvirt-build" build number 192 originally caused by: Started by an SCM change [EnvInject] - Loading node environment variables. Building remotely on libvirt-freebsd-11 (libvirt) in workspace <https://ci.centos.org/job/libvirt-go-check/systems=libvirt-freebsd-11/ws/> [libvirt-go] $ /bin/sh -xe /tmp/jenkins6704110609277075413.sh + export 'TEST_ARGS=-tags api' + go test -tags api Missing macro 'VIR_DOMAIN_JOB_MEMORY_POSTCOPY_REQS' --- FAIL: TestAPICoverage (0.71s) panic: Missing symbols found [recovered] panic: Missing symbols found goroutine 4 [running]: testing.tRunner.func1(0xc0000c8100) /usr/local/go/src/testing/testing.go:792 +0x387 panic(0x5c9960, 0x6364b0) /usr/local/go/src/runtime/panic.go:513 +0x1b9 _/usr<https://ci.centos.org/job/libvirt-go-check/systems=libvirt-freebsd-11/ws/.TestAPICoverage(0xc0000c8100)> /usr<https://ci.centos.org/job/libvirt-go-check/systems=libvirt-freebsd-11/ws/api_test.go>:507 +0x554 testing.tRunner(0xc0000c8100, 0x617b30) /usr/local/go/src/testing/testing.go:827 +0xbf created by testing.(*T).Run /usr/local/go/src/testing/testing.go:878 +0x35c exit status 2 FAIL _/usr<https://ci.centos.org/job/libvirt-go-check/systems=libvirt-freebsd-11/ws/> 1.058s Build step 'Execute shell' marked build as failure

See <https://ci.centos.org/job/libvirt-go-check/systems=libvirt-freebsd-11/162/display/redirect> ------------------------------------------ Started by upstream project "libvirt-go-check" build number 162 originally caused by: Started by upstream project "libvirt-go-build" build number 166 originally caused by: Started by upstream project "libvirt-build" build number 193 originally caused by: Started by an SCM change Started by an SCM change Started by an SCM change Started by an SCM change [EnvInject] - Loading node environment variables. Building remotely on libvirt-freebsd-11 (libvirt) in workspace <https://ci.centos.org/job/libvirt-go-check/systems=libvirt-freebsd-11/ws/> [libvirt-go] $ /bin/sh -xe /tmp/jenkins4493692573086585308.sh + export 'TEST_ARGS=-tags api' + go test -tags api Missing macro 'VIR_DOMAIN_JOB_MEMORY_POSTCOPY_REQS' --- FAIL: TestAPICoverage (0.70s) panic: Missing symbols found [recovered] panic: Missing symbols found goroutine 18 [running]: testing.tRunner.func1(0xc0000bc100) /usr/local/go/src/testing/testing.go:792 +0x387 panic(0x5c9960, 0x6364b0) /usr/local/go/src/runtime/panic.go:513 +0x1b9 _/usr<https://ci.centos.org/job/libvirt-go-check/systems=libvirt-freebsd-11/ws/.TestAPICoverage(0xc0000bc100)> /usr<https://ci.centos.org/job/libvirt-go-check/systems=libvirt-freebsd-11/ws/api_test.go>:507 +0x554 testing.tRunner(0xc0000bc100, 0x617b30) /usr/local/go/src/testing/testing.go:827 +0xbf created by testing.(*T).Run /usr/local/go/src/testing/testing.go:878 +0x35c exit status 2 FAIL _/usr<https://ci.centos.org/job/libvirt-go-check/systems=libvirt-freebsd-11/ws/> 0.947s Build step 'Execute shell' marked build as failure

See <https://ci.centos.org/job/libvirt-go-check/systems=libvirt-freebsd-11/163/display/redirect> ------------------------------------------ Started by upstream project "libvirt-go-check" build number 163 originally caused by: Started by upstream project "libvirt-go-build" build number 167 originally caused by: Started by upstream project "libvirt-build" build number 194 originally caused by: Started by an SCM change [EnvInject] - Loading node environment variables. Building remotely on libvirt-freebsd-11 (libvirt) in workspace <https://ci.centos.org/job/libvirt-go-check/systems=libvirt-freebsd-11/ws/> [libvirt-go] $ /bin/sh -xe /tmp/jenkins5886809032401394922.sh + export 'TEST_ARGS=-tags api' + go test -tags api Missing macro 'VIR_DOMAIN_JOB_MEMORY_POSTCOPY_REQS' --- FAIL: TestAPICoverage (0.46s) panic: Missing symbols found [recovered] panic: Missing symbols found goroutine 20 [running]: testing.tRunner.func1(0xc0000c4100) /usr/local/go/src/testing/testing.go:792 +0x387 panic(0x5c9960, 0x6364b0) /usr/local/go/src/runtime/panic.go:513 +0x1b9 _/usr<https://ci.centos.org/job/libvirt-go-check/systems=libvirt-freebsd-11/ws/.TestAPICoverage(0xc0000c4100)> /usr<https://ci.centos.org/job/libvirt-go-check/systems=libvirt-freebsd-11/ws/api_test.go>:507 +0x554 testing.tRunner(0xc0000c4100, 0x617b30) /usr/local/go/src/testing/testing.go:827 +0xbf created by testing.(*T).Run /usr/local/go/src/testing/testing.go:878 +0x35c exit status 2 FAIL _/usr<https://ci.centos.org/job/libvirt-go-check/systems=libvirt-freebsd-11/ws/> 0.800s Build step 'Execute shell' marked build as failure

See <https://ci.centos.org/job/libvirt-go-check/systems=libvirt-freebsd-11/164/display/redirect> ------------------------------------------ Started by upstream project "libvirt-go-check" build number 164 originally caused by: Started by upstream project "libvirt-go-build" build number 168 originally caused by: Started by upstream project "libvirt-build" build number 195 originally caused by: Started by an SCM change [EnvInject] - Loading node environment variables. Building remotely on libvirt-freebsd-11 (libvirt) in workspace <https://ci.centos.org/job/libvirt-go-check/systems=libvirt-freebsd-11/ws/> [libvirt-go] $ /bin/sh -xe /tmp/jenkins7462954522535051601.sh + export 'TEST_ARGS=-tags api' + go test -tags api Missing macro 'VIR_DOMAIN_JOB_MEMORY_POSTCOPY_REQS' --- FAIL: TestAPICoverage (0.36s) panic: Missing symbols found [recovered] panic: Missing symbols found goroutine 4 [running]: testing.tRunner.func1(0xc0000b0100) /usr/local/go/src/testing/testing.go:792 +0x387 panic(0x5c9960, 0x6364b0) /usr/local/go/src/runtime/panic.go:513 +0x1b9 _/usr<https://ci.centos.org/job/libvirt-go-check/systems=libvirt-freebsd-11/ws/.TestAPICoverage(0xc0000b0100)> /usr<https://ci.centos.org/job/libvirt-go-check/systems=libvirt-freebsd-11/ws/api_test.go>:507 +0x554 testing.tRunner(0xc0000b0100, 0x617b30) /usr/local/go/src/testing/testing.go:827 +0xbf created by testing.(*T).Run /usr/local/go/src/testing/testing.go:878 +0x35c exit status 2 FAIL _/usr<https://ci.centos.org/job/libvirt-go-check/systems=libvirt-freebsd-11/ws/> 0.626s Build step 'Execute shell' marked build as failure

participants (1)
-
ci@centos.org