[Libvirt-ci] Build failed in Jenkins: libvirt-master-check » libvirt-centos-7 #779

See <https://ci.centos.org/job/libvirt-master-check/systems=libvirt-centos-7/779/display/redirect> ------------------------------------------ [...truncated 24.72 KB...] PASS: test-btowc1.sh PASS: test-byteswap PASS: test-c-ctype PASS: test-canonicalize-lgpl PASS: test-c-strcase.sh PASS: test-cloexec PASS: test-chown PASS: test-close PASS: test-connect PASS: test-count-leading-zeros PASS: test-count-one-bits PASS: test-md5 PASS: test-dup PASS: test-c-strcasestr PASS: test-ctype PASS: test-dup2 PASS: test-environ PASS: test-errno PASS: test-fclose PASS: test-fcntl-h PASS: test-fcntl PASS: test-fdatasync PASS: test-fflush PASS: test-fdopen PASS: test-ffs PASS: test-fflush2.sh PASS: test-ffsl PASS: test-fgetc PASS: test-float PASS: test-fnmatch PASS: test-fpurge PASS: test-fputc PASS: test-freading PASS: test-fread PASS: test-fseek.sh PASS: test-fseeko2.sh PASS: test-fseek2.sh PASS: test-fseeko.sh PASS: test-fseeko3.sh PASS: test-fseeko4.sh PASS: test-fstat PASS: test-fsync PASS: test-ftell2.sh PASS: test-ftell.sh PASS: test-ftell3 PASS: test-ftello3 PASS: test-ftello.sh PASS: test-ftello2.sh PASS: test-ftello4.sh PASS: test-ftruncate.sh PASS: test-func PASS: test-fwrite PASS: test-getcwd-lgpl PASS: test-getdelim PASS: test-getgroups PASS: test-getdtablesize PASS: test-getaddrinfo PASS: test-gethostname PASS: test-getline PASS: test-getopt-posix PASS: test-getpeername PASS: test-getprogname PASS: test-getsockname PASS: test-getsockopt PASS: test-gettimeofday PASS: test-grantpt PASS: test-inet_pton PASS: test-inet_ntop PASS: test-ignore-value PASS: test-inttypes PASS: test-intprops PASS: test-ioctl PASS: test-isblank PASS: test-isatty PASS: test-isnand-nolibm PASS: test-isnanf-nolibm PASS: test-isnanl-nolibm PASS: test-langinfo PASS: test-limits-h PASS: test-ldexp PASS: test-listen PASS: test-locale PASS: test-localeconv PASS: test-lstat PASS: test-lseek.sh PASS: test-malloca PASS: test-math PASS: test-mbrtowc1.sh PASS: test-mbrtowc2.sh PASS: test-mbrtowc4.sh PASS: test-localename PASS: test-mbrtowc3.sh PASS: test-mbrtowc5.sh SKIP: test-mbrtowc-w32-1.sh SKIP: test-mbrtowc-w32-2.sh SKIP: test-mbrtowc-w32-5.sh SKIP: test-mbrtowc-w32-3.sh SKIP: test-mbrtowc-w32-4.sh PASS: test-mbsinit.sh PASS: test-mbsrtowcs1.sh PASS: test-mbsrtowcs3.sh PASS: test-mbsrtowcs2.sh PASS: test-mbsrtowcs4.sh PASS: test-net_if PASS: test-netdb PASS: test-netinet_in PASS: test-nl_langinfo.sh PASS: test-memchr PASS: test-nanosleep PASS: test-nonblocking PASS: test-open PASS: test-openpty PASS: test-passfd PASS: test-pathmax PASS: test-perror.sh PASS: test-perror2 PASS: test-pipe PASS: test-pipe2 PASS: test-poll-h PASS: test-poll PASS: test-posix_openpt PASS: test-posix_spawn_file_actions_addclose PASS: test-posix_spawn_file_actions_adddup2 PASS: test-posix_spawn_file_actions_addopen PASS: test-posix_spawn1 PASS: test-posix_spawn2 PASS: test-pthread_sigmask1 PASS: test-nonblocking-pipe.sh SKIP: test-ptsname SKIP: test-ptsname_r PASS: test-raise PASS: test-random_r PASS: test-rawmemchr PASS: test-read PASS: test-pthread_sigmask2 PASS: test-readlink PASS: test-recv PASS: test-regex PASS: test-sched PASS: test-select PASS: test-nonblocking-socket.sh PASS: test-send PASS: test-setenv PASS: test-setlocale1.sh PASS: test-select-out.sh PASS: test-setsockopt PASS: test-sigaction PASS: test-setlocale2.sh PASS: test-signal-h PASS: test-signbit PASS: test-sigpipe.sh PASS: test-select-in.sh PASS: test-snprintf PASS: test-sockets PASS: test-spawn PASS: test-stat PASS: test-stat-time PASS: test-stdalign PASS: test-stdbool PASS: test-stddef PASS: test-stdint PASS: test-stdio PASS: test-stdlib PASS: test-sigprocmask PASS: test-strchrnul PASS: test-strerror PASS: test-strerror_r PASS: test-sleep PASS: test-string PASS: test-strings PASS: test-strnlen PASS: test-symlink PASS: test-sys_ioctl PASS: test-sys_select PASS: test-sys_socket PASS: test-sys_stat PASS: test-sys_time PASS: test-sys_types PASS: test-sys_uio PASS: test-sys_utsname PASS: test-sys_wait PASS: test-termios PASS: test-thread_self PASS: test-thread_create PASS: test-time SKIP: test-ttyname_r PASS: test-uname PASS: test-unistd PASS: test-unlockpt PASS: test-unsetenv PASS: test-vasnprintf PASS: test-vasprintf PASS: test-init.sh SKIP: test-vc-list-files-cvs.sh PASS: test-verify ../../../build-aux/test-driver: line 95: 9646 Aborted "$@" > $log_file 2>&1 FAIL: test-usleep PASS: test-vsnprintf PASS: test-wchar PASS: test-vc-list-files-git.sh PASS: test-wcrtomb.sh SKIP: test-wcrtomb-w32-1.sh SKIP: test-wcrtomb-w32-3.sh SKIP: test-wcrtomb-w32-2.sh SKIP: test-wcrtomb-w32-4.sh PASS: test-wctype-h SKIP: test-wcrtomb-w32-5.sh PASS: test-write PASS: test-xalloc-die.sh PASS: test-verify.sh make[6]: Entering directory `<https://ci.centos.org/job/libvirt-master-check/systems=libvirt-centos-7/ws/build/gnulib/tests'> make all-recursive make[7]: Entering directory `<https://ci.centos.org/job/libvirt-master-check/systems=libvirt-centos-7/ws/build/gnulib/tests'> Making all in . make[8]: Entering directory `<https://ci.centos.org/job/libvirt-master-check/systems=libvirt-centos-7/ws/build/gnulib/tests'> make[8]: Nothing to be done for `all-am'. make[8]: Leaving directory `<https://ci.centos.org/job/libvirt-master-check/systems=libvirt-centos-7/ws/build/gnulib/tests'> make[7]: Leaving directory `<https://ci.centos.org/job/libvirt-master-check/systems=libvirt-centos-7/ws/build/gnulib/tests'> make[6]: Leaving directory `<https://ci.centos.org/job/libvirt-master-check/systems=libvirt-centos-7/ws/build/gnulib/tests'> ============================================================================ Testsuite summary for libvirt 3.11.0 ============================================================================ # TOTAL: 218 # PASS: 203 # SKIP: 14 # XFAIL: 0 # FAIL: 1 # XPASS: 0 # ERROR: 0 ============================================================================ See gnulib/tests/test-suite.log Please report to libvir-list@redhat.com ============================================================================ make[5]: *** [test-suite.log] Error 1 make[5]: Leaving directory `<https://ci.centos.org/job/libvirt-master-check/systems=libvirt-centos-7/ws/build/gnulib/tests'> make[4]: *** [check-TESTS] Error 2 make[4]: Leaving directory `<https://ci.centos.org/job/libvirt-master-check/systems=libvirt-centos-7/ws/build/gnulib/tests'> make[3]: *** [check-am] Error 2 make[3]: Leaving directory `<https://ci.centos.org/job/libvirt-master-check/systems=libvirt-centos-7/ws/build/gnulib/tests'> make[2]: *** [check-recursive] Error 1 make[2]: Leaving directory `<https://ci.centos.org/job/libvirt-master-check/systems=libvirt-centos-7/ws/build/gnulib/tests'> make[1]: *** [check] Error 2 make[1]: Leaving directory `<https://ci.centos.org/job/libvirt-master-check/systems=libvirt-centos-7/ws/build/gnulib/tests'> make: *** [check-recursive] Error 1 + cat tests/test-suite.log cat: tests/test-suite.log: No such file or directory + true + exit 1 Build step 'Execute shell' marked build as failure

participants (1)
-
ci@centos.org