[Libvirt-ci] Build failed in Jenkins: libvirt-go-check » libvirt-fedora-28 #158

See <https://ci.centos.org/job/libvirt-go-check/systems=libvirt-fedora-28/158/display/redirect> ------------------------------------------ Started by upstream project "libvirt-go-check" build number 158 originally caused by: Started by upstream project "libvirt-go-build" build number 162 originally caused by: Started by upstream project "libvirt-build" build number 189 originally caused by: Started by an SCM change [EnvInject] - Loading node environment variables. Building remotely on libvirt-fedora-28 (libvirt) in workspace <https://ci.centos.org/job/libvirt-go-check/systems=libvirt-fedora-28/ws/> [libvirt-go] $ /bin/sh -xe /tmp/jenkins4495958808645460111.sh + export 'TEST_ARGS=-tags api' + TEST_ARGS='-tags api' + go test -tags api Missing macro 'VIR_DOMAIN_JOB_MEMORY_POSTCOPY_REQS' --- FAIL: TestAPICoverage (0.39s) panic: Missing symbols found [recovered] panic: Missing symbols found goroutine 5 [running]: testing.tRunner.func1(0xc4200aa0f0) /usr/lib/golang/src/testing/testing.go:742 +0x29d panic(0x5c0d80, 0x624cc0) /usr/lib/golang/src/runtime/panic.go:502 +0x229 _<https://ci.centos.org/job/libvirt-go-check/systems=libvirt-fedora-28/ws/.TestAPICoverage(0xc4200aa0f0)> <https://ci.centos.org/job/libvirt-go-check/systems=libvirt-fedora-28/ws/api_test.go>:507 +0x548 testing.tRunner(0xc4200aa0f0, 0x60fdd8) /usr/lib/golang/src/testing/testing.go:777 +0xd0 created by testing.(*T).Run /usr/lib/golang/src/testing/testing.go:824 +0x2e0 exit status 2 FAIL _<https://ci.centos.org/job/libvirt-go-check/systems=libvirt-fedora-28/ws/> 0.579s Build step 'Execute shell' marked build as failure

See <https://ci.centos.org/job/libvirt-go-check/systems=libvirt-fedora-28/159/display/redirect> ------------------------------------------ Started by upstream project "libvirt-go-check" build number 159 originally caused by: Started by upstream project "libvirt-go-build" build number 163 originally caused by: Started by upstream project "libvirt-build" build number 190 originally caused by: Started by an SCM change Started by an SCM change Started by an SCM change Started by an SCM change Started by an SCM change [EnvInject] - Loading node environment variables. Building remotely on libvirt-fedora-28 (libvirt) in workspace <https://ci.centos.org/job/libvirt-go-check/systems=libvirt-fedora-28/ws/> [libvirt-go] $ /bin/sh -xe /tmp/jenkins7091878419616392139.sh + export 'TEST_ARGS=-tags api' + TEST_ARGS='-tags api' + go test -tags api Missing macro 'VIR_DOMAIN_JOB_MEMORY_POSTCOPY_REQS' --- FAIL: TestAPICoverage (0.55s) panic: Missing symbols found [recovered] panic: Missing symbols found goroutine 19 [running]: testing.tRunner.func1(0xc4200c60f0) /usr/lib/golang/src/testing/testing.go:742 +0x29d panic(0x5c0d80, 0x624cc0) /usr/lib/golang/src/runtime/panic.go:502 +0x229 _<https://ci.centos.org/job/libvirt-go-check/systems=libvirt-fedora-28/ws/.TestAPICoverage(0xc4200c60f0)> <https://ci.centos.org/job/libvirt-go-check/systems=libvirt-fedora-28/ws/api_test.go>:507 +0x548 testing.tRunner(0xc4200c60f0, 0x60fdd8) /usr/lib/golang/src/testing/testing.go:777 +0xd0 created by testing.(*T).Run /usr/lib/golang/src/testing/testing.go:824 +0x2e0 exit status 2 FAIL _<https://ci.centos.org/job/libvirt-go-check/systems=libvirt-fedora-28/ws/> 0.851s Build step 'Execute shell' marked build as failure

See <https://ci.centos.org/job/libvirt-go-check/systems=libvirt-fedora-28/160/display/redirect> ------------------------------------------ Started by upstream project "libvirt-go-check" build number 160 originally caused by: Started by upstream project "libvirt-go-build" build number 164 originally caused by: Started by upstream project "libvirt-build" build number 191 originally caused by: Started by an SCM change [EnvInject] - Loading node environment variables. Building remotely on libvirt-fedora-28 (libvirt) in workspace <https://ci.centos.org/job/libvirt-go-check/systems=libvirt-fedora-28/ws/> [libvirt-go] $ /bin/sh -xe /tmp/jenkins8314674865495720535.sh + export 'TEST_ARGS=-tags api' + TEST_ARGS='-tags api' + go test -tags api Missing macro 'VIR_DOMAIN_JOB_MEMORY_POSTCOPY_REQS' --- FAIL: TestAPICoverage (0.87s) panic: Missing symbols found [recovered] panic: Missing symbols found goroutine 5 [running]: testing.tRunner.func1(0xc4200aa0f0) /usr/lib/golang/src/testing/testing.go:742 +0x29d panic(0x5c0d80, 0x624cc0) /usr/lib/golang/src/runtime/panic.go:502 +0x229 _<https://ci.centos.org/job/libvirt-go-check/systems=libvirt-fedora-28/ws/.TestAPICoverage(0xc4200aa0f0)> <https://ci.centos.org/job/libvirt-go-check/systems=libvirt-fedora-28/ws/api_test.go>:507 +0x548 testing.tRunner(0xc4200aa0f0, 0x60fdd8) /usr/lib/golang/src/testing/testing.go:777 +0xd0 created by testing.(*T).Run /usr/lib/golang/src/testing/testing.go:824 +0x2e0 exit status 2 FAIL _<https://ci.centos.org/job/libvirt-go-check/systems=libvirt-fedora-28/ws/> 1.060s Build step 'Execute shell' marked build as failure

See <https://ci.centos.org/job/libvirt-go-check/systems=libvirt-fedora-28/161/display/redirect> ------------------------------------------ Started by upstream project "libvirt-go-check" build number 161 originally caused by: Started by upstream project "libvirt-go-build" build number 165 originally caused by: Started by upstream project "libvirt-build" build number 192 originally caused by: Started by an SCM change [EnvInject] - Loading node environment variables. Building remotely on libvirt-fedora-28 (libvirt) in workspace <https://ci.centos.org/job/libvirt-go-check/systems=libvirt-fedora-28/ws/> [libvirt-go] $ /bin/sh -xe /tmp/jenkins7320989346887375166.sh + export 'TEST_ARGS=-tags api' + TEST_ARGS='-tags api' + go test -tags api Missing macro 'VIR_DOMAIN_JOB_MEMORY_POSTCOPY_REQS' --- FAIL: TestAPICoverage (1.02s) panic: Missing symbols found [recovered] panic: Missing symbols found goroutine 5 [running]: testing.tRunner.func1(0xc4200aa0f0) /usr/lib/golang/src/testing/testing.go:742 +0x29d panic(0x5c0d80, 0x624cc0) /usr/lib/golang/src/runtime/panic.go:502 +0x229 _<https://ci.centos.org/job/libvirt-go-check/systems=libvirt-fedora-28/ws/.TestAPICoverage(0xc4200aa0f0)> <https://ci.centos.org/job/libvirt-go-check/systems=libvirt-fedora-28/ws/api_test.go>:507 +0x548 testing.tRunner(0xc4200aa0f0, 0x60fdd8) /usr/lib/golang/src/testing/testing.go:777 +0xd0 created by testing.(*T).Run /usr/lib/golang/src/testing/testing.go:824 +0x2e0 exit status 2 FAIL _<https://ci.centos.org/job/libvirt-go-check/systems=libvirt-fedora-28/ws/> 1.316s Build step 'Execute shell' marked build as failure

See <https://ci.centos.org/job/libvirt-go-check/systems=libvirt-fedora-28/162/display/redirect> ------------------------------------------ Started by upstream project "libvirt-go-check" build number 162 originally caused by: Started by upstream project "libvirt-go-build" build number 166 originally caused by: Started by upstream project "libvirt-build" build number 193 originally caused by: Started by an SCM change Started by an SCM change Started by an SCM change Started by an SCM change [EnvInject] - Loading node environment variables. Building remotely on libvirt-fedora-28 (libvirt) in workspace <https://ci.centos.org/job/libvirt-go-check/systems=libvirt-fedora-28/ws/> [libvirt-go] $ /bin/sh -xe /tmp/jenkins4474918246564652988.sh + export 'TEST_ARGS=-tags api' + TEST_ARGS='-tags api' + go test -tags api Missing macro 'VIR_DOMAIN_JOB_MEMORY_POSTCOPY_REQS' --- FAIL: TestAPICoverage (0.85s) panic: Missing symbols found [recovered] panic: Missing symbols found goroutine 5 [running]: testing.tRunner.func1(0xc4200aa0f0) /usr/lib/golang/src/testing/testing.go:742 +0x29d panic(0x5c0d80, 0x624cc0) /usr/lib/golang/src/runtime/panic.go:502 +0x229 _<https://ci.centos.org/job/libvirt-go-check/systems=libvirt-fedora-28/ws/.TestAPICoverage(0xc4200aa0f0)> <https://ci.centos.org/job/libvirt-go-check/systems=libvirt-fedora-28/ws/api_test.go>:507 +0x548 testing.tRunner(0xc4200aa0f0, 0x60fdd8) /usr/lib/golang/src/testing/testing.go:777 +0xd0 created by testing.(*T).Run /usr/lib/golang/src/testing/testing.go:824 +0x2e0 exit status 2 FAIL _<https://ci.centos.org/job/libvirt-go-check/systems=libvirt-fedora-28/ws/> 1.020s Build step 'Execute shell' marked build as failure

See <https://ci.centos.org/job/libvirt-go-check/systems=libvirt-fedora-28/163/display/redirect> ------------------------------------------ Started by upstream project "libvirt-go-check" build number 163 originally caused by: Started by upstream project "libvirt-go-build" build number 167 originally caused by: Started by upstream project "libvirt-build" build number 194 originally caused by: Started by an SCM change [EnvInject] - Loading node environment variables. Building remotely on libvirt-fedora-28 (libvirt) in workspace <https://ci.centos.org/job/libvirt-go-check/systems=libvirt-fedora-28/ws/> [libvirt-go] $ /bin/sh -xe /tmp/jenkins3324930950406931813.sh + export 'TEST_ARGS=-tags api' + TEST_ARGS='-tags api' + go test -tags api Missing macro 'VIR_DOMAIN_JOB_MEMORY_POSTCOPY_REQS' --- FAIL: TestAPICoverage (1.14s) panic: Missing symbols found [recovered] panic: Missing symbols found goroutine 5 [running]: testing.tRunner.func1(0xc4200aa0f0) /usr/lib/golang/src/testing/testing.go:742 +0x29d panic(0x5c0d80, 0x624cc0) /usr/lib/golang/src/runtime/panic.go:502 +0x229 _<https://ci.centos.org/job/libvirt-go-check/systems=libvirt-fedora-28/ws/.TestAPICoverage(0xc4200aa0f0)> <https://ci.centos.org/job/libvirt-go-check/systems=libvirt-fedora-28/ws/api_test.go>:507 +0x548 testing.tRunner(0xc4200aa0f0, 0x60fdd8) /usr/lib/golang/src/testing/testing.go:777 +0xd0 created by testing.(*T).Run /usr/lib/golang/src/testing/testing.go:824 +0x2e0 exit status 2 FAIL _<https://ci.centos.org/job/libvirt-go-check/systems=libvirt-fedora-28/ws/> 1.443s Build step 'Execute shell' marked build as failure

See <https://ci.centos.org/job/libvirt-go-check/systems=libvirt-fedora-28/164/display/redirect> ------------------------------------------ Started by upstream project "libvirt-go-check" build number 164 originally caused by: Started by upstream project "libvirt-go-build" build number 168 originally caused by: Started by upstream project "libvirt-build" build number 195 originally caused by: Started by an SCM change [EnvInject] - Loading node environment variables. Building remotely on libvirt-fedora-28 (libvirt) in workspace <https://ci.centos.org/job/libvirt-go-check/systems=libvirt-fedora-28/ws/> [libvirt-go] $ /bin/sh -xe /tmp/jenkins1917345474176356977.sh + export 'TEST_ARGS=-tags api' + TEST_ARGS='-tags api' + go test -tags api Missing macro 'VIR_DOMAIN_JOB_MEMORY_POSTCOPY_REQS' --- FAIL: TestAPICoverage (0.84s) panic: Missing symbols found [recovered] panic: Missing symbols found goroutine 19 [running]: testing.tRunner.func1(0xc4200c60f0) /usr/lib/golang/src/testing/testing.go:742 +0x29d panic(0x5c0d80, 0x624cc0) /usr/lib/golang/src/runtime/panic.go:502 +0x229 _<https://ci.centos.org/job/libvirt-go-check/systems=libvirt-fedora-28/ws/.TestAPICoverage(0xc4200c60f0)> <https://ci.centos.org/job/libvirt-go-check/systems=libvirt-fedora-28/ws/api_test.go>:507 +0x548 testing.tRunner(0xc4200c60f0, 0x60fdd8) /usr/lib/golang/src/testing/testing.go:777 +0xd0 created by testing.(*T).Run /usr/lib/golang/src/testing/testing.go:824 +0x2e0 exit status 2 FAIL _<https://ci.centos.org/job/libvirt-go-check/systems=libvirt-fedora-28/ws/> 1.127s Build step 'Execute shell' marked build as failure

participants (1)
-
ci@centos.org