[Libvirt-ci] Build failed in Jenkins: libvirt-go-master-check » libvirt-fedora-28 #1109

See <https://ci.centos.org/job/libvirt-go-master-check/systems=libvirt-fedora-28/1109/display/redirect> ------------------------------------------ Started by upstream project "libvirt-go-master-check" build number 1109 originally caused by: Started by upstream project "libvirt-go-master-build" build number 1120 originally caused by: Started by upstream project "libvirt-master-build" build number 1519 originally caused by: Started by an SCM change Started by an SCM change [EnvInject] - Loading node environment variables. Building remotely on libvirt-fedora-28 (libvirt) in workspace <https://ci.centos.org/job/libvirt-go-master-check/systems=libvirt-fedora-28/ws/> [libvirt-go-master] $ /bin/sh -xe /tmp/jenkins862240668957503430.sh + export 'TEST_ARGS=-tags api' + TEST_ARGS='-tags api' + go test -tags api Missing function 'virDomainGetLaunchSecurityInfo' Missing function 'virNodeGetSEVInfo' Missing macro 'VIR_DOMAIN_LAUNCH_SECURITY_SEV_MEASUREMENT' Missing macro 'VIR_NODE_SEV_CBITPOS' Missing macro 'VIR_NODE_SEV_CERT_CHAIN' Missing macro 'VIR_NODE_SEV_PDH' Missing macro 'VIR_NODE_SEV_REDUCED_PHYS_BITS' --- FAIL: TestAPICoverage (1.49s) panic: Missing symbols found [recovered] panic: Missing symbols found goroutine 19 [running]: testing.tRunner.func1(0xc4200c80f0) /usr/lib/golang/src/testing/testing.go:742 +0x29d panic(0x5ad840, 0x611bd0) /usr/lib/golang/src/runtime/panic.go:502 +0x229 _<https://ci.centos.org/job/libvirt-go-master-check/systems=libvirt-fedora-28/ws/.TestAPICoverage(0xc4200c80f0)> <https://ci.centos.org/job/libvirt-go-master-check/systems=libvirt-fedora-28/ws/api_test.go>:506 +0x548 testing.tRunner(0xc4200c80f0, 0x5fccb0) /usr/lib/golang/src/testing/testing.go:777 +0xd0 created by testing.(*T).Run /usr/lib/golang/src/testing/testing.go:824 +0x2e0 exit status 2 FAIL _<https://ci.centos.org/job/libvirt-go-master-check/systems=libvirt-fedora-28/ws/> 1.841s Build step 'Execute shell' marked build as failure

See <https://ci.centos.org/job/libvirt-go-master-check/systems=libvirt-fedora-28/1110/display/redirect> ------------------------------------------ Started by upstream project "libvirt-go-master-check" build number 1110 originally caused by: Started by upstream project "libvirt-go-master-build" build number 1121 originally caused by: Started by upstream project "libvirt-master-build" build number 1520 originally caused by: Started by an SCM change Started by an SCM change Started by an SCM change Started by an SCM change [EnvInject] - Loading node environment variables. Building remotely on libvirt-fedora-28 (libvirt) in workspace <https://ci.centos.org/job/libvirt-go-master-check/systems=libvirt-fedora-28/ws/> [libvirt-go-master] $ /bin/sh -xe /tmp/jenkins6457838747201527491.sh + export 'TEST_ARGS=-tags api' + TEST_ARGS='-tags api' + go test -tags api Missing function 'virDomainGetLaunchSecurityInfo' Missing function 'virNodeGetSEVInfo' Missing macro 'VIR_DOMAIN_LAUNCH_SECURITY_SEV_MEASUREMENT' Missing macro 'VIR_NODE_SEV_CBITPOS' Missing macro 'VIR_NODE_SEV_CERT_CHAIN' Missing macro 'VIR_NODE_SEV_PDH' Missing macro 'VIR_NODE_SEV_REDUCED_PHYS_BITS' --- FAIL: TestAPICoverage (0.47s) panic: Missing symbols found [recovered] panic: Missing symbols found goroutine 19 [running]: testing.tRunner.func1(0xc4200c80f0) /usr/lib/golang/src/testing/testing.go:742 +0x29d panic(0x5ad840, 0x611bd0) /usr/lib/golang/src/runtime/panic.go:502 +0x229 _<https://ci.centos.org/job/libvirt-go-master-check/systems=libvirt-fedora-28/ws/.TestAPICoverage(0xc4200c80f0)> <https://ci.centos.org/job/libvirt-go-master-check/systems=libvirt-fedora-28/ws/api_test.go>:506 +0x548 testing.tRunner(0xc4200c80f0, 0x5fccb0) /usr/lib/golang/src/testing/testing.go:777 +0xd0 created by testing.(*T).Run /usr/lib/golang/src/testing/testing.go:824 +0x2e0 exit status 2 FAIL _<https://ci.centos.org/job/libvirt-go-master-check/systems=libvirt-fedora-28/ws/> 0.660s Build step 'Execute shell' marked build as failure

See <https://ci.centos.org/job/libvirt-go-master-check/systems=libvirt-fedora-28/1111/display/redirect> ------------------------------------------ Started by upstream project "libvirt-go-master-check" build number 1111 originally caused by: Started by upstream project "libvirt-go-master-build" build number 1122 originally caused by: Started by upstream project "libvirt-master-build" build number 1521 originally caused by: Started by an SCM change [EnvInject] - Loading node environment variables. Building remotely on libvirt-fedora-28 (libvirt) in workspace <https://ci.centos.org/job/libvirt-go-master-check/systems=libvirt-fedora-28/ws/> [libvirt-go-master] $ /bin/sh -xe /tmp/jenkins1410798061245037353.sh + export 'TEST_ARGS=-tags api' + TEST_ARGS='-tags api' + go test -tags api Missing function 'virDomainGetLaunchSecurityInfo' Missing function 'virNodeGetSEVInfo' Missing macro 'VIR_DOMAIN_LAUNCH_SECURITY_SEV_MEASUREMENT' Missing macro 'VIR_NODE_SEV_CBITPOS' Missing macro 'VIR_NODE_SEV_CERT_CHAIN' Missing macro 'VIR_NODE_SEV_PDH' Missing macro 'VIR_NODE_SEV_REDUCED_PHYS_BITS' --- FAIL: TestAPICoverage (0.71s) panic: Missing symbols found [recovered] panic: Missing symbols found goroutine 5 [running]: testing.tRunner.func1(0xc4200aa0f0) /usr/lib/golang/src/testing/testing.go:742 +0x29d panic(0x5ad840, 0x611bd0) /usr/lib/golang/src/runtime/panic.go:502 +0x229 _<https://ci.centos.org/job/libvirt-go-master-check/systems=libvirt-fedora-28/ws/.TestAPICoverage(0xc4200aa0f0)> <https://ci.centos.org/job/libvirt-go-master-check/systems=libvirt-fedora-28/ws/api_test.go>:506 +0x548 testing.tRunner(0xc4200aa0f0, 0x5fccb0) /usr/lib/golang/src/testing/testing.go:777 +0xd0 created by testing.(*T).Run /usr/lib/golang/src/testing/testing.go:824 +0x2e0 exit status 2 FAIL _<https://ci.centos.org/job/libvirt-go-master-check/systems=libvirt-fedora-28/ws/> 0.798s Build step 'Execute shell' marked build as failure

See <https://ci.centos.org/job/libvirt-go-master-check/systems=libvirt-fedora-28/1112/display/redirect> ------------------------------------------ Started by upstream project "libvirt-go-master-check" build number 1112 originally caused by: Started by upstream project "libvirt-go-master-build" build number 1123 originally caused by: Started by upstream project "libvirt-master-build" build number 1522 originally caused by: Started by an SCM change [EnvInject] - Loading node environment variables. Building remotely on libvirt-fedora-28 (libvirt) in workspace <https://ci.centos.org/job/libvirt-go-master-check/systems=libvirt-fedora-28/ws/> [libvirt-go-master] $ /bin/sh -xe /tmp/jenkins1074364668609350814.sh + export 'TEST_ARGS=-tags api' + TEST_ARGS='-tags api' + go test -tags api Missing function 'virDomainGetLaunchSecurityInfo' Missing function 'virNodeGetSEVInfo' Missing macro 'VIR_DOMAIN_LAUNCH_SECURITY_SEV_MEASUREMENT' Missing macro 'VIR_NODE_SEV_CBITPOS' Missing macro 'VIR_NODE_SEV_CERT_CHAIN' Missing macro 'VIR_NODE_SEV_PDH' Missing macro 'VIR_NODE_SEV_REDUCED_PHYS_BITS' --- FAIL: TestAPICoverage (0.85s) panic: Missing symbols found [recovered] panic: Missing symbols found goroutine 5 [running]: testing.tRunner.func1(0xc4200aa0f0) /usr/lib/golang/src/testing/testing.go:742 +0x29d panic(0x5ad840, 0x611bd0) /usr/lib/golang/src/runtime/panic.go:502 +0x229 _<https://ci.centos.org/job/libvirt-go-master-check/systems=libvirt-fedora-28/ws/.TestAPICoverage(0xc4200aa0f0)> <https://ci.centos.org/job/libvirt-go-master-check/systems=libvirt-fedora-28/ws/api_test.go>:506 +0x548 testing.tRunner(0xc4200aa0f0, 0x5fccb0) /usr/lib/golang/src/testing/testing.go:777 +0xd0 created by testing.(*T).Run /usr/lib/golang/src/testing/testing.go:824 +0x2e0 exit status 2 FAIL _<https://ci.centos.org/job/libvirt-go-master-check/systems=libvirt-fedora-28/ws/> 1.005s Build step 'Execute shell' marked build as failure

See <https://ci.centos.org/job/libvirt-go-master-check/systems=libvirt-fedora-28/1113/display/redirect> ------------------------------------------ Started by upstream project "libvirt-go-master-check" build number 1113 originally caused by: Started by upstream project "libvirt-go-master-build" build number 1124 originally caused by: Started by upstream project "libvirt-master-build" build number 1523 originally caused by: Started by an SCM change [EnvInject] - Loading node environment variables. Building remotely on libvirt-fedora-28 (libvirt) in workspace <https://ci.centos.org/job/libvirt-go-master-check/systems=libvirt-fedora-28/ws/> [libvirt-go-master] $ /bin/sh -xe /tmp/jenkins898063916839993244.sh + export 'TEST_ARGS=-tags api' + TEST_ARGS='-tags api' + go test -tags api Missing function 'virDomainGetLaunchSecurityInfo' Missing function 'virNodeGetSEVInfo' Missing macro 'VIR_DOMAIN_LAUNCH_SECURITY_SEV_MEASUREMENT' Missing macro 'VIR_NODE_SEV_CBITPOS' Missing macro 'VIR_NODE_SEV_CERT_CHAIN' Missing macro 'VIR_NODE_SEV_PDH' Missing macro 'VIR_NODE_SEV_REDUCED_PHYS_BITS' --- FAIL: TestAPICoverage (0.79s) panic: Missing symbols found [recovered] panic: Missing symbols found goroutine 5 [running]: testing.tRunner.func1(0xc4200aa0f0) /usr/lib/golang/src/testing/testing.go:742 +0x29d panic(0x5ad840, 0x611bd0) /usr/lib/golang/src/runtime/panic.go:502 +0x229 _<https://ci.centos.org/job/libvirt-go-master-check/systems=libvirt-fedora-28/ws/.TestAPICoverage(0xc4200aa0f0)> <https://ci.centos.org/job/libvirt-go-master-check/systems=libvirt-fedora-28/ws/api_test.go>:506 +0x548 testing.tRunner(0xc4200aa0f0, 0x5fccb0) /usr/lib/golang/src/testing/testing.go:777 +0xd0 created by testing.(*T).Run /usr/lib/golang/src/testing/testing.go:824 +0x2e0 exit status 2 FAIL _<https://ci.centos.org/job/libvirt-go-master-check/systems=libvirt-fedora-28/ws/> 0.996s Build step 'Execute shell' marked build as failure

See <https://ci.centos.org/job/libvirt-go-master-check/systems=libvirt-fedora-28/1114/display/redirect> ------------------------------------------ Started by upstream project "libvirt-go-master-check" build number 1114 originally caused by: Started by upstream project "libvirt-go-master-build" build number 1125 originally caused by: Started by upstream project "libvirt-master-build" build number 1524 originally caused by: Started by an SCM change Started by an SCM change Started by an SCM change [EnvInject] - Loading node environment variables. Building remotely on libvirt-fedora-28 (libvirt) in workspace <https://ci.centos.org/job/libvirt-go-master-check/systems=libvirt-fedora-28/ws/> [libvirt-go-master] $ /bin/sh -xe /tmp/jenkins5507220598053080773.sh + export 'TEST_ARGS=-tags api' + TEST_ARGS='-tags api' + go test -tags api Missing function 'virDomainGetLaunchSecurityInfo' Missing function 'virNodeGetSEVInfo' Missing macro 'VIR_DOMAIN_LAUNCH_SECURITY_SEV_MEASUREMENT' Missing macro 'VIR_NODE_SEV_CBITPOS' Missing macro 'VIR_NODE_SEV_CERT_CHAIN' Missing macro 'VIR_NODE_SEV_PDH' Missing macro 'VIR_NODE_SEV_REDUCED_PHYS_BITS' --- FAIL: TestAPICoverage (0.57s) panic: Missing symbols found [recovered] panic: Missing symbols found goroutine 5 [running]: testing.tRunner.func1(0xc4200aa0f0) /usr/lib/golang/src/testing/testing.go:742 +0x29d panic(0x5ad840, 0x611bd0) /usr/lib/golang/src/runtime/panic.go:502 +0x229 _<https://ci.centos.org/job/libvirt-go-master-check/systems=libvirt-fedora-28/ws/.TestAPICoverage(0xc4200aa0f0)> <https://ci.centos.org/job/libvirt-go-master-check/systems=libvirt-fedora-28/ws/api_test.go>:506 +0x548 testing.tRunner(0xc4200aa0f0, 0x5fccb0) /usr/lib/golang/src/testing/testing.go:777 +0xd0 created by testing.(*T).Run /usr/lib/golang/src/testing/testing.go:824 +0x2e0 exit status 2 FAIL _<https://ci.centos.org/job/libvirt-go-master-check/systems=libvirt-fedora-28/ws/> 0.645s Build step 'Execute shell' marked build as failure

See <https://ci.centos.org/job/libvirt-go-master-check/systems=libvirt-fedora-28/1115/display/redirect> ------------------------------------------ Started by upstream project "libvirt-go-master-check" build number 1115 originally caused by: Started by upstream project "libvirt-go-master-build" build number 1126 originally caused by: Started by upstream project "libvirt-master-build" build number 1525 originally caused by: Started by an SCM change [EnvInject] - Loading node environment variables. Building remotely on libvirt-fedora-28 (libvirt) in workspace <https://ci.centos.org/job/libvirt-go-master-check/systems=libvirt-fedora-28/ws/> [libvirt-go-master] $ /bin/sh -xe /tmp/jenkins4124620420965541011.sh + export 'TEST_ARGS=-tags api' + TEST_ARGS='-tags api' + go test -tags api Missing function 'virDomainGetLaunchSecurityInfo' Missing function 'virNodeGetSEVInfo' Missing macro 'VIR_DOMAIN_LAUNCH_SECURITY_SEV_MEASUREMENT' Missing macro 'VIR_NODE_SEV_CBITPOS' Missing macro 'VIR_NODE_SEV_CERT_CHAIN' Missing macro 'VIR_NODE_SEV_PDH' Missing macro 'VIR_NODE_SEV_REDUCED_PHYS_BITS' --- FAIL: TestAPICoverage (0.49s) panic: Missing symbols found [recovered] panic: Missing symbols found goroutine 19 [running]: testing.tRunner.func1(0xc4200c80f0) /usr/lib/golang/src/testing/testing.go:742 +0x29d panic(0x5ad840, 0x611bd0) /usr/lib/golang/src/runtime/panic.go:502 +0x229 _<https://ci.centos.org/job/libvirt-go-master-check/systems=libvirt-fedora-28/ws/.TestAPICoverage(0xc4200c80f0)> <https://ci.centos.org/job/libvirt-go-master-check/systems=libvirt-fedora-28/ws/api_test.go>:506 +0x548 testing.tRunner(0xc4200c80f0, 0x5fccb0) /usr/lib/golang/src/testing/testing.go:777 +0xd0 created by testing.(*T).Run /usr/lib/golang/src/testing/testing.go:824 +0x2e0 exit status 2 FAIL _<https://ci.centos.org/job/libvirt-go-master-check/systems=libvirt-fedora-28/ws/> 0.643s Build step 'Execute shell' marked build as failure

See <https://ci.centos.org/job/libvirt-go-master-check/systems=libvirt-fedora-28/1116/display/redirect> ------------------------------------------ Started by upstream project "libvirt-go-master-check" build number 1116 originally caused by: Started by upstream project "libvirt-go-master-build" build number 1127 originally caused by: Started by upstream project "libvirt-master-build" build number 1526 originally caused by: Started by an SCM change [EnvInject] - Loading node environment variables. Building remotely on libvirt-fedora-28 (libvirt) in workspace <https://ci.centos.org/job/libvirt-go-master-check/systems=libvirt-fedora-28/ws/> [libvirt-go-master] $ /bin/sh -xe /tmp/jenkins2604660364654326601.sh + export 'TEST_ARGS=-tags api' + TEST_ARGS='-tags api' + go test -tags api Missing function 'virDomainGetLaunchSecurityInfo' Missing function 'virNodeGetSEVInfo' Missing macro 'VIR_DOMAIN_LAUNCH_SECURITY_SEV_MEASUREMENT' Missing macro 'VIR_NODE_SEV_CBITPOS' Missing macro 'VIR_NODE_SEV_CERT_CHAIN' Missing macro 'VIR_NODE_SEV_PDH' Missing macro 'VIR_NODE_SEV_REDUCED_PHYS_BITS' --- FAIL: TestAPICoverage (1.02s) panic: Missing symbols found [recovered] panic: Missing symbols found goroutine 19 [running]: testing.tRunner.func1(0xc4200c80f0) /usr/lib/golang/src/testing/testing.go:742 +0x29d panic(0x5ad840, 0x611bd0) /usr/lib/golang/src/runtime/panic.go:502 +0x229 _<https://ci.centos.org/job/libvirt-go-master-check/systems=libvirt-fedora-28/ws/.TestAPICoverage(0xc4200c80f0)> <https://ci.centos.org/job/libvirt-go-master-check/systems=libvirt-fedora-28/ws/api_test.go>:506 +0x548 testing.tRunner(0xc4200c80f0, 0x5fccb0) /usr/lib/golang/src/testing/testing.go:777 +0xd0 created by testing.(*T).Run /usr/lib/golang/src/testing/testing.go:824 +0x2e0 exit status 2 FAIL _<https://ci.centos.org/job/libvirt-go-master-check/systems=libvirt-fedora-28/ws/> 1.367s Build step 'Execute shell' marked build as failure

See <https://ci.centos.org/job/libvirt-go-master-check/systems=libvirt-fedora-28/1117/display/redirect> ------------------------------------------ Started by upstream project "libvirt-go-master-check" build number 1117 originally caused by: Started by upstream project "libvirt-go-master-build" build number 1128 originally caused by: Started by upstream project "libvirt-master-build" build number 1527 originally caused by: Started by an SCM change [EnvInject] - Loading node environment variables. Building remotely on libvirt-fedora-28 (libvirt) in workspace <https://ci.centos.org/job/libvirt-go-master-check/systems=libvirt-fedora-28/ws/> [libvirt-go-master] $ /bin/sh -xe /tmp/jenkins8295632998850136877.sh + export 'TEST_ARGS=-tags api' + TEST_ARGS='-tags api' + go test -tags api Missing function 'virDomainGetLaunchSecurityInfo' Missing function 'virNodeGetSEVInfo' Missing macro 'VIR_DOMAIN_LAUNCH_SECURITY_SEV_MEASUREMENT' Missing macro 'VIR_NODE_SEV_CBITPOS' Missing macro 'VIR_NODE_SEV_CERT_CHAIN' Missing macro 'VIR_NODE_SEV_PDH' Missing macro 'VIR_NODE_SEV_REDUCED_PHYS_BITS' --- FAIL: TestAPICoverage (0.50s) panic: Missing symbols found [recovered] panic: Missing symbols found goroutine 5 [running]: testing.tRunner.func1(0xc4200aa0f0) /usr/lib/golang/src/testing/testing.go:742 +0x29d panic(0x5ad840, 0x611bd0) /usr/lib/golang/src/runtime/panic.go:502 +0x229 _<https://ci.centos.org/job/libvirt-go-master-check/systems=libvirt-fedora-28/ws/.TestAPICoverage(0xc4200aa0f0)> <https://ci.centos.org/job/libvirt-go-master-check/systems=libvirt-fedora-28/ws/api_test.go>:506 +0x548 testing.tRunner(0xc4200aa0f0, 0x5fccb0) /usr/lib/golang/src/testing/testing.go:777 +0xd0 created by testing.(*T).Run /usr/lib/golang/src/testing/testing.go:824 +0x2e0 exit status 2 FAIL _<https://ci.centos.org/job/libvirt-go-master-check/systems=libvirt-fedora-28/ws/> 0.621s Build step 'Execute shell' marked build as failure

See <https://ci.centos.org/job/libvirt-go-master-check/systems=libvirt-fedora-28/1118/display/redirect> ------------------------------------------ Started by upstream project "libvirt-go-master-check" build number 1118 originally caused by: Started by upstream project "libvirt-go-master-build" build number 1129 originally caused by: Started by upstream project "libvirt-master-build" build number 1528 originally caused by: Started by an SCM change [EnvInject] - Loading node environment variables. Building remotely on libvirt-fedora-28 (libvirt) in workspace <https://ci.centos.org/job/libvirt-go-master-check/systems=libvirt-fedora-28/ws/> [libvirt-go-master] $ /bin/sh -xe /tmp/jenkins8880895176446787412.sh + export 'TEST_ARGS=-tags api' + TEST_ARGS='-tags api' + go test -tags api Missing function 'virDomainGetLaunchSecurityInfo' Missing function 'virNodeGetSEVInfo' Missing macro 'VIR_DOMAIN_LAUNCH_SECURITY_SEV_MEASUREMENT' Missing macro 'VIR_NODE_SEV_CBITPOS' Missing macro 'VIR_NODE_SEV_CERT_CHAIN' Missing macro 'VIR_NODE_SEV_PDH' Missing macro 'VIR_NODE_SEV_REDUCED_PHYS_BITS' --- FAIL: TestAPICoverage (0.29s) panic: Missing symbols found [recovered] panic: Missing symbols found goroutine 4 [running]: testing.tRunner.func1(0xc4200ca0f0) /usr/lib/golang/src/testing/testing.go:742 +0x29d panic(0x5ad840, 0x611bd0) /usr/lib/golang/src/runtime/panic.go:502 +0x229 _<https://ci.centos.org/job/libvirt-go-master-check/systems=libvirt-fedora-28/ws/.TestAPICoverage(0xc4200ca0f0)> <https://ci.centos.org/job/libvirt-go-master-check/systems=libvirt-fedora-28/ws/api_test.go>:506 +0x548 testing.tRunner(0xc4200ca0f0, 0x5fccb0) /usr/lib/golang/src/testing/testing.go:777 +0xd0 created by testing.(*T).Run /usr/lib/golang/src/testing/testing.go:824 +0x2e0 exit status 2 FAIL _<https://ci.centos.org/job/libvirt-go-master-check/systems=libvirt-fedora-28/ws/> 0.351s Build step 'Execute shell' marked build as failure

See <https://ci.centos.org/job/libvirt-go-master-check/systems=libvirt-fedora-28/1119/display/redirect> ------------------------------------------ Started by upstream project "libvirt-go-master-check" build number 1119 originally caused by: Started by upstream project "libvirt-go-master-build" build number 1130 originally caused by: Started by upstream project "libvirt-master-build" build number 1529 originally caused by: Started by an SCM change Started by an SCM change Started by an SCM change [EnvInject] - Loading node environment variables. Building remotely on libvirt-fedora-28 (libvirt) in workspace <https://ci.centos.org/job/libvirt-go-master-check/systems=libvirt-fedora-28/ws/> [libvirt-go-master] $ /bin/sh -xe /tmp/jenkins6854762399312448082.sh + export 'TEST_ARGS=-tags api' + TEST_ARGS='-tags api' + go test -tags api Missing function 'virDomainGetLaunchSecurityInfo' Missing function 'virNodeGetSEVInfo' Missing macro 'VIR_DOMAIN_LAUNCH_SECURITY_SEV_MEASUREMENT' Missing macro 'VIR_NODE_SEV_CBITPOS' Missing macro 'VIR_NODE_SEV_CERT_CHAIN' Missing macro 'VIR_NODE_SEV_PDH' Missing macro 'VIR_NODE_SEV_REDUCED_PHYS_BITS' --- FAIL: TestAPICoverage (0.45s) panic: Missing symbols found [recovered] panic: Missing symbols found goroutine 4 [running]: testing.tRunner.func1(0xc4200ca0f0) /usr/lib/golang/src/testing/testing.go:742 +0x29d panic(0x5ad840, 0x611bd0) /usr/lib/golang/src/runtime/panic.go:502 +0x229 _<https://ci.centos.org/job/libvirt-go-master-check/systems=libvirt-fedora-28/ws/.TestAPICoverage(0xc4200ca0f0)> <https://ci.centos.org/job/libvirt-go-master-check/systems=libvirt-fedora-28/ws/api_test.go>:506 +0x548 testing.tRunner(0xc4200ca0f0, 0x5fccb0) /usr/lib/golang/src/testing/testing.go:777 +0xd0 created by testing.(*T).Run /usr/lib/golang/src/testing/testing.go:824 +0x2e0 exit status 2 FAIL _<https://ci.centos.org/job/libvirt-go-master-check/systems=libvirt-fedora-28/ws/> 0.600s Build step 'Execute shell' marked build as failure

See <https://ci.centos.org/job/libvirt-go-master-check/systems=libvirt-fedora-28/1120/display/redirect> ------------------------------------------ Started by upstream project "libvirt-go-master-check" build number 1120 originally caused by: Started by upstream project "libvirt-go-master-build" build number 1131 originally caused by: Started by upstream project "libvirt-master-build" build number 1530 originally caused by: Started by an SCM change [EnvInject] - Loading node environment variables. Building remotely on libvirt-fedora-28 (libvirt) in workspace <https://ci.centos.org/job/libvirt-go-master-check/systems=libvirt-fedora-28/ws/> [libvirt-go-master] $ /bin/sh -xe /tmp/jenkins2895555762909378404.sh + export 'TEST_ARGS=-tags api' + TEST_ARGS='-tags api' + go test -tags api Missing function 'virDomainGetLaunchSecurityInfo' Missing function 'virNodeGetSEVInfo' Missing macro 'VIR_DOMAIN_LAUNCH_SECURITY_SEV_MEASUREMENT' Missing macro 'VIR_NODE_SEV_CBITPOS' Missing macro 'VIR_NODE_SEV_CERT_CHAIN' Missing macro 'VIR_NODE_SEV_PDH' Missing macro 'VIR_NODE_SEV_REDUCED_PHYS_BITS' --- FAIL: TestAPICoverage (0.45s) panic: Missing symbols found [recovered] panic: Missing symbols found goroutine 5 [running]: testing.tRunner.func1(0xc4200aa0f0) /usr/lib/golang/src/testing/testing.go:742 +0x29d panic(0x5ad840, 0x611bd0) /usr/lib/golang/src/runtime/panic.go:502 +0x229 _<https://ci.centos.org/job/libvirt-go-master-check/systems=libvirt-fedora-28/ws/.TestAPICoverage(0xc4200aa0f0)> <https://ci.centos.org/job/libvirt-go-master-check/systems=libvirt-fedora-28/ws/api_test.go>:506 +0x548 testing.tRunner(0xc4200aa0f0, 0x5fccb0) /usr/lib/golang/src/testing/testing.go:777 +0xd0 created by testing.(*T).Run /usr/lib/golang/src/testing/testing.go:824 +0x2e0 exit status 2 FAIL _<https://ci.centos.org/job/libvirt-go-master-check/systems=libvirt-fedora-28/ws/> 0.632s Build step 'Execute shell' marked build as failure

See <https://ci.centos.org/job/libvirt-go-master-check/systems=libvirt-fedora-28/1121/display/redirect> ------------------------------------------ Started by upstream project "libvirt-go-master-check" build number 1121 originally caused by: Started by upstream project "libvirt-go-master-build" build number 1132 originally caused by: Started by upstream project "libvirt-master-build" build number 1531 originally caused by: Started by an SCM change [EnvInject] - Loading node environment variables. Building remotely on libvirt-fedora-28 (libvirt) in workspace <https://ci.centos.org/job/libvirt-go-master-check/systems=libvirt-fedora-28/ws/> [libvirt-go-master] $ /bin/sh -xe /tmp/jenkins7388025404573195178.sh + export 'TEST_ARGS=-tags api' + TEST_ARGS='-tags api' + go test -tags api Missing function 'virDomainGetLaunchSecurityInfo' Missing function 'virNodeGetSEVInfo' Missing macro 'VIR_DOMAIN_LAUNCH_SECURITY_SEV_MEASUREMENT' Missing macro 'VIR_NODE_SEV_CBITPOS' Missing macro 'VIR_NODE_SEV_CERT_CHAIN' Missing macro 'VIR_NODE_SEV_PDH' Missing macro 'VIR_NODE_SEV_REDUCED_PHYS_BITS' --- FAIL: TestAPICoverage (0.96s) panic: Missing symbols found [recovered] panic: Missing symbols found goroutine 19 [running]: testing.tRunner.func1(0xc4200c80f0) /usr/lib/golang/src/testing/testing.go:742 +0x29d panic(0x5ad840, 0x611bd0) /usr/lib/golang/src/runtime/panic.go:502 +0x229 _<https://ci.centos.org/job/libvirt-go-master-check/systems=libvirt-fedora-28/ws/.TestAPICoverage(0xc4200c80f0)> <https://ci.centos.org/job/libvirt-go-master-check/systems=libvirt-fedora-28/ws/api_test.go>:506 +0x548 testing.tRunner(0xc4200c80f0, 0x5fccb0) /usr/lib/golang/src/testing/testing.go:777 +0xd0 created by testing.(*T).Run /usr/lib/golang/src/testing/testing.go:824 +0x2e0 exit status 2 FAIL _<https://ci.centos.org/job/libvirt-go-master-check/systems=libvirt-fedora-28/ws/> 1.097s Build step 'Execute shell' marked build as failure

See <https://ci.centos.org/job/libvirt-go-master-check/systems=libvirt-fedora-28/1122/display/redirect> ------------------------------------------ Started by upstream project "libvirt-go-master-check" build number 1122 originally caused by: Started by upstream project "libvirt-go-master-build" build number 1133 originally caused by: Started by upstream project "libvirt-master-build" build number 1532 originally caused by: Started by an SCM change [EnvInject] - Loading node environment variables. Building remotely on libvirt-fedora-28 (libvirt) in workspace <https://ci.centos.org/job/libvirt-go-master-check/systems=libvirt-fedora-28/ws/> [libvirt-go-master] $ /bin/sh -xe /tmp/jenkins7196940351344253699.sh + export 'TEST_ARGS=-tags api' + TEST_ARGS='-tags api' + go test -tags api Missing function 'virDomainGetLaunchSecurityInfo' Missing function 'virNodeGetSEVInfo' Missing macro 'VIR_DOMAIN_LAUNCH_SECURITY_SEV_MEASUREMENT' Missing macro 'VIR_NODE_SEV_CBITPOS' Missing macro 'VIR_NODE_SEV_CERT_CHAIN' Missing macro 'VIR_NODE_SEV_PDH' Missing macro 'VIR_NODE_SEV_REDUCED_PHYS_BITS' --- FAIL: TestAPICoverage (0.26s) panic: Missing symbols found [recovered] panic: Missing symbols found goroutine 19 [running]: testing.tRunner.func1(0xc4200c80f0) /usr/lib/golang/src/testing/testing.go:742 +0x29d panic(0x5ad840, 0x611bd0) /usr/lib/golang/src/runtime/panic.go:502 +0x229 _<https://ci.centos.org/job/libvirt-go-master-check/systems=libvirt-fedora-28/ws/.TestAPICoverage(0xc4200c80f0)> <https://ci.centos.org/job/libvirt-go-master-check/systems=libvirt-fedora-28/ws/api_test.go>:506 +0x548 testing.tRunner(0xc4200c80f0, 0x5fccb0) /usr/lib/golang/src/testing/testing.go:777 +0xd0 created by testing.(*T).Run /usr/lib/golang/src/testing/testing.go:824 +0x2e0 exit status 2 FAIL _<https://ci.centos.org/job/libvirt-go-master-check/systems=libvirt-fedora-28/ws/> 0.336s Build step 'Execute shell' marked build as failure

See <https://ci.centos.org/job/libvirt-go-master-check/systems=libvirt-fedora-28/1123/display/redirect> ------------------------------------------ Started by upstream project "libvirt-go-master-check" build number 1123 originally caused by: Started by upstream project "libvirt-go-master-build" build number 1134 originally caused by: Started by upstream project "libvirt-master-build" build number 1533 originally caused by: Started by an SCM change [EnvInject] - Loading node environment variables. Building remotely on libvirt-fedora-28 (libvirt) in workspace <https://ci.centos.org/job/libvirt-go-master-check/systems=libvirt-fedora-28/ws/> [libvirt-go-master] $ /bin/sh -xe /tmp/jenkins2621735491806459208.sh + export 'TEST_ARGS=-tags api' + TEST_ARGS='-tags api' + go test -tags api Missing function 'virDomainGetLaunchSecurityInfo' Missing function 'virNodeGetSEVInfo' Missing macro 'VIR_DOMAIN_LAUNCH_SECURITY_SEV_MEASUREMENT' Missing macro 'VIR_NODE_SEV_CBITPOS' Missing macro 'VIR_NODE_SEV_CERT_CHAIN' Missing macro 'VIR_NODE_SEV_PDH' Missing macro 'VIR_NODE_SEV_REDUCED_PHYS_BITS' --- FAIL: TestAPICoverage (0.25s) panic: Missing symbols found [recovered] panic: Missing symbols found goroutine 5 [running]: testing.tRunner.func1(0xc4200aa0f0) /usr/lib/golang/src/testing/testing.go:742 +0x29d panic(0x5ad840, 0x611bd0) /usr/lib/golang/src/runtime/panic.go:502 +0x229 _<https://ci.centos.org/job/libvirt-go-master-check/systems=libvirt-fedora-28/ws/.TestAPICoverage(0xc4200aa0f0)> <https://ci.centos.org/job/libvirt-go-master-check/systems=libvirt-fedora-28/ws/api_test.go>:506 +0x548 testing.tRunner(0xc4200aa0f0, 0x5fccb0) /usr/lib/golang/src/testing/testing.go:777 +0xd0 created by testing.(*T).Run /usr/lib/golang/src/testing/testing.go:824 +0x2e0 exit status 2 FAIL _<https://ci.centos.org/job/libvirt-go-master-check/systems=libvirt-fedora-28/ws/> 0.340s Build step 'Execute shell' marked build as failure

See <https://ci.centos.org/job/libvirt-go-master-check/systems=libvirt-fedora-28/1124/display/redirect> ------------------------------------------ Started by upstream project "libvirt-go-master-check" build number 1124 originally caused by: Started by upstream project "libvirt-go-master-build" build number 1135 originally caused by: Started by upstream project "libvirt-master-build" build number 1534 originally caused by: Started by an SCM change [EnvInject] - Loading node environment variables. Building remotely on libvirt-fedora-28 (libvirt) in workspace <https://ci.centos.org/job/libvirt-go-master-check/systems=libvirt-fedora-28/ws/> [libvirt-go-master] $ /bin/sh -xe /tmp/jenkins5124895919431970200.sh + export 'TEST_ARGS=-tags api' + TEST_ARGS='-tags api' + go test -tags api Missing function 'virDomainGetLaunchSecurityInfo' Missing function 'virNodeGetSEVInfo' Missing macro 'VIR_DOMAIN_LAUNCH_SECURITY_SEV_MEASUREMENT' Missing macro 'VIR_NODE_SEV_CBITPOS' Missing macro 'VIR_NODE_SEV_CERT_CHAIN' Missing macro 'VIR_NODE_SEV_PDH' Missing macro 'VIR_NODE_SEV_REDUCED_PHYS_BITS' --- FAIL: TestAPICoverage (0.45s) panic: Missing symbols found [recovered] panic: Missing symbols found goroutine 5 [running]: testing.tRunner.func1(0xc4200aa0f0) /usr/lib/golang/src/testing/testing.go:742 +0x29d panic(0x5ad840, 0x611bd0) /usr/lib/golang/src/runtime/panic.go:502 +0x229 _<https://ci.centos.org/job/libvirt-go-master-check/systems=libvirt-fedora-28/ws/.TestAPICoverage(0xc4200aa0f0)> <https://ci.centos.org/job/libvirt-go-master-check/systems=libvirt-fedora-28/ws/api_test.go>:506 +0x548 testing.tRunner(0xc4200aa0f0, 0x5fccb0) /usr/lib/golang/src/testing/testing.go:777 +0xd0 created by testing.(*T).Run /usr/lib/golang/src/testing/testing.go:824 +0x2e0 exit status 2 FAIL _<https://ci.centos.org/job/libvirt-go-master-check/systems=libvirt-fedora-28/ws/> 0.675s Build step 'Execute shell' marked build as failure

See <https://ci.centos.org/job/libvirt-go-master-check/systems=libvirt-fedora-28/1125/display/redirect> ------------------------------------------ Started by upstream project "libvirt-go-master-check" build number 1125 originally caused by: Started by upstream project "libvirt-go-master-build" build number 1136 originally caused by: Started by upstream project "libvirt-master-build" build number 1535 originally caused by: Started by an SCM change [EnvInject] - Loading node environment variables. Building remotely on libvirt-fedora-28 (libvirt) in workspace <https://ci.centos.org/job/libvirt-go-master-check/systems=libvirt-fedora-28/ws/> [libvirt-go-master] $ /bin/sh -xe /tmp/jenkins8504214178552279872.sh + export 'TEST_ARGS=-tags api' + TEST_ARGS='-tags api' + go test -tags api Missing function 'virDomainGetLaunchSecurityInfo' Missing function 'virNodeGetSEVInfo' Missing macro 'VIR_DOMAIN_LAUNCH_SECURITY_SEV_MEASUREMENT' Missing macro 'VIR_NODE_SEV_CBITPOS' Missing macro 'VIR_NODE_SEV_CERT_CHAIN' Missing macro 'VIR_NODE_SEV_PDH' Missing macro 'VIR_NODE_SEV_REDUCED_PHYS_BITS' --- FAIL: TestAPICoverage (0.64s) panic: Missing symbols found [recovered] panic: Missing symbols found goroutine 19 [running]: testing.tRunner.func1(0xc4200c80f0) /usr/lib/golang/src/testing/testing.go:742 +0x29d panic(0x5ad840, 0x611bd0) /usr/lib/golang/src/runtime/panic.go:502 +0x229 _<https://ci.centos.org/job/libvirt-go-master-check/systems=libvirt-fedora-28/ws/.TestAPICoverage(0xc4200c80f0)> <https://ci.centos.org/job/libvirt-go-master-check/systems=libvirt-fedora-28/ws/api_test.go>:506 +0x548 testing.tRunner(0xc4200c80f0, 0x5fccb0) /usr/lib/golang/src/testing/testing.go:777 +0xd0 created by testing.(*T).Run /usr/lib/golang/src/testing/testing.go:824 +0x2e0 exit status 2 FAIL _<https://ci.centos.org/job/libvirt-go-master-check/systems=libvirt-fedora-28/ws/> 0.748s Build step 'Execute shell' marked build as failure

See <https://ci.centos.org/job/libvirt-go-master-check/systems=libvirt-fedora-28/1126/display/redirect> ------------------------------------------ Started by upstream project "libvirt-go-master-check" build number 1126 originally caused by: Started by upstream project "libvirt-go-master-build" build number 1138 originally caused by: Started by upstream project "libvirt-master-build" build number 1537 originally caused by: Started by user Libvirt [EnvInject] - Loading node environment variables. Building remotely on libvirt-fedora-28 (libvirt) in workspace <https://ci.centos.org/job/libvirt-go-master-check/systems=libvirt-fedora-28/ws/> [libvirt-go-master] $ /bin/sh -xe /tmp/jenkins9172649010333093302.sh + export 'TEST_ARGS=-tags api' + TEST_ARGS='-tags api' + go test -tags api Missing function 'virConnectListAllNWFilterBindings' Missing function 'virNWFilterBindingCreateXML' Missing function 'virNWFilterBindingDelete' Missing function 'virNWFilterBindingFree' Missing function 'virNWFilterBindingGetFilterName' Missing function 'virNWFilterBindingGetPortDev' Missing function 'virNWFilterBindingGetXMLDesc' Missing function 'virNWFilterBindingLookupByPortDev' Missing function 'virNWFilterBindingRef' Missing enum 'VIR_CONNECT_GET_ALL_DOMAINS_STATS_NOWAIT' Missing enum 'VIR_ERR_INVALID_NWFILTER_BINDING' Missing enum 'VIR_ERR_NO_NWFILTER_BINDING' --- FAIL: TestAPICoverage (1.90s) panic: Missing symbols found [recovered] panic: Missing symbols found goroutine 19 [running]: testing.tRunner.func1(0xc4200c80f0) /usr/lib/golang/src/testing/testing.go:742 +0x29d panic(0x5adac0, 0x611e70) /usr/lib/golang/src/runtime/panic.go:502 +0x229 _<https://ci.centos.org/job/libvirt-go-master-check/systems=libvirt-fedora-28/ws/.TestAPICoverage(0xc4200c80f0)> <https://ci.centos.org/job/libvirt-go-master-check/systems=libvirt-fedora-28/ws/api_test.go>:506 +0x548 testing.tRunner(0xc4200c80f0, 0x5fcf40) /usr/lib/golang/src/testing/testing.go:777 +0xd0 created by testing.(*T).Run /usr/lib/golang/src/testing/testing.go:824 +0x2e0 exit status 2 FAIL _<https://ci.centos.org/job/libvirt-go-master-check/systems=libvirt-fedora-28/ws/> 2.223s Build step 'Execute shell' marked build as failure

See <https://ci.centos.org/job/libvirt-go-master-check/systems=libvirt-fedora-28/1127/display/redirect> ------------------------------------------ Started by upstream project "libvirt-go-master-check" build number 1127 originally caused by: Started by upstream project "libvirt-go-master-build" build number 1139 originally caused by: Started by upstream project "libvirt-master-build" build number 1538 originally caused by: Started by an SCM change Started by an SCM change [EnvInject] - Loading node environment variables. Building remotely on libvirt-fedora-28 (libvirt) in workspace <https://ci.centos.org/job/libvirt-go-master-check/systems=libvirt-fedora-28/ws/> [libvirt-go-master] $ /bin/sh -xe /tmp/jenkins5582493931311930814.sh + export 'TEST_ARGS=-tags api' + TEST_ARGS='-tags api' + go test -tags api Missing function 'virConnectListAllNWFilterBindings' Missing function 'virNWFilterBindingCreateXML' Missing function 'virNWFilterBindingDelete' Missing function 'virNWFilterBindingFree' Missing function 'virNWFilterBindingGetFilterName' Missing function 'virNWFilterBindingGetPortDev' Missing function 'virNWFilterBindingGetXMLDesc' Missing function 'virNWFilterBindingLookupByPortDev' Missing function 'virNWFilterBindingRef' Missing enum 'VIR_CONNECT_GET_ALL_DOMAINS_STATS_NOWAIT' Missing enum 'VIR_ERR_INVALID_NWFILTER_BINDING' Missing enum 'VIR_ERR_NO_NWFILTER_BINDING' --- FAIL: TestAPICoverage (0.56s) panic: Missing symbols found [recovered] panic: Missing symbols found goroutine 5 [running]: testing.tRunner.func1(0xc4200aa0f0) /usr/lib/golang/src/testing/testing.go:742 +0x29d panic(0x5adac0, 0x611e70) /usr/lib/golang/src/runtime/panic.go:502 +0x229 _<https://ci.centos.org/job/libvirt-go-master-check/systems=libvirt-fedora-28/ws/.TestAPICoverage(0xc4200aa0f0)> <https://ci.centos.org/job/libvirt-go-master-check/systems=libvirt-fedora-28/ws/api_test.go>:506 +0x548 testing.tRunner(0xc4200aa0f0, 0x5fcf40) /usr/lib/golang/src/testing/testing.go:777 +0xd0 created by testing.(*T).Run /usr/lib/golang/src/testing/testing.go:824 +0x2e0 exit status 2 FAIL _<https://ci.centos.org/job/libvirt-go-master-check/systems=libvirt-fedora-28/ws/> 0.659s Build step 'Execute shell' marked build as failure

See <https://ci.centos.org/job/libvirt-go-master-check/systems=libvirt-fedora-28/1128/display/redirect> ------------------------------------------ Started by upstream project "libvirt-go-master-check" build number 1128 originally caused by: Started by upstream project "libvirt-go-master-build" build number 1140 originally caused by: Started by upstream project "libvirt-master-build" build number 1539 originally caused by: Started by an SCM change Started by an SCM change Started by an SCM change [EnvInject] - Loading node environment variables. Building remotely on libvirt-fedora-28 (libvirt) in workspace <https://ci.centos.org/job/libvirt-go-master-check/systems=libvirt-fedora-28/ws/> [libvirt-go-master] $ /bin/sh -xe /tmp/jenkins7738895400318941563.sh + export 'TEST_ARGS=-tags api' + TEST_ARGS='-tags api' + go test -tags api Missing function 'virConnectListAllNWFilterBindings' Missing function 'virNWFilterBindingCreateXML' Missing function 'virNWFilterBindingDelete' Missing function 'virNWFilterBindingFree' Missing function 'virNWFilterBindingGetFilterName' Missing function 'virNWFilterBindingGetPortDev' Missing function 'virNWFilterBindingGetXMLDesc' Missing function 'virNWFilterBindingLookupByPortDev' Missing function 'virNWFilterBindingRef' Missing enum 'VIR_CONNECT_GET_ALL_DOMAINS_STATS_NOWAIT' Missing enum 'VIR_ERR_INVALID_NWFILTER_BINDING' Missing enum 'VIR_ERR_NO_NWFILTER_BINDING' --- FAIL: TestAPICoverage (1.12s) panic: Missing symbols found [recovered] panic: Missing symbols found goroutine 5 [running]: testing.tRunner.func1(0xc4200aa0f0) /usr/lib/golang/src/testing/testing.go:742 +0x29d panic(0x5adac0, 0x611e70) /usr/lib/golang/src/runtime/panic.go:502 +0x229 _<https://ci.centos.org/job/libvirt-go-master-check/systems=libvirt-fedora-28/ws/.TestAPICoverage(0xc4200aa0f0)> <https://ci.centos.org/job/libvirt-go-master-check/systems=libvirt-fedora-28/ws/api_test.go>:506 +0x548 testing.tRunner(0xc4200aa0f0, 0x5fcf40) /usr/lib/golang/src/testing/testing.go:777 +0xd0 created by testing.(*T).Run /usr/lib/golang/src/testing/testing.go:824 +0x2e0 exit status 2 FAIL _<https://ci.centos.org/job/libvirt-go-master-check/systems=libvirt-fedora-28/ws/> 1.339s Build step 'Execute shell' marked build as failure

participants (1)
-
ci@centos.org