[Libvirt-ci] Build failed in Jenkins: osinfo-db-check » libvirt-centos-7 #75

See <https://ci.centos.org/job/osinfo-db-check/systems=libvirt-centos-7/75/display/redirect> ------------------------------------------ Started by upstream project "osinfo-db-check" build number 75 originally caused by: Started by upstream project "osinfo-db-build" build number 76 originally caused by: Started by an SCM change [EnvInject] - Loading node environment variables. Building remotely on libvirt-centos-7 (libvirt) in workspace <https://ci.centos.org/job/osinfo-db-check/systems=libvirt-centos-7/ws/> [osinfo-db] $ /bin/sh -xe /tmp/jenkins1387310657743551330.sh + /usr/bin/gmake check python3 -m pytest --log-level=info gmake: python3: Command not found gmake: *** [check] Error 127 Build step 'Execute shell' marked build as failure

See <https://ci.centos.org/job/osinfo-db-check/systems=libvirt-centos-7/76/display/redirect> ------------------------------------------ Started by upstream project "osinfo-db-check" build number 76 originally caused by: Started by upstream project "osinfo-db-build" build number 77 originally caused by: Started by an SCM change [EnvInject] - Loading node environment variables. Building remotely on libvirt-centos-7 (libvirt) in workspace <https://ci.centos.org/job/osinfo-db-check/systems=libvirt-centos-7/ws/> [osinfo-db] $ /bin/sh -xe /tmp/jenkins3899681770864454978.sh + /usr/bin/gmake check python3 -m pytest --log-level=info gmake: python3: Command not found gmake: *** [check] Error 127 Build step 'Execute shell' marked build as failure

See <https://ci.centos.org/job/osinfo-db-check/systems=libvirt-centos-7/77/display/redirect> ------------------------------------------ Started by upstream project "osinfo-db-check" build number 77 originally caused by: Started by upstream project "osinfo-db-build" build number 78 originally caused by: Started by an SCM change [EnvInject] - Loading node environment variables. Building remotely on libvirt-centos-7 (libvirt) in workspace <https://ci.centos.org/job/osinfo-db-check/systems=libvirt-centos-7/ws/> [osinfo-db] $ /bin/sh -xe /tmp/jenkins201350376392282921.sh + /usr/bin/gmake check /bin/sh: python3: command not found python3 -m pytest gmake: python3: Command not found gmake: *** [check] Error 127 Build step 'Execute shell' marked build as failure

See <https://ci.centos.org/job/osinfo-db-check/systems=libvirt-centos-7/78/display/redirect> ------------------------------------------ Started by upstream project "osinfo-db-check" build number 78 originally caused by: Started by upstream project "osinfo-db-build" build number 79 originally caused by: Started by an SCM change [EnvInject] - Loading node environment variables. Building remotely on libvirt-centos-7 (libvirt) in workspace <https://ci.centos.org/job/osinfo-db-check/systems=libvirt-centos-7/ws/> [osinfo-db] $ /bin/sh -xe /tmp/jenkins7224493831141846321.sh + /usr/bin/gmake check /bin/sh: python3: command not found python3 -m pytest gmake: python3: Command not found gmake: *** [check] Error 127 Build step 'Execute shell' marked build as failure

See <https://ci.centos.org/job/osinfo-db-check/systems=libvirt-centos-7/79/display/redirect> ------------------------------------------ Started by upstream project "osinfo-db-check" build number 79 originally caused by: Started by upstream project "osinfo-db-build" build number 80 originally caused by: Started by upstream project "osinfo-db-tools-build" build number 16 originally caused by: Started by an SCM change [EnvInject] - Loading node environment variables. Building remotely on libvirt-centos-7 (libvirt) in workspace <https://ci.centos.org/job/osinfo-db-check/systems=libvirt-centos-7/ws/> [osinfo-db] $ /bin/sh -xe /tmp/jenkins7617893474202412683.sh + /usr/bin/gmake check /bin/sh: python3: command not found python3 -m pytest gmake: python3: Command not found gmake: *** [check] Error 127 Build step 'Execute shell' marked build as failure

See <https://ci.centos.org/job/osinfo-db-check/systems=libvirt-centos-7/80/display/redirect> ------------------------------------------ Started by upstream project "osinfo-db-check" build number 80 originally caused by: Started by upstream project "osinfo-db-build" build number 81 originally caused by: Started by an SCM change [EnvInject] - Loading node environment variables. Building remotely on libvirt-centos-7 (libvirt) in workspace <https://ci.centos.org/job/osinfo-db-check/systems=libvirt-centos-7/ws/> [osinfo-db] $ /bin/sh -xe /tmp/jenkins702640711172173547.sh + /usr/bin/gmake check /bin/sh: python3: command not found LC_ALL= LANG=C LC_CTYPE=en_US.UTF-8 python3 -m pytest /bin/sh: python3: command not found gmake: *** [check] Error 127 Build step 'Execute shell' marked build as failure
participants (1)
-
ci@centos.org