[Libvirt-ci] Build failed in Jenkins: libvirt-go-check » libvirt-fedora-28 #329

See <https://ci.centos.org/job/libvirt-go-check/systems=libvirt-fedora-28/329/display/redirect> ------------------------------------------ Started by upstream project "libvirt-go-check" build number 329 originally caused by: Started by upstream project "libvirt-go-build" build number 335 originally caused by: Started by upstream project "libvirt-build" build number 424 originally caused by: Started by an SCM change Started by an SCM change Started by an SCM change Started by an SCM change Started by an SCM change Started by an SCM change Started by an SCM change Started by an SCM change Started by an SCM change [EnvInject] - Loading node environment variables. Building remotely on libvirt-fedora-28 (libvirt) in workspace <https://ci.centos.org/job/libvirt-go-check/systems=libvirt-fedora-28/ws/> [libvirt-go] $ /bin/sh -xe /tmp/jenkins7212606175475836382.sh + export 'TEST_ARGS=-tags api' + TEST_ARGS='-tags api' + go test -tags api Missing enum 'VIR_ERR_INVALID_DOMAIN_CHECKPOINT' Missing enum 'VIR_ERR_NO_DOMAIN_BACKUP' Missing enum 'VIR_ERR_NO_DOMAIN_CHECKPOINT' Missing enum 'VIR_FROM_DOMAIN_CHECKPOINT' --- FAIL: TestAPICoverage (0.44s) panic: Missing symbols found [recovered] panic: Missing symbols found goroutine 5 [running]: testing.tRunner.func1(0xc4200aa0f0) /usr/lib/golang/src/testing/testing.go:742 +0x29d panic(0x5c3d40, 0x627950) /usr/lib/golang/src/runtime/panic.go:502 +0x229 _<https://ci.centos.org/job/libvirt-go-check/systems=libvirt-fedora-28/ws/.TestAPICoverage(0xc4200aa0f0)> <https://ci.centos.org/job/libvirt-go-check/systems=libvirt-fedora-28/ws/api_test.go>:501 +0x548 testing.tRunner(0xc4200aa0f0, 0x612a08) /usr/lib/golang/src/testing/testing.go:777 +0xd0 created by testing.(*T).Run /usr/lib/golang/src/testing/testing.go:824 +0x2e0 exit status 2 FAIL _<https://ci.centos.org/job/libvirt-go-check/systems=libvirt-fedora-28/ws/> 0.537s Build step 'Execute shell' marked build as failure

See <https://ci.centos.org/job/libvirt-go-check/systems=libvirt-fedora-28/330/display/redirect> ------------------------------------------ Started by upstream project "libvirt-go-check" build number 330 originally caused by: Started by upstream project "libvirt-go-build" build number 336 originally caused by: Started by upstream project "libvirt-build" build number 426 originally caused by: Started by an SCM change Started by an SCM change [EnvInject] - Loading node environment variables. Building remotely on libvirt-fedora-28 (libvirt) in workspace <https://ci.centos.org/job/libvirt-go-check/systems=libvirt-fedora-28/ws/> [libvirt-go] $ /bin/sh -xe /tmp/jenkins4128286085135715442.sh + export 'TEST_ARGS=-tags api' + TEST_ARGS='-tags api' + go test -tags api Missing macro 'VIR_MIGRATE_PARAM_PARALLEL_CONNECTIONS' Missing enum 'VIR_ERR_INVALID_DOMAIN_CHECKPOINT' Missing enum 'VIR_ERR_NO_DOMAIN_BACKUP' Missing enum 'VIR_ERR_NO_DOMAIN_CHECKPOINT' Missing enum 'VIR_FROM_DOMAIN_CHECKPOINT' Missing enum 'VIR_MIGRATE_PARALLEL' --- FAIL: TestAPICoverage (1.13s) panic: Missing symbols found [recovered] panic: Missing symbols found goroutine 19 [running]: testing.tRunner.func1(0xc4200c60f0) /usr/lib/golang/src/testing/testing.go:742 +0x29d panic(0x5c3d40, 0x627950) /usr/lib/golang/src/runtime/panic.go:502 +0x229 _<https://ci.centos.org/job/libvirt-go-check/systems=libvirt-fedora-28/ws/.TestAPICoverage(0xc4200c60f0)> <https://ci.centos.org/job/libvirt-go-check/systems=libvirt-fedora-28/ws/api_test.go>:501 +0x548 testing.tRunner(0xc4200c60f0, 0x612a08) /usr/lib/golang/src/testing/testing.go:777 +0xd0 created by testing.(*T).Run /usr/lib/golang/src/testing/testing.go:824 +0x2e0 exit status 2 FAIL _<https://ci.centos.org/job/libvirt-go-check/systems=libvirt-fedora-28/ws/> 1.483s Build step 'Execute shell' marked build as failure

See <https://ci.centos.org/job/libvirt-go-check/systems=libvirt-fedora-28/331/display/redirect> ------------------------------------------ Started by upstream project "libvirt-go-check" build number 331 originally caused by: Started by upstream project "libvirt-go-build" build number 337 originally caused by: Started by upstream project "libvirt-build" build number 428 originally caused by: Started by an SCM change [EnvInject] - Loading node environment variables. Building remotely on libvirt-fedora-28 (libvirt) in workspace <https://ci.centos.org/job/libvirt-go-check/systems=libvirt-fedora-28/ws/> [libvirt-go] $ /bin/sh -xe /tmp/jenkins4054321402314106361.sh + export 'TEST_ARGS=-tags api' + TEST_ARGS='-tags api' + go test -tags api Missing macro 'VIR_MIGRATE_PARAM_PARALLEL_CONNECTIONS' Missing enum 'VIR_ERR_INVALID_DOMAIN_CHECKPOINT' Missing enum 'VIR_ERR_NO_DOMAIN_BACKUP' Missing enum 'VIR_ERR_NO_DOMAIN_CHECKPOINT' Missing enum 'VIR_FROM_DOMAIN_CHECKPOINT' Missing enum 'VIR_MIGRATE_PARALLEL' --- FAIL: TestAPICoverage (0.71s) panic: Missing symbols found [recovered] panic: Missing symbols found goroutine 19 [running]: testing.tRunner.func1(0xc4200c60f0) /usr/lib/golang/src/testing/testing.go:742 +0x29d panic(0x5c3d40, 0x627950) /usr/lib/golang/src/runtime/panic.go:502 +0x229 _<https://ci.centos.org/job/libvirt-go-check/systems=libvirt-fedora-28/ws/.TestAPICoverage(0xc4200c60f0)> <https://ci.centos.org/job/libvirt-go-check/systems=libvirt-fedora-28/ws/api_test.go>:501 +0x548 testing.tRunner(0xc4200c60f0, 0x612a08) /usr/lib/golang/src/testing/testing.go:777 +0xd0 created by testing.(*T).Run /usr/lib/golang/src/testing/testing.go:824 +0x2e0 exit status 2 FAIL _<https://ci.centos.org/job/libvirt-go-check/systems=libvirt-fedora-28/ws/> 0.889s Build step 'Execute shell' marked build as failure

See <https://ci.centos.org/job/libvirt-go-check/systems=libvirt-fedora-28/332/display/redirect> ------------------------------------------ Started by upstream project "libvirt-go-check" build number 332 originally caused by: Started by upstream project "libvirt-go-build" build number 338 originally caused by: Started by upstream project "libvirt-build" build number 429 originally caused by: Started by an SCM change [EnvInject] - Loading node environment variables. Building remotely on libvirt-fedora-28 (libvirt) in workspace <https://ci.centos.org/job/libvirt-go-check/systems=libvirt-fedora-28/ws/> [libvirt-go] $ /bin/sh -xe /tmp/jenkins2345190407943286625.sh + export 'TEST_ARGS=-tags api' + TEST_ARGS='-tags api' + go test -tags api Missing macro 'VIR_MIGRATE_PARAM_PARALLEL_CONNECTIONS' Missing enum 'VIR_ERR_INVALID_DOMAIN_CHECKPOINT' Missing enum 'VIR_ERR_NO_DOMAIN_BACKUP' Missing enum 'VIR_ERR_NO_DOMAIN_CHECKPOINT' Missing enum 'VIR_FROM_DOMAIN_CHECKPOINT' Missing enum 'VIR_MIGRATE_PARALLEL' --- FAIL: TestAPICoverage (0.69s) panic: Missing symbols found [recovered] panic: Missing symbols found goroutine 19 [running]: testing.tRunner.func1(0xc4200c60f0) /usr/lib/golang/src/testing/testing.go:742 +0x29d panic(0x5c3d40, 0x627950) /usr/lib/golang/src/runtime/panic.go:502 +0x229 _<https://ci.centos.org/job/libvirt-go-check/systems=libvirt-fedora-28/ws/.TestAPICoverage(0xc4200c60f0)> <https://ci.centos.org/job/libvirt-go-check/systems=libvirt-fedora-28/ws/api_test.go>:501 +0x548 testing.tRunner(0xc4200c60f0, 0x612a08) /usr/lib/golang/src/testing/testing.go:777 +0xd0 created by testing.(*T).Run /usr/lib/golang/src/testing/testing.go:824 +0x2e0 exit status 2 FAIL _<https://ci.centos.org/job/libvirt-go-check/systems=libvirt-fedora-28/ws/> 0.976s Build step 'Execute shell' marked build as failure

See <https://ci.centos.org/job/libvirt-go-check/systems=libvirt-fedora-28/333/display/redirect> ------------------------------------------ Started by upstream project "libvirt-go-check" build number 333 originally caused by: Started by upstream project "libvirt-go-build" build number 339 originally caused by: Started by upstream project "libvirt-build" build number 430 originally caused by: Started by an SCM change [EnvInject] - Loading node environment variables. Building remotely on libvirt-fedora-28 (libvirt) in workspace <https://ci.centos.org/job/libvirt-go-check/systems=libvirt-fedora-28/ws/> [libvirt-go] $ /bin/sh -xe /tmp/jenkins4379382545124096603.sh + export 'TEST_ARGS=-tags api' + TEST_ARGS='-tags api' + go test -tags api Missing macro 'VIR_MIGRATE_PARAM_PARALLEL_CONNECTIONS' Missing enum 'VIR_ERR_INVALID_DOMAIN_CHECKPOINT' Missing enum 'VIR_ERR_NO_DOMAIN_BACKUP' Missing enum 'VIR_ERR_NO_DOMAIN_CHECKPOINT' Missing enum 'VIR_FROM_DOMAIN_CHECKPOINT' Missing enum 'VIR_MIGRATE_PARALLEL' --- FAIL: TestAPICoverage (0.53s) panic: Missing symbols found [recovered] panic: Missing symbols found goroutine 5 [running]: testing.tRunner.func1(0xc4200aa0f0) /usr/lib/golang/src/testing/testing.go:742 +0x29d panic(0x5c3d40, 0x627950) /usr/lib/golang/src/runtime/panic.go:502 +0x229 _<https://ci.centos.org/job/libvirt-go-check/systems=libvirt-fedora-28/ws/.TestAPICoverage(0xc4200aa0f0)> <https://ci.centos.org/job/libvirt-go-check/systems=libvirt-fedora-28/ws/api_test.go>:501 +0x548 testing.tRunner(0xc4200aa0f0, 0x612a08) /usr/lib/golang/src/testing/testing.go:777 +0xd0 created by testing.(*T).Run /usr/lib/golang/src/testing/testing.go:824 +0x2e0 exit status 2 FAIL _<https://ci.centos.org/job/libvirt-go-check/systems=libvirt-fedora-28/ws/> 0.614s Build step 'Execute shell' marked build as failure

participants (1)
-
ci@centos.org