[Libvirt-ci] Build failed in Jenkins: libvirt-build » libvirt-debian-9 #208

See <https://ci.centos.org/job/libvirt-build/systems=libvirt-debian-9/208/display/redirect?page=changes> Changes: [eblake] maint: Drop unused GETTEXT_CPPFLAGS variable [eblake] maint: Prefer AM_CPPFLAGS over INCLUDES ------------------------------------------ [...truncated 118.88 KB...] checking whether BRDGSFD is declared... no checking whether BRDGADD is declared... no checking whether BRDGDEL is declared... no checking whether cpuset_getaffinity is declared... no checking for struct if_data.ifi_oqdrops... no checking whether clock_serv_t is declared... no checking whether host_get_clock_service is declared... no checking whether clock_get_time is declared... no checking whether this build is done by a static analysis tool... no checking that generated files are newer than configure... done configure: creating ./config.status config.status: creating run config.status: creating Makefile config.status: creating src/Makefile config.status: creating include/libvirt/Makefile config.status: creating docs/Makefile config.status: creating gnulib/lib/Makefile config.status: creating gnulib/tests/Makefile config.status: creating .color_coded config.status: creating .ycm_extra_conf.py config.status: creating libvirt.pc config.status: creating libvirt-qemu.pc config.status: creating libvirt-lxc.pc config.status: creating libvirt-admin.pc config.status: creating src/libvirt.pc config.status: creating src/libvirt-qemu.pc config.status: creating src/libvirt-lxc.pc config.status: creating libvirt.spec config.status: creating mingw-libvirt.spec config.status: creating po/Makefile config.status: creating include/libvirt/libvirt-common.h config.status: creating examples/Makefile config.status: creating tests/Makefile config.status: creating tools/Makefile config.status: creating config.h config.status: linking ../GNUmakefile to GNUmakefile config.status: executing depfiles commands config.status: executing libtool commands configure: configure: Configuration summary configure: ===================== configure: configure: Drivers configure: configure: QEMU: yes configure: OpenVZ: yes configure: VMware: yes configure: VBox: yes configure: XenAPI: no configure: libxl: yes configure: LXC: yes configure: PHYP: yes configure: ESX: yes configure: Hyper-V: no configure: vz: no configure: Bhyve: no configure: Test: yes configure: Remote: yes configure: Network: yes configure: Libvirtd: yes configure: Interface: yes configure: configure: Storage Drivers configure: configure: Dir: yes configure: FS: yes configure: NetFS: yes configure: LVM: yes configure: iSCSI: yes configure: iscsi-direct: no configure: SCSI: yes configure: mpath: yes configure: Disk: yes configure: RBD: yes configure: Sheepdog: yes configure: Gluster: yes configure: ZFS: yes configure: Virtuozzo storage: no configure: configure: Security Drivers configure: configure: SELinux: yes configure: AppArmor: yes (install profiles: no) configure: configure: Driver Loadable Modules configure: configure: driver_modules: yes (CFLAGS='' LIBS='-ldl') configure: configure: Libraries configure: configure: acl: yes (CFLAGS='' LIBS='-lacl') configure: apparmor: yes (CFLAGS='' LIBS='-lapparmor') configure: attr: yes (CFLAGS='' LIBS='-lattr') configure: audit: yes (CFLAGS='' LIBS='-laudit') configure: avahi: yes (CFLAGS='-D_REENTRANT ' LIBS='-lavahi-common -lavahi-client ') configure: bash_completion: yes (CFLAGS=' ' LIBS=' ') configure: blkid: yes (CFLAGS='-I/usr/include/blkid -I/usr/include/uuid ' LIBS='-lblkid ') configure: capng: yes (CFLAGS='' LIBS='-lcap-ng') configure: curl: yes (CFLAGS='-DCURL_DISABLE_TYPECHECK -I/usr/include/x86_64-linux-gnu ' LIBS='-lcurl ') configure: dbus: yes (CFLAGS='-I/usr/include/dbus-1.0 -I/usr/lib/x86_64-linux-gnu/dbus-1.0/include ' LIBS='-ldbus-1 ') configure: dlopen: yes (CFLAGS='' LIBS='-ldl') configure: firewalld: yes (CFLAGS='' LIBS='') configure: fuse: yes (CFLAGS='-I/usr/include/fuse -D_FILE_OFFSET_BITS=64 ' LIBS='-lfuse -pthread ') configure: glusterfs: yes (CFLAGS='-I/usr/include/glusterfs -D_FILE_OFFSET_BITS=64 -D__USE_FILE_OFFSET64 -DUSE_POSIX_ACLS=1 -I/usr/include/uuid ' LIBS='-lacl -lgfapi -lglusterfs -lgfrpc -lgfxdr -luuid ') configure: gnutls: yes (CFLAGS='-I/usr/include/p11-kit-1 ' LIBS='-lgnutls ') configure: hal: no configure: libiscsi: no configure: libnl: yes (CFLAGS='-I/usr/include/libnl3 -I/usr/include/libnl3 ' LIBS='-lnl-3 -lnl-route-3 -lnl-3 ') configure: libpcap: yes (CFLAGS='-I/usr/include' LIBS='-L/usr/lib/x86_64-linux-gnu -lpcap') configure: libssh: yes (CFLAGS=' ' LIBS='-lssh ') configure: libxl: yes (CFLAGS=' -DLIBXL_API_VERSION=0x040500' LIBS='-lxenlight -lxlutil -lxenstore -lxentoollog') configure: libxml: yes (CFLAGS='-I/usr/include/libxml2 ' LIBS='-lxml2 ') configure: macvtap: yes (CFLAGS='' LIBS='') configure: netcf: yes (CFLAGS=' ' LIBS='-lnetcf ') configure: NLS: yes configure: nss: yes configure: numactl: yes (CFLAGS='' LIBS='-lnuma') configure: openwsman: no configure: pciaccess: yes (CFLAGS=' ' LIBS='-lpciaccess ') configure: pm_utils: no configure: polkit: yes configure: rbd: yes (CFLAGS='' LIBS='-lrbd -lrados') configure: readline: yes (CFLAGS='-D_FUNCTION_DEF ' LIBS='-lreadline') configure: sanlock: yes (CFLAGS='' LIBS='-lsanlock_client') configure: sasl: yes (CFLAGS='' LIBS='-lsasl2') configure: selinux: yes (CFLAGS='' LIBS='-lselinux') configure: ssh2: yes (CFLAGS=' ' LIBS='-lssh2 ') configure: udev: yes (CFLAGS=' ' LIBS='-ludev ') configure: virtualport: yes (CFLAGS='' LIBS='') configure: xdr: yes (CFLAGS='' LIBS='') configure: xenapi: no configure: yajl: yes (CFLAGS='' LIBS='-lyajl') configure: configure: Windows configure: configure: Cygwin: no configure: MinGW: no configure: MSVC: no configure: windres: no configure: configure: Test suite configure: configure: Coverage: no configure: Alloc OOM: no configure: configure: Miscellaneous configure: configure: Debug: yes configure: Use -Werror: yes configure: Warning Flags: -fno-common -W -Waddress -Waggressive-loop-optimizations -Wall -Wattributes -Wbad-function-cast -Wbool-compare -Wbuiltin-macro-redefined -Wcast-align -Wchar-subscripts -Wclobbered -Wcomment -Wcomments -Wcoverage-mismatch -Wcpp -Wdate-time -Wdeprecated-declarations -Wdesignated-init -Wdiscarded-array-qualifiers -Wdiscarded-qualifiers -Wdiv-by-zero -Wdouble-promotion -Wduplicated-cond -Wempty-body -Wendif-labels -Wextra -Wformat-contains-nul -Wformat-extra-args -Wformat-security -Wformat-y2k -Wformat-zero-length -Wframe-address -Wfree-nonheap-object -Whsa -Wignored-attributes -Wignored-qualifiers -Wimplicit -Wimplicit-function-declaration -Wimplicit-int -Wincompatible-pointer-types -Winit-self -Winline -Wint-conversion -Wint-to-pointer-cast -Winvalid-memory-model -Winvalid-pch -Wlogical-not-parentheses -Wlogical-op -Wmain -Wmaybe-uninitialized -Wmemset-transposed-args -Wmisleading-indentation -Wmissing-braces -Wmissing-declarations -Wmissing-field-initializers -Wmissing-include-dirs -Wmissing-parameter-type -Wmissing-prototypes -Wmultichar -Wnarrowing -Wnested-externs -Wnonnull -Wnonnull-compare -Wnull-dereference -Wodr -Wold-style-declaration -Wold-style-definition -Wopenmp-simd -Woverflow -Woverride-init -Wpacked-bitfield-compat -Wparentheses -Wpointer-arith -Wpointer-sign -Wpointer-to-int-cast -Wpragmas -Wpsabi -Wreturn-local-addr -Wreturn-type -Wscalar-storage-order -Wsequence-point -Wshadow -Wshift-count-negative -Wshift-count-overflow -Wshift-negative-value -Wsizeof-array-argument -Wsizeof-pointer-memaccess -Wstrict-aliasing -Wstrict-prototypes -Wsuggest-attribute=const -Wsuggest-attribute=format -Wsuggest-attribute=noreturn -Wsuggest-attribute=pure -Wsuggest-final-methods -Wsuggest-final-types -Wswitch -Wswitch-bool -Wsync-nand -Wtautological-compare -Wtrampolines -Wtrigraphs -Wtype-limits -Wuninitialized -Wunknown-pragmas -Wunused -Wunused-but-set-parameter -Wunused-but-set-variable -Wunused-function -Wunused-label -Wunused-local-typedefs -Wunused-parameter -Wunused-result -Wunused-value -Wunused-variable -Wvarargs -Wvariadic-macros -Wvector-operation-performance -Wvolatile-register-var -Wwrite-strings -Warray-bounds=2 -Wnormalized=nfc -Wshift-overflow=2 -Wunused-const-variable=2 -Wno-sign-compare -Wjump-misses-init -Wswitch-enum -Wno-format-nonliteral -fstack-protector-strong -fexceptions -fasynchronous-unwind-tables -fipa-pure-const -Wno-suggest-attribute=pure -Wno-suggest-attribute=const -Werror configure: DTrace: yes configure: numad: yes configure: Init script: systemd configure: Char device locks: /var/lock configure: Default Editor: vi configure: Loader/NVRAM: configure: virt-login-shell: yes configure: virt-host-validate: yes configure: TLS priority: NORMAL configure: configure: Developer Tools configure: configure: wireshark_dissector: yes (CFLAGS='-I/usr/include/wireshark -I/usr/include/glib-2.0 -I/usr/lib/x86_64-linux-gnu/glib-2.0/include -pthread ' LIBS='-lwireshark -Wl,--export-dynamic -lgmodule-2.0 -lgthread-2.0 -pthread -lglib-2.0 ') configure: configure: Privileges configure: configure: QEMU: root:root configure: Now type 'make' to compile libvirt. + /usr/bin/make /usr/bin/make all-recursive make[1]: Entering directory '<https://ci.centos.org/job/libvirt-build/systems=libvirt-debian-9/ws/build'> Making all in . make[2]: Entering directory '<https://ci.centos.org/job/libvirt-build/systems=libvirt-debian-9/ws/build'> make[2]: Leaving directory '<https://ci.centos.org/job/libvirt-build/systems=libvirt-debian-9/ws/build'> Making all in gnulib/lib make[2]: Entering directory '<https://ci.centos.org/job/libvirt-build/systems=libvirt-debian-9/ws/build/gnulib/lib'> GEN alloca.h GEN configmake.h GEN arpa/inet.h GEN fcntl.h GEN getopt.h GEN getopt-cdefs.h GEN langinfo.h GEN limits.h GEN locale.h GEN netdb.h GEN poll.h GEN pty.h GEN signal.h GEN stdint.h GEN stdio.h GEN stdlib.h GEN string.h GEN strings.h GEN sys/ioctl.h GEN sys/select.h GEN sys/socket.h GEN sys/stat.h GEN sys/time.h GEN sys/types.h GEN sys/uio.h GEN sys/utsname.h GEN sys/wait.h GEN termios.h GEN time.h GEN unistd.h GEN unitypes.h GEN uniwidth.h GEN wchar.h GEN wctype.h /usr/bin/make all-am make[3]: Entering directory '<https://ci.centos.org/job/libvirt-build/systems=libvirt-debian-9/ws/build/gnulib/lib'> CC allocator.lo CC areadlink.lo CC base64.lo In file included from ../../../gnulib/lib/base64.c:42:0: ../../config.h:3244:25: fatal error: config-post.h: No such file or directory #include <config-post.h> ^ compilation terminated. Makefile:2545: recipe for target 'base64.lo' failed make[3]: *** [base64.lo] Error 1 make[3]: *** Waiting for unfinished jobs.... In file included from ../../../gnulib/lib/allocator.c:2:0: ../../config.h:3244:25: fatal error: config-post.h: No such file or directory #include <config-post.h> ^ compilation terminated. In file included from ../../../gnulib/lib/areadlink.c:22:0: ../../config.h:3244:25: fatal error: config-post.h: No such file or directory #include <config-post.h> ^ Makefile:2545: recipe for target 'allocator.lo' failed make[3]: *** [allocator.lo] Error 1 compilation terminated. Makefile:2545: recipe for target 'areadlink.lo' failed make[3]: *** [areadlink.lo] Error 1 make[3]: Leaving directory '<https://ci.centos.org/job/libvirt-build/systems=libvirt-debian-9/ws/build/gnulib/lib'> Makefile:2283: recipe for target 'all' failed make[2]: *** [all] Error 2 make[2]: Leaving directory '<https://ci.centos.org/job/libvirt-build/systems=libvirt-debian-9/ws/build/gnulib/lib'> Makefile:2130: recipe for target 'all-recursive' failed make[1]: *** [all-recursive] Error 1 make[1]: Leaving directory '<https://ci.centos.org/job/libvirt-build/systems=libvirt-debian-9/ws/build'> Makefile:2023: recipe for target 'all' failed make: *** [all] Error 2 Build step 'Execute shell' marked build as failure

participants (1)
-
ci@centos.org