[Libvirt-ci] Build failed in Jenkins: libvirt-go-xml-check » libvirt-debian-8 #287

See <https://ci.centos.org/job/libvirt-go-xml-check/systems=libvirt-debian-8/287/display/redirect> ------------------------------------------ Started by upstream project "libvirt-go-xml-check" build number 287 originally caused by: Started by upstream project "libvirt-go-xml-build" build number 287 originally caused by: Started by upstream project "libvirt-build" build number 352 originally caused by: Started by an SCM change [EnvInject] - Loading node environment variables. Building remotely on libvirt-debian-8 (libvirt) in workspace <https://ci.centos.org/job/libvirt-go-xml-check/systems=libvirt-debian-8/ws/> [libvirt-go-xml] $ /bin/sh -xe /tmp/jenkins3452633786779022550.sh + export TEST_ARGS=-tags xmlroundtrip + go test -tags xmlroundtrip --- FAIL: TestRoundTrip (12.61s) xml_test.go:400: testdata/libvirt/tests/qemuxml2argvdata/virtio-non-transitional.xml: /domain[0]/devices[0]/disk[0]/@model: attribute 'virtio-non-transitional' in expected XML missing in actual XML FAIL exit status 1 FAIL _<https://ci.centos.org/job/libvirt-go-xml-check/systems=libvirt-debian-8/ws/> 12.705s Build step 'Execute shell' marked build as failure

See <https://ci.centos.org/job/libvirt-go-xml-check/systems=libvirt-debian-8/288/display/redirect> ------------------------------------------ Started by upstream project "libvirt-go-xml-check" build number 288 originally caused by: Started by upstream project "libvirt-go-xml-build" build number 288 originally caused by: Started by upstream project "libvirt-build" build number 353 originally caused by: Started by an SCM change Started by an SCM change Started by an SCM change Started by an SCM change Started by an SCM change Started by an SCM change Started by an SCM change Started by an SCM change [EnvInject] - Loading node environment variables. Building remotely on libvirt-debian-8 (libvirt) in workspace <https://ci.centos.org/job/libvirt-go-xml-check/systems=libvirt-debian-8/ws/> [libvirt-go-xml] $ /bin/sh -xe /tmp/jenkins542967944218610849.sh + export TEST_ARGS=-tags xmlroundtrip + go test -tags xmlroundtrip --- FAIL: TestRoundTrip (12.68s) xml_test.go:400: testdata/libvirt/tests/qemuxml2argvdata/virtio-non-transitional.xml: /domain[0]/devices[0]/disk[0]/@model: attribute 'virtio-non-transitional' in expected XML missing in actual XML FAIL exit status 1 FAIL _<https://ci.centos.org/job/libvirt-go-xml-check/systems=libvirt-debian-8/ws/> 12.769s Build step 'Execute shell' marked build as failure

See <https://ci.centos.org/job/libvirt-go-xml-check/systems=libvirt-debian-8/289/display/redirect> ------------------------------------------ Started by upstream project "libvirt-go-xml-check" build number 289 originally caused by: Started by upstream project "libvirt-go-xml-build" build number 289 originally caused by: Started by upstream project "libvirt-build" build number 354 originally caused by: Started by an SCM change [EnvInject] - Loading node environment variables. Building remotely on libvirt-debian-8 (libvirt) in workspace <https://ci.centos.org/job/libvirt-go-xml-check/systems=libvirt-debian-8/ws/> [libvirt-go-xml] $ /bin/sh -xe /tmp/jenkins7517429786348240331.sh + export TEST_ARGS=-tags xmlroundtrip + go test -tags xmlroundtrip --- FAIL: TestRoundTrip (11.59s) xml_test.go:400: testdata/libvirt/tests/qemuxml2argvdata/virtio-non-transitional.xml: /domain[0]/devices[0]/disk[0]/@model: attribute 'virtio-non-transitional' in expected XML missing in actual XML FAIL exit status 1 FAIL _<https://ci.centos.org/job/libvirt-go-xml-check/systems=libvirt-debian-8/ws/> 11.761s Build step 'Execute shell' marked build as failure

See <https://ci.centos.org/job/libvirt-go-xml-check/systems=libvirt-debian-8/290/display/redirect> ------------------------------------------ Started by upstream project "libvirt-go-xml-check" build number 290 originally caused by: Started by upstream project "libvirt-go-xml-build" build number 290 originally caused by: Started by upstream project "libvirt-build" build number 355 originally caused by: Started by an SCM change Started by an SCM change Started by an SCM change Started by an SCM change Started by an SCM change Started by an SCM change Started by an SCM change Started by an SCM change Started by an SCM change Started by an SCM change [EnvInject] - Loading node environment variables. Building remotely on libvirt-debian-8 (libvirt) in workspace <https://ci.centos.org/job/libvirt-go-xml-check/systems=libvirt-debian-8/ws/> [libvirt-go-xml] $ /bin/sh -xe /tmp/jenkins2434365225729170036.sh + export TEST_ARGS=-tags xmlroundtrip + go test -tags xmlroundtrip --- FAIL: TestRoundTrip (14.60s) xml_test.go:400: testdata/libvirt/tests/qemuxml2argvdata/virtio-non-transitional.xml: /domain[0]/devices[0]/disk[0]/@model: attribute 'virtio-non-transitional' in expected XML missing in actual XML FAIL exit status 1 FAIL _<https://ci.centos.org/job/libvirt-go-xml-check/systems=libvirt-debian-8/ws/> 14.671s Build step 'Execute shell' marked build as failure

See <https://ci.centos.org/job/libvirt-go-xml-check/systems=libvirt-debian-8/291/display/redirect> ------------------------------------------ Started by upstream project "libvirt-go-xml-check" build number 291 originally caused by: Started by upstream project "libvirt-go-xml-build" build number 291 originally caused by: Started by upstream project "libvirt-build" build number 356 originally caused by: Started by an SCM change [EnvInject] - Loading node environment variables. Building remotely on libvirt-debian-8 (libvirt) in workspace <https://ci.centos.org/job/libvirt-go-xml-check/systems=libvirt-debian-8/ws/> [libvirt-go-xml] $ /bin/sh -xe /tmp/jenkins726076709043373643.sh + export TEST_ARGS=-tags xmlroundtrip + go test -tags xmlroundtrip --- FAIL: TestRoundTrip (20.41s) xml_test.go:400: testdata/libvirt/tests/qemuxml2argvdata/virtio-non-transitional.xml: /domain[0]/devices[0]/disk[0]/@model: attribute 'virtio-non-transitional' in expected XML missing in actual XML FAIL exit status 1 FAIL _<https://ci.centos.org/job/libvirt-go-xml-check/systems=libvirt-debian-8/ws/> 20.499s Build step 'Execute shell' marked build as failure

participants (1)
-
ci@centos.org