[Libvirt-ci] Build failed in Jenkins: libvirt-go-xml-check » libvirt-fedora-rawhide #271

See <https://ci.centos.org/job/libvirt-go-xml-check/systems=libvirt-fedora-rawhide/271/display/redirect> ------------------------------------------ Started by upstream project "libvirt-go-xml-check" build number 271 originally caused by: Started by upstream project "libvirt-go-xml-build" build number 271 originally caused by: Started by upstream project "libvirt-build" build number 333 originally caused by: Started by an SCM change [EnvInject] - Loading node environment variables. Building remotely on libvirt-fedora-rawhide (libvirt) in workspace <https://ci.centos.org/job/libvirt-go-xml-check/systems=libvirt-fedora-rawhide/ws/> [libvirt-go-xml] $ /bin/sh -xe /tmp/jenkins1197662944007306053.sh + export 'TEST_ARGS=-tags xmlroundtrip' + TEST_ARGS='-tags xmlroundtrip' + go test -tags xmlroundtrip --- FAIL: TestRoundTrip (7.46s) xml_test.go:400: testdata/libvirt/tests/bhyvexml2argvdata/bhyvexml2argv-msrs.xml: /domain[0]/features[0]/msrs[0]: element in expected XML missing in actual XML FAIL exit status 1 FAIL _<https://ci.centos.org/job/libvirt-go-xml-check/systems=libvirt-fedora-rawhide/ws/> 7.641s Build step 'Execute shell' marked build as failure

See <https://ci.centos.org/job/libvirt-go-xml-check/systems=libvirt-fedora-rawhide/272/display/redirect> ------------------------------------------ Started by upstream project "libvirt-go-xml-check" build number 272 originally caused by: Started by upstream project "libvirt-go-xml-build" build number 272 originally caused by: Started by upstream project "libvirt-build" build number 334 originally caused by: Started by an SCM change [EnvInject] - Loading node environment variables. Building remotely on libvirt-fedora-rawhide (libvirt) in workspace <https://ci.centos.org/job/libvirt-go-xml-check/systems=libvirt-fedora-rawhide/ws/> [libvirt-go-xml] $ /bin/sh -xe /tmp/jenkins936384524448806819.sh + export 'TEST_ARGS=-tags xmlroundtrip' + TEST_ARGS='-tags xmlroundtrip' + go test -tags xmlroundtrip --- FAIL: TestRoundTrip (4.03s) xml_test.go:400: testdata/libvirt/tests/bhyvexml2argvdata/bhyvexml2argv-msrs.xml: /domain[0]/features[0]/msrs[0]: element in expected XML missing in actual XML FAIL exit status 1 FAIL _<https://ci.centos.org/job/libvirt-go-xml-check/systems=libvirt-fedora-rawhide/ws/> 4.175s Build step 'Execute shell' marked build as failure

See <https://ci.centos.org/job/libvirt-go-xml-check/systems=libvirt-fedora-rawhide/273/display/redirect> ------------------------------------------ Started by upstream project "libvirt-go-xml-check" build number 273 originally caused by: Started by upstream project "libvirt-go-xml-build" build number 273 originally caused by: Started by upstream project "libvirt-build" build number 335 originally caused by: Started by an SCM change [EnvInject] - Loading node environment variables. Building remotely on libvirt-fedora-rawhide (libvirt) in workspace <https://ci.centos.org/job/libvirt-go-xml-check/systems=libvirt-fedora-rawhide/ws/> [libvirt-go-xml] $ /bin/sh -xe /tmp/jenkins3469338050004380881.sh + export 'TEST_ARGS=-tags xmlroundtrip' + TEST_ARGS='-tags xmlroundtrip' + go test -tags xmlroundtrip --- FAIL: TestRoundTrip (6.40s) xml_test.go:400: testdata/libvirt/tests/bhyvexml2argvdata/bhyvexml2argv-msrs.xml: /domain[0]/features[0]/msrs[0]: element in expected XML missing in actual XML FAIL exit status 1 FAIL _<https://ci.centos.org/job/libvirt-go-xml-check/systems=libvirt-fedora-rawhide/ws/> 6.607s Build step 'Execute shell' marked build as failure

participants (1)
-
ci@centos.org