[Libvirt-ci] Build failed in Jenkins: libvirt-go-check » libvirt-debian-9 #289

See <https://ci.centos.org/job/libvirt-go-check/systems=libvirt-debian-9/289/display/redirect> ------------------------------------------ Started by upstream project "libvirt-go-check" build number 289 originally caused by: Started by upstream project "libvirt-go-build" build number 293 originally caused by: Started by upstream project "libvirt-build" build number 360 originally caused by: Started by an SCM change [EnvInject] - Loading node environment variables. Building remotely on libvirt-debian-9 (libvirt) in workspace <https://ci.centos.org/job/libvirt-go-check/systems=libvirt-debian-9/ws/> [libvirt-go] $ /bin/sh -xe /tmp/jenkins7923763276150847130.sh + export TEST_ARGS=-tags api + go test -tags api Missing function 'virConnectGetStoragePoolCapabilities' --- FAIL: TestAPICoverage (0.81s) panic: Missing symbols found [recovered] panic: Missing symbols found goroutine 5 [running]: panic(0x55a5c2dda020, 0xc4201f0420) /usr/lib/go-1.7/src/runtime/panic.go:500 +0x1a1 testing.tRunner.func1(0xc420078180) /usr/lib/go-1.7/src/testing/testing.go:579 +0x25d panic(0x55a5c2dda020, 0xc4201f0420) /usr/lib/go-1.7/src/runtime/panic.go:458 +0x243 _<https://ci.centos.org/job/libvirt-go-check/systems=libvirt-debian-9/ws/.TestAPICoverage(0xc420078180)> <https://ci.centos.org/job/libvirt-go-check/systems=libvirt-debian-9/ws/api_test.go>:501 +0x5ff testing.tRunner(0xc420078180, 0x55a5c2e2d768) /usr/lib/go-1.7/src/testing/testing.go:610 +0x81 created by testing.(*T).Run /usr/lib/go-1.7/src/testing/testing.go:646 +0x2ec exit status 2 FAIL _<https://ci.centos.org/job/libvirt-go-check/systems=libvirt-debian-9/ws/> 0.878s Build step 'Execute shell' marked build as failure

See <https://ci.centos.org/job/libvirt-go-check/systems=libvirt-debian-9/290/display/redirect> ------------------------------------------ Started by upstream project "libvirt-go-check" build number 290 originally caused by: Started by upstream project "libvirt-go-build" build number 294 originally caused by: Started by upstream project "libvirt-build" build number 361 originally caused by: Started by an SCM change Started by an SCM change Started by an SCM change Started by an SCM change Started by an SCM change Started by an SCM change Started by an SCM change Started by an SCM change Started by an SCM change Started by an SCM change Started by an SCM change Started by an SCM change Started by an SCM change Started by an SCM change Started by an SCM change Started by an SCM change Started by an SCM change Started by an SCM change [EnvInject] - Loading node environment variables. Building remotely on libvirt-debian-9 (libvirt) in workspace <https://ci.centos.org/job/libvirt-go-check/systems=libvirt-debian-9/ws/> [libvirt-go] $ /bin/sh -xe /tmp/jenkins6138220837845873107.sh + export TEST_ARGS=-tags api + go test -tags api Missing function 'virConnectGetStoragePoolCapabilities' --- FAIL: TestAPICoverage (0.74s) panic: Missing symbols found [recovered] panic: Missing symbols found goroutine 5 [running]: panic(0x5591550a2020, 0xc420432330) /usr/lib/go-1.7/src/runtime/panic.go:500 +0x1a1 testing.tRunner.func1(0xc420078180) /usr/lib/go-1.7/src/testing/testing.go:579 +0x25d panic(0x5591550a2020, 0xc420432330) /usr/lib/go-1.7/src/runtime/panic.go:458 +0x243 _<https://ci.centos.org/job/libvirt-go-check/systems=libvirt-debian-9/ws/.TestAPICoverage(0xc420078180)> <https://ci.centos.org/job/libvirt-go-check/systems=libvirt-debian-9/ws/api_test.go>:501 +0x5ff testing.tRunner(0xc420078180, 0x5591550f5768) /usr/lib/go-1.7/src/testing/testing.go:610 +0x81 created by testing.(*T).Run /usr/lib/go-1.7/src/testing/testing.go:646 +0x2ec exit status 2 FAIL _<https://ci.centos.org/job/libvirt-go-check/systems=libvirt-debian-9/ws/> 0.853s Build step 'Execute shell' marked build as failure

See <https://ci.centos.org/job/libvirt-go-check/systems=libvirt-debian-9/291/display/redirect> ------------------------------------------ Started by upstream project "libvirt-go-check" build number 291 originally caused by: Started by upstream project "libvirt-go-build" build number 295 originally caused by: Started by upstream project "libvirt-build" build number 362 originally caused by: Started by an SCM change Started by an SCM change Started by an SCM change Started by an SCM change Started by an SCM change Started by an SCM change Started by an SCM change Started by an SCM change Started by an SCM change Started by an SCM change Started by an SCM change Started by an SCM change Started by an SCM change Started by an SCM change Started by an SCM change Started by an SCM change [EnvInject] - Loading node environment variables. Building remotely on libvirt-debian-9 (libvirt) in workspace <https://ci.centos.org/job/libvirt-go-check/systems=libvirt-debian-9/ws/> [libvirt-go] $ /bin/sh -xe /tmp/jenkins2449392499501497268.sh + export TEST_ARGS=-tags api + go test -tags api Missing function 'virConnectGetStoragePoolCapabilities' --- FAIL: TestAPICoverage (0.22s) panic: Missing symbols found [recovered] panic: Missing symbols found goroutine 5 [running]: panic(0x55c1c2bd1020, 0xc420430300) /usr/lib/go-1.7/src/runtime/panic.go:500 +0x1a1 testing.tRunner.func1(0xc420078180) /usr/lib/go-1.7/src/testing/testing.go:579 +0x25d panic(0x55c1c2bd1020, 0xc420430300) /usr/lib/go-1.7/src/runtime/panic.go:458 +0x243 _<https://ci.centos.org/job/libvirt-go-check/systems=libvirt-debian-9/ws/.TestAPICoverage(0xc420078180)> <https://ci.centos.org/job/libvirt-go-check/systems=libvirt-debian-9/ws/api_test.go>:501 +0x5ff testing.tRunner(0xc420078180, 0x55c1c2c24768) /usr/lib/go-1.7/src/testing/testing.go:610 +0x81 created by testing.(*T).Run /usr/lib/go-1.7/src/testing/testing.go:646 +0x2ec exit status 2 FAIL _<https://ci.centos.org/job/libvirt-go-check/systems=libvirt-debian-9/ws/> 0.258s Build step 'Execute shell' marked build as failure

See <https://ci.centos.org/job/libvirt-go-check/systems=libvirt-debian-9/292/display/redirect> ------------------------------------------ Started by upstream project "libvirt-go-check" build number 292 originally caused by: Started by upstream project "libvirt-go-build" build number 296 originally caused by: Started by upstream project "libvirt-build" build number 363 originally caused by: Started by an SCM change Started by an SCM change Started by an SCM change Started by an SCM change Started by an SCM change Started by an SCM change Started by an SCM change Started by an SCM change Started by an SCM change Started by an SCM change [EnvInject] - Loading node environment variables. Building remotely on libvirt-debian-9 (libvirt) in workspace <https://ci.centos.org/job/libvirt-go-check/systems=libvirt-debian-9/ws/> [libvirt-go] $ /bin/sh -xe /tmp/jenkins7181497695557733214.sh + export TEST_ARGS=-tags api + go test -tags api Missing function 'virConnectGetStoragePoolCapabilities' --- FAIL: TestAPICoverage (0.63s) panic: Missing symbols found [recovered] panic: Missing symbols found goroutine 5 [running]: panic(0x55f8436b6020, 0xc420432830) /usr/lib/go-1.7/src/runtime/panic.go:500 +0x1a1 testing.tRunner.func1(0xc420078180) /usr/lib/go-1.7/src/testing/testing.go:579 +0x25d panic(0x55f8436b6020, 0xc420432830) /usr/lib/go-1.7/src/runtime/panic.go:458 +0x243 _<https://ci.centos.org/job/libvirt-go-check/systems=libvirt-debian-9/ws/.TestAPICoverage(0xc420078180)> <https://ci.centos.org/job/libvirt-go-check/systems=libvirt-debian-9/ws/api_test.go>:501 +0x5ff testing.tRunner(0xc420078180, 0x55f843709768) /usr/lib/go-1.7/src/testing/testing.go:610 +0x81 created by testing.(*T).Run /usr/lib/go-1.7/src/testing/testing.go:646 +0x2ec exit status 2 FAIL _<https://ci.centos.org/job/libvirt-go-check/systems=libvirt-debian-9/ws/> 0.917s Build step 'Execute shell' marked build as failure

See <https://ci.centos.org/job/libvirt-go-check/systems=libvirt-debian-9/293/display/redirect> ------------------------------------------ Started by upstream project "libvirt-go-check" build number 293 originally caused by: Started by upstream project "libvirt-go-build" build number 297 originally caused by: Started by upstream project "libvirt-build" build number 364 originally caused by: Started by an SCM change [EnvInject] - Loading node environment variables. Building remotely on libvirt-debian-9 (libvirt) in workspace <https://ci.centos.org/job/libvirt-go-check/systems=libvirt-debian-9/ws/> [libvirt-go] $ /bin/sh -xe /tmp/jenkins8032980941833112603.sh + export TEST_ARGS=-tags api + go test -tags api Missing function 'virConnectGetStoragePoolCapabilities' --- FAIL: TestAPICoverage (0.87s) panic: Missing symbols found [recovered] panic: Missing symbols found goroutine 5 [running]: panic(0x56400db2f020, 0xc420432550) /usr/lib/go-1.7/src/runtime/panic.go:500 +0x1a1 testing.tRunner.func1(0xc420078180) /usr/lib/go-1.7/src/testing/testing.go:579 +0x25d panic(0x56400db2f020, 0xc420432550) /usr/lib/go-1.7/src/runtime/panic.go:458 +0x243 _<https://ci.centos.org/job/libvirt-go-check/systems=libvirt-debian-9/ws/.TestAPICoverage(0xc420078180)> <https://ci.centos.org/job/libvirt-go-check/systems=libvirt-debian-9/ws/api_test.go>:501 +0x5ff testing.tRunner(0xc420078180, 0x56400db82768) /usr/lib/go-1.7/src/testing/testing.go:610 +0x81 created by testing.(*T).Run /usr/lib/go-1.7/src/testing/testing.go:646 +0x2ec exit status 2 FAIL _<https://ci.centos.org/job/libvirt-go-check/systems=libvirt-debian-9/ws/> 1.004s Build step 'Execute shell' marked build as failure

See <https://ci.centos.org/job/libvirt-go-check/systems=libvirt-debian-9/294/display/redirect> ------------------------------------------ Started by upstream project "libvirt-go-check" build number 294 originally caused by: Started by upstream project "libvirt-go-build" build number 298 originally caused by: Started by upstream project "libvirt-build" build number 365 originally caused by: Started by an SCM change [EnvInject] - Loading node environment variables. Building remotely on libvirt-debian-9 (libvirt) in workspace <https://ci.centos.org/job/libvirt-go-check/systems=libvirt-debian-9/ws/> [libvirt-go] $ /bin/sh -xe /tmp/jenkins5342463607955253997.sh + export TEST_ARGS=-tags api + go test -tags api Missing function 'virConnectGetStoragePoolCapabilities' --- FAIL: TestAPICoverage (0.94s) panic: Missing symbols found [recovered] panic: Missing symbols found goroutine 5 [running]: panic(0x560d41da6020, 0xc4201564b0) /usr/lib/go-1.7/src/runtime/panic.go:500 +0x1a1 testing.tRunner.func1(0xc420078180) /usr/lib/go-1.7/src/testing/testing.go:579 +0x25d panic(0x560d41da6020, 0xc4201564b0) /usr/lib/go-1.7/src/runtime/panic.go:458 +0x243 _<https://ci.centos.org/job/libvirt-go-check/systems=libvirt-debian-9/ws/.TestAPICoverage(0xc420078180)> <https://ci.centos.org/job/libvirt-go-check/systems=libvirt-debian-9/ws/api_test.go>:501 +0x5ff testing.tRunner(0xc420078180, 0x560d41df9768) /usr/lib/go-1.7/src/testing/testing.go:610 +0x81 created by testing.(*T).Run /usr/lib/go-1.7/src/testing/testing.go:646 +0x2ec exit status 2 FAIL _<https://ci.centos.org/job/libvirt-go-check/systems=libvirt-debian-9/ws/> 1.084s Build step 'Execute shell' marked build as failure

See <https://ci.centos.org/job/libvirt-go-check/systems=libvirt-debian-9/295/display/redirect> ------------------------------------------ Started by upstream project "libvirt-go-check" build number 295 originally caused by: Started by upstream project "libvirt-go-build" build number 299 originally caused by: Started by upstream project "libvirt-build" build number 366 originally caused by: Started by an SCM change [EnvInject] - Loading node environment variables. Building remotely on libvirt-debian-9 (libvirt) in workspace <https://ci.centos.org/job/libvirt-go-check/systems=libvirt-debian-9/ws/> [libvirt-go] $ /bin/sh -xe /tmp/jenkins659579079466890632.sh + export TEST_ARGS=-tags api + go test -tags api Missing function 'virConnectGetStoragePoolCapabilities' --- FAIL: TestAPICoverage (0.25s) panic: Missing symbols found [recovered] panic: Missing symbols found goroutine 5 [running]: panic(0x56538bccd020, 0xc4204304c0) /usr/lib/go-1.7/src/runtime/panic.go:500 +0x1a1 testing.tRunner.func1(0xc420078180) /usr/lib/go-1.7/src/testing/testing.go:579 +0x25d panic(0x56538bccd020, 0xc4204304c0) /usr/lib/go-1.7/src/runtime/panic.go:458 +0x243 _<https://ci.centos.org/job/libvirt-go-check/systems=libvirt-debian-9/ws/.TestAPICoverage(0xc420078180)> <https://ci.centos.org/job/libvirt-go-check/systems=libvirt-debian-9/ws/api_test.go>:501 +0x5ff testing.tRunner(0xc420078180, 0x56538bd20768) /usr/lib/go-1.7/src/testing/testing.go:610 +0x81 created by testing.(*T).Run /usr/lib/go-1.7/src/testing/testing.go:646 +0x2ec exit status 2 FAIL _<https://ci.centos.org/job/libvirt-go-check/systems=libvirt-debian-9/ws/> 0.280s Build step 'Execute shell' marked build as failure

See <https://ci.centos.org/job/libvirt-go-check/systems=libvirt-debian-9/296/display/redirect> ------------------------------------------ Started by upstream project "libvirt-go-check" build number 296 originally caused by: Started by upstream project "libvirt-go-build" build number 300 originally caused by: Started by upstream project "libvirt-build" build number 367 originally caused by: Started by an SCM change [EnvInject] - Loading node environment variables. Building remotely on libvirt-debian-9 (libvirt) in workspace <https://ci.centos.org/job/libvirt-go-check/systems=libvirt-debian-9/ws/> [libvirt-go] $ /bin/sh -xe /tmp/jenkins6592825127990231530.sh + export TEST_ARGS=-tags api + go test -tags api Missing function 'virConnectGetStoragePoolCapabilities' --- FAIL: TestAPICoverage (0.56s) panic: Missing symbols found [recovered] panic: Missing symbols found goroutine 5 [running]: panic(0x5590444b8020, 0xc4201ee640) /usr/lib/go-1.7/src/runtime/panic.go:500 +0x1a1 testing.tRunner.func1(0xc420078180) /usr/lib/go-1.7/src/testing/testing.go:579 +0x25d panic(0x5590444b8020, 0xc4201ee640) /usr/lib/go-1.7/src/runtime/panic.go:458 +0x243 _<https://ci.centos.org/job/libvirt-go-check/systems=libvirt-debian-9/ws/.TestAPICoverage(0xc420078180)> <https://ci.centos.org/job/libvirt-go-check/systems=libvirt-debian-9/ws/api_test.go>:501 +0x5ff testing.tRunner(0xc420078180, 0x55904450b768) /usr/lib/go-1.7/src/testing/testing.go:610 +0x81 created by testing.(*T).Run /usr/lib/go-1.7/src/testing/testing.go:646 +0x2ec exit status 2 FAIL _<https://ci.centos.org/job/libvirt-go-check/systems=libvirt-debian-9/ws/> 0.669s Build step 'Execute shell' marked build as failure

See <https://ci.centos.org/job/libvirt-go-check/systems=libvirt-debian-9/297/display/redirect> ------------------------------------------ Started by upstream project "libvirt-go-check" build number 297 originally caused by: Started by upstream project "libvirt-go-build" build number 301 originally caused by: Started by upstream project "libvirt-build" build number 368 originally caused by: Started by an SCM change Started by an SCM change Started by an SCM change Started by an SCM change Started by an SCM change [EnvInject] - Loading node environment variables. Building remotely on libvirt-debian-9 (libvirt) in workspace <https://ci.centos.org/job/libvirt-go-check/systems=libvirt-debian-9/ws/> [libvirt-go] $ /bin/sh -xe /tmp/jenkins8832130781782366107.sh + export TEST_ARGS=-tags api + go test -tags api Missing function 'virConnectGetStoragePoolCapabilities' --- FAIL: TestAPICoverage (0.72s) panic: Missing symbols found [recovered] panic: Missing symbols found goroutine 5 [running]: panic(0x56074e831020, 0xc420432540) /usr/lib/go-1.7/src/runtime/panic.go:500 +0x1a1 testing.tRunner.func1(0xc420078180) /usr/lib/go-1.7/src/testing/testing.go:579 +0x25d panic(0x56074e831020, 0xc420432540) /usr/lib/go-1.7/src/runtime/panic.go:458 +0x243 _<https://ci.centos.org/job/libvirt-go-check/systems=libvirt-debian-9/ws/.TestAPICoverage(0xc420078180)> <https://ci.centos.org/job/libvirt-go-check/systems=libvirt-debian-9/ws/api_test.go>:501 +0x5ff testing.tRunner(0xc420078180, 0x56074e884768) /usr/lib/go-1.7/src/testing/testing.go:610 +0x81 created by testing.(*T).Run /usr/lib/go-1.7/src/testing/testing.go:646 +0x2ec exit status 2 FAIL _<https://ci.centos.org/job/libvirt-go-check/systems=libvirt-debian-9/ws/> 0.791s Build step 'Execute shell' marked build as failure

See <https://ci.centos.org/job/libvirt-go-check/systems=libvirt-debian-9/298/display/redirect> ------------------------------------------ Started by upstream project "libvirt-go-check" build number 298 originally caused by: Started by upstream project "libvirt-go-build" build number 302 originally caused by: Started by upstream project "libvirt-build" build number 370 originally caused by: Started by an SCM change Started by an SCM change Started by an SCM change Started by an SCM change [EnvInject] - Loading node environment variables. Building remotely on libvirt-debian-9 (libvirt) in workspace <https://ci.centos.org/job/libvirt-go-check/systems=libvirt-debian-9/ws/> [libvirt-go] $ /bin/sh -xe /tmp/jenkins6200951084213772680.sh + export TEST_ARGS=-tags api + go test -tags api Missing function 'virConnectGetStoragePoolCapabilities' --- FAIL: TestAPICoverage (0.46s) panic: Missing symbols found [recovered] panic: Missing symbols found goroutine 5 [running]: panic(0x55b98bafa020, 0xc4204486c0) /usr/lib/go-1.7/src/runtime/panic.go:500 +0x1a1 testing.tRunner.func1(0xc420078180) /usr/lib/go-1.7/src/testing/testing.go:579 +0x25d panic(0x55b98bafa020, 0xc4204486c0) /usr/lib/go-1.7/src/runtime/panic.go:458 +0x243 _<https://ci.centos.org/job/libvirt-go-check/systems=libvirt-debian-9/ws/.TestAPICoverage(0xc420078180)> <https://ci.centos.org/job/libvirt-go-check/systems=libvirt-debian-9/ws/api_test.go>:501 +0x5ff testing.tRunner(0xc420078180, 0x55b98bb4d768) /usr/lib/go-1.7/src/testing/testing.go:610 +0x81 created by testing.(*T).Run /usr/lib/go-1.7/src/testing/testing.go:646 +0x2ec exit status 2 FAIL _<https://ci.centos.org/job/libvirt-go-check/systems=libvirt-debian-9/ws/> 0.561s Build step 'Execute shell' marked build as failure

See <https://ci.centos.org/job/libvirt-go-check/systems=libvirt-debian-9/299/display/redirect> ------------------------------------------ Started by upstream project "libvirt-go-check" build number 299 originally caused by: Started by upstream project "libvirt-go-build" build number 303 originally caused by: Started by upstream project "libvirt-build" build number 371 originally caused by: Started by an SCM change [EnvInject] - Loading node environment variables. Building remotely on libvirt-debian-9 (libvirt) in workspace <https://ci.centos.org/job/libvirt-go-check/systems=libvirt-debian-9/ws/> [libvirt-go] $ /bin/sh -xe /tmp/jenkins5114172656228637116.sh + export TEST_ARGS=-tags api + go test -tags api Missing function 'virConnectGetStoragePoolCapabilities' --- FAIL: TestAPICoverage (0.55s) panic: Missing symbols found [recovered] panic: Missing symbols found goroutine 5 [running]: panic(0x55a8b946e020, 0xc4200b66e0) /usr/lib/go-1.7/src/runtime/panic.go:500 +0x1a1 testing.tRunner.func1(0xc420078180) /usr/lib/go-1.7/src/testing/testing.go:579 +0x25d panic(0x55a8b946e020, 0xc4200b66e0) /usr/lib/go-1.7/src/runtime/panic.go:458 +0x243 _<https://ci.centos.org/job/libvirt-go-check/systems=libvirt-debian-9/ws/.TestAPICoverage(0xc420078180)> <https://ci.centos.org/job/libvirt-go-check/systems=libvirt-debian-9/ws/api_test.go>:501 +0x5ff testing.tRunner(0xc420078180, 0x55a8b94c1768) /usr/lib/go-1.7/src/testing/testing.go:610 +0x81 created by testing.(*T).Run /usr/lib/go-1.7/src/testing/testing.go:646 +0x2ec exit status 2 FAIL _<https://ci.centos.org/job/libvirt-go-check/systems=libvirt-debian-9/ws/> 0.628s Build step 'Execute shell' marked build as failure

See <https://ci.centos.org/job/libvirt-go-check/systems=libvirt-debian-9/300/display/redirect> ------------------------------------------ Started by upstream project "libvirt-go-check" build number 300 originally caused by: Started by upstream project "libvirt-go-build" build number 304 originally caused by: Started by upstream project "libvirt-build" build number 372 originally caused by: Started by an SCM change [EnvInject] - Loading node environment variables. Building remotely on libvirt-debian-9 (libvirt) in workspace <https://ci.centos.org/job/libvirt-go-check/systems=libvirt-debian-9/ws/> [libvirt-go] $ /bin/sh -xe /tmp/jenkins7678826811586507441.sh + export TEST_ARGS=-tags api + go test -tags api Missing function 'virConnectGetStoragePoolCapabilities' --- FAIL: TestAPICoverage (0.71s) panic: Missing symbols found [recovered] panic: Missing symbols found goroutine 5 [running]: panic(0x56169bf18020, 0xc4200b85b0) /usr/lib/go-1.7/src/runtime/panic.go:500 +0x1a1 testing.tRunner.func1(0xc420078180) /usr/lib/go-1.7/src/testing/testing.go:579 +0x25d panic(0x56169bf18020, 0xc4200b85b0) /usr/lib/go-1.7/src/runtime/panic.go:458 +0x243 _<https://ci.centos.org/job/libvirt-go-check/systems=libvirt-debian-9/ws/.TestAPICoverage(0xc420078180)> <https://ci.centos.org/job/libvirt-go-check/systems=libvirt-debian-9/ws/api_test.go>:501 +0x5ff testing.tRunner(0xc420078180, 0x56169bf6b768) /usr/lib/go-1.7/src/testing/testing.go:610 +0x81 created by testing.(*T).Run /usr/lib/go-1.7/src/testing/testing.go:646 +0x2ec exit status 2 FAIL _<https://ci.centos.org/job/libvirt-go-check/systems=libvirt-debian-9/ws/> 0.833s Build step 'Execute shell' marked build as failure

participants (1)
-
ci@centos.org