[Libvirt-ci] Build failed in Jenkins: libvirt-go-xml-check » libvirt-debian-9 #271

See <https://ci.centos.org/job/libvirt-go-xml-check/systems=libvirt-debian-9/271/display/redirect> ------------------------------------------ Started by upstream project "libvirt-go-xml-check" build number 271 originally caused by: Started by upstream project "libvirt-go-xml-build" build number 271 originally caused by: Started by upstream project "libvirt-build" build number 333 originally caused by: Started by an SCM change [EnvInject] - Loading node environment variables. Building remotely on libvirt-debian-9 (libvirt) in workspace <https://ci.centos.org/job/libvirt-go-xml-check/systems=libvirt-debian-9/ws/> [libvirt-go-xml] $ /bin/sh -xe /tmp/jenkins2053944181236472426.sh + export TEST_ARGS=-tags xmlroundtrip + go test -tags xmlroundtrip --- FAIL: TestRoundTrip (22.61s) xml_test.go:400: testdata/libvirt/tests/bhyvexml2argvdata/bhyvexml2argv-msrs.xml: /domain[0]/features[0]/msrs[0]: element in expected XML missing in actual XML FAIL exit status 1 FAIL _<https://ci.centos.org/job/libvirt-go-xml-check/systems=libvirt-debian-9/ws/> 22.702s Build step 'Execute shell' marked build as failure

See <https://ci.centos.org/job/libvirt-go-xml-check/systems=libvirt-debian-9/272/display/redirect> ------------------------------------------ Started by upstream project "libvirt-go-xml-check" build number 272 originally caused by: Started by upstream project "libvirt-go-xml-build" build number 272 originally caused by: Started by upstream project "libvirt-build" build number 334 originally caused by: Started by an SCM change [EnvInject] - Loading node environment variables. Building remotely on libvirt-debian-9 (libvirt) in workspace <https://ci.centos.org/job/libvirt-go-xml-check/systems=libvirt-debian-9/ws/> [libvirt-go-xml] $ /bin/sh -xe /tmp/jenkins7841948645981391505.sh + export TEST_ARGS=-tags xmlroundtrip + go test -tags xmlroundtrip --- FAIL: TestRoundTrip (14.58s) xml_test.go:400: testdata/libvirt/tests/bhyvexml2argvdata/bhyvexml2argv-msrs.xml: /domain[0]/features[0]/msrs[0]: element in expected XML missing in actual XML FAIL exit status 1 FAIL _<https://ci.centos.org/job/libvirt-go-xml-check/systems=libvirt-debian-9/ws/> 14.715s Build step 'Execute shell' marked build as failure

See <https://ci.centos.org/job/libvirt-go-xml-check/systems=libvirt-debian-9/273/display/redirect> ------------------------------------------ Started by upstream project "libvirt-go-xml-check" build number 273 originally caused by: Started by upstream project "libvirt-go-xml-build" build number 273 originally caused by: Started by upstream project "libvirt-build" build number 335 originally caused by: Started by an SCM change [EnvInject] - Loading node environment variables. Building remotely on libvirt-debian-9 (libvirt) in workspace <https://ci.centos.org/job/libvirt-go-xml-check/systems=libvirt-debian-9/ws/> [libvirt-go-xml] $ /bin/sh -xe /tmp/jenkins5765873474425770127.sh + export TEST_ARGS=-tags xmlroundtrip + go test -tags xmlroundtrip --- FAIL: TestRoundTrip (14.31s) xml_test.go:400: testdata/libvirt/tests/bhyvexml2argvdata/bhyvexml2argv-msrs.xml: /domain[0]/features[0]/msrs[0]: element in expected XML missing in actual XML FAIL exit status 1 FAIL _<https://ci.centos.org/job/libvirt-go-xml-check/systems=libvirt-debian-9/ws/> 14.397s Build step 'Execute shell' marked build as failure

participants (1)
-
ci@centos.org