[Libvirt-ci] Build failed in Jenkins: libvirt-go-check » libvirt-freebsd-12 #257

See <https://ci.centos.org/job/libvirt-go-check/systems=libvirt-freebsd-12/257/display/redirect> ------------------------------------------ Started by upstream project "libvirt-go-check" build number 257 originally caused by: Started by upstream project "libvirt-go-build" build number 261 originally caused by: Started by upstream project "libvirt-build" build number 323 originally caused by: Started by an SCM change [EnvInject] - Loading node environment variables. Building remotely on libvirt-freebsd-12 (libvirt) in workspace <https://ci.centos.org/job/libvirt-go-check/systems=libvirt-freebsd-12/ws/> [libvirt-go] $ /bin/sh -xe /tmp/jenkins4138052173205616778.sh + export 'TEST_ARGS=-tags api' + go test -tags api Missing enum 'VIR_DOMAIN_SAVE_IMAGE_XML_SECURE' Missing enum 'VIR_DOMAIN_SNAPSHOT_XML_SECURE' --- FAIL: TestAPICoverage (1.13s) panic: Missing symbols found [recovered] panic: Missing symbols found goroutine 19 [running]: testing.tRunner.func1(0xc0000c6100) /usr/local/go/src/testing/testing.go:792 +0x387 panic(0x222880, 0x28f0a0) /usr/local/go/src/runtime/panic.go:513 +0x1b9 _/usr<https://ci.centos.org/job/libvirt-go-check/systems=libvirt-freebsd-12/ws/.TestAPICoverage(0xc0000c6100)> /usr<https://ci.centos.org/job/libvirt-go-check/systems=libvirt-freebsd-12/ws/api_test.go>:501 +0x554 testing.tRunner(0xc0000c6100, 0x2706c0) /usr/local/go/src/testing/testing.go:827 +0xbf created by testing.(*T).Run /usr/local/go/src/testing/testing.go:878 +0x35c exit status 2 FAIL _/usr<https://ci.centos.org/job/libvirt-go-check/systems=libvirt-freebsd-12/ws/> 1.384s Build step 'Execute shell' marked build as failure

See <https://ci.centos.org/job/libvirt-go-check/systems=libvirt-freebsd-12/258/display/redirect> ------------------------------------------ Started by upstream project "libvirt-go-check" build number 258 originally caused by: Started by upstream project "libvirt-go-build" build number 262 originally caused by: Started by upstream project "libvirt-build" build number 324 originally caused by: Started by an SCM change [EnvInject] - Loading node environment variables. Building remotely on libvirt-freebsd-12 (libvirt) in workspace <https://ci.centos.org/job/libvirt-go-check/systems=libvirt-freebsd-12/ws/> [libvirt-go] $ /bin/sh -xe /tmp/jenkins2190617309455083332.sh + export 'TEST_ARGS=-tags api' + go test -tags api Missing enum 'VIR_DOMAIN_SAVE_IMAGE_XML_SECURE' Missing enum 'VIR_DOMAIN_SNAPSHOT_XML_SECURE' --- FAIL: TestAPICoverage (0.68s) panic: Missing symbols found [recovered] panic: Missing symbols found goroutine 20 [running]: testing.tRunner.func1(0xc0000c4100) /usr/local/go/src/testing/testing.go:792 +0x387 panic(0x222880, 0x28f0a0) /usr/local/go/src/runtime/panic.go:513 +0x1b9 _/usr<https://ci.centos.org/job/libvirt-go-check/systems=libvirt-freebsd-12/ws/.TestAPICoverage(0xc0000c4100)> /usr<https://ci.centos.org/job/libvirt-go-check/systems=libvirt-freebsd-12/ws/api_test.go>:501 +0x554 testing.tRunner(0xc0000c4100, 0x2706c0) /usr/local/go/src/testing/testing.go:827 +0xbf created by testing.(*T).Run /usr/local/go/src/testing/testing.go:878 +0x35c exit status 2 FAIL _/usr<https://ci.centos.org/job/libvirt-go-check/systems=libvirt-freebsd-12/ws/> 1.168s Build step 'Execute shell' marked build as failure

See <https://ci.centos.org/job/libvirt-go-check/systems=libvirt-freebsd-12/259/display/redirect> ------------------------------------------ Started by upstream project "libvirt-go-check" build number 259 originally caused by: Started by upstream project "libvirt-go-build" build number 263 originally caused by: Started by upstream project "libvirt-build" build number 325 originally caused by: Started by an SCM change [EnvInject] - Loading node environment variables. Building remotely on libvirt-freebsd-12 (libvirt) in workspace <https://ci.centos.org/job/libvirt-go-check/systems=libvirt-freebsd-12/ws/> [libvirt-go] $ /bin/sh -xe /tmp/jenkins6993294470373624964.sh + export 'TEST_ARGS=-tags api' + go test -tags api Missing enum 'VIR_DOMAIN_SAVE_IMAGE_XML_SECURE' Missing enum 'VIR_DOMAIN_SNAPSHOT_XML_SECURE' --- FAIL: TestAPICoverage (0.96s) panic: Missing symbols found [recovered] panic: Missing symbols found goroutine 20 [running]: testing.tRunner.func1(0xc0000c4100) /usr/local/go/src/testing/testing.go:792 +0x387 panic(0x222880, 0x28f0a0) /usr/local/go/src/runtime/panic.go:513 +0x1b9 _/usr<https://ci.centos.org/job/libvirt-go-check/systems=libvirt-freebsd-12/ws/.TestAPICoverage(0xc0000c4100)> /usr<https://ci.centos.org/job/libvirt-go-check/systems=libvirt-freebsd-12/ws/api_test.go>:501 +0x554 testing.tRunner(0xc0000c4100, 0x2706c0) /usr/local/go/src/testing/testing.go:827 +0xbf created by testing.(*T).Run /usr/local/go/src/testing/testing.go:878 +0x35c exit status 2 FAIL _/usr<https://ci.centos.org/job/libvirt-go-check/systems=libvirt-freebsd-12/ws/> 1.511s Build step 'Execute shell' marked build as failure

See <https://ci.centos.org/job/libvirt-go-check/systems=libvirt-freebsd-12/260/display/redirect> ------------------------------------------ Started by upstream project "libvirt-go-check" build number 260 originally caused by: Started by upstream project "libvirt-go-build" build number 264 originally caused by: Started by upstream project "libvirt-build" build number 326 originally caused by: Started by an SCM change Started by an SCM change Started by an SCM change Started by an SCM change Started by an SCM change [EnvInject] - Loading node environment variables. Building remotely on libvirt-freebsd-12 (libvirt) in workspace <https://ci.centos.org/job/libvirt-go-check/systems=libvirt-freebsd-12/ws/> [libvirt-go] $ /bin/sh -xe /tmp/jenkins4499955106052960779.sh + export 'TEST_ARGS=-tags api' + go test -tags api Missing enum 'VIR_DOMAIN_SAVE_IMAGE_XML_SECURE' Missing enum 'VIR_DOMAIN_SNAPSHOT_XML_SECURE' --- FAIL: TestAPICoverage (0.92s) panic: Missing symbols found [recovered] panic: Missing symbols found goroutine 20 [running]: testing.tRunner.func1(0xc0000c4100) /usr/local/go/src/testing/testing.go:792 +0x387 panic(0x222880, 0x28f0a0) /usr/local/go/src/runtime/panic.go:513 +0x1b9 _/usr<https://ci.centos.org/job/libvirt-go-check/systems=libvirt-freebsd-12/ws/.TestAPICoverage(0xc0000c4100)> /usr<https://ci.centos.org/job/libvirt-go-check/systems=libvirt-freebsd-12/ws/api_test.go>:501 +0x554 testing.tRunner(0xc0000c4100, 0x2706c0) /usr/local/go/src/testing/testing.go:827 +0xbf created by testing.(*T).Run /usr/local/go/src/testing/testing.go:878 +0x35c exit status 2 FAIL _/usr<https://ci.centos.org/job/libvirt-go-check/systems=libvirt-freebsd-12/ws/> 1.075s Build step 'Execute shell' marked build as failure

See <https://ci.centos.org/job/libvirt-go-check/systems=libvirt-freebsd-12/261/display/redirect> ------------------------------------------ Started by upstream project "libvirt-go-check" build number 261 originally caused by: Started by upstream project "libvirt-go-build" build number 265 originally caused by: Started by upstream project "libvirt-build" build number 327 originally caused by: Started by an SCM change [EnvInject] - Loading node environment variables. Building remotely on libvirt-freebsd-12 (libvirt) in workspace <https://ci.centos.org/job/libvirt-go-check/systems=libvirt-freebsd-12/ws/> [libvirt-go] $ /bin/sh -xe /tmp/jenkins3087422163742295265.sh + export 'TEST_ARGS=-tags api' + go test -tags api Missing enum 'VIR_DOMAIN_SAVE_IMAGE_XML_SECURE' Missing enum 'VIR_DOMAIN_SNAPSHOT_XML_SECURE' --- FAIL: TestAPICoverage (0.38s) panic: Missing symbols found [recovered] panic: Missing symbols found goroutine 5 [running]: testing.tRunner.func1(0xc0000aa100) /usr/local/go/src/testing/testing.go:792 +0x387 panic(0x222880, 0x28f0a0) /usr/local/go/src/runtime/panic.go:513 +0x1b9 _/usr<https://ci.centos.org/job/libvirt-go-check/systems=libvirt-freebsd-12/ws/.TestAPICoverage(0xc0000aa100)> /usr<https://ci.centos.org/job/libvirt-go-check/systems=libvirt-freebsd-12/ws/api_test.go>:501 +0x554 testing.tRunner(0xc0000aa100, 0x2706c0) /usr/local/go/src/testing/testing.go:827 +0xbf created by testing.(*T).Run /usr/local/go/src/testing/testing.go:878 +0x35c exit status 2 FAIL _/usr<https://ci.centos.org/job/libvirt-go-check/systems=libvirt-freebsd-12/ws/> 0.449s Build step 'Execute shell' marked build as failure

See <https://ci.centos.org/job/libvirt-go-check/systems=libvirt-freebsd-12/262/display/redirect> ------------------------------------------ Started by upstream project "libvirt-go-check" build number 262 originally caused by: Started by upstream project "libvirt-go-build" build number 266 originally caused by: Started by upstream project "libvirt-build" build number 328 originally caused by: Started by an SCM change Started by an SCM change Started by an SCM change Started by an SCM change [EnvInject] - Loading node environment variables. Building remotely on libvirt-freebsd-12 (libvirt) in workspace <https://ci.centos.org/job/libvirt-go-check/systems=libvirt-freebsd-12/ws/> [libvirt-go] $ /bin/sh -xe /tmp/jenkins4416822866756666598.sh + export 'TEST_ARGS=-tags api' + go test -tags api Missing enum 'VIR_DOMAIN_SAVE_IMAGE_XML_SECURE' Missing enum 'VIR_DOMAIN_SNAPSHOT_XML_SECURE' --- FAIL: TestAPICoverage (1.11s) panic: Missing symbols found [recovered] panic: Missing symbols found goroutine 20 [running]: testing.tRunner.func1(0xc0000c2100) /usr/local/go/src/testing/testing.go:792 +0x387 panic(0x222880, 0x28f0a0) /usr/local/go/src/runtime/panic.go:513 +0x1b9 _/usr<https://ci.centos.org/job/libvirt-go-check/systems=libvirt-freebsd-12/ws/.TestAPICoverage(0xc0000c2100)> /usr<https://ci.centos.org/job/libvirt-go-check/systems=libvirt-freebsd-12/ws/api_test.go>:501 +0x554 testing.tRunner(0xc0000c2100, 0x2706c0) /usr/local/go/src/testing/testing.go:827 +0xbf created by testing.(*T).Run /usr/local/go/src/testing/testing.go:878 +0x35c exit status 2 FAIL _/usr<https://ci.centos.org/job/libvirt-go-check/systems=libvirt-freebsd-12/ws/> 1.420s Build step 'Execute shell' marked build as failure

See <https://ci.centos.org/job/libvirt-go-check/systems=libvirt-freebsd-12/263/display/redirect> ------------------------------------------ Started by upstream project "libvirt-go-check" build number 263 originally caused by: Started by upstream project "libvirt-go-build" build number 267 originally caused by: Started by upstream project "libvirt-build" build number 330 originally caused by: Started by an SCM change [EnvInject] - Loading node environment variables. Building remotely on libvirt-freebsd-12 (libvirt) in workspace <https://ci.centos.org/job/libvirt-go-check/systems=libvirt-freebsd-12/ws/> [libvirt-go] $ /bin/sh -xe /tmp/jenkins9164033687118890194.sh + export 'TEST_ARGS=-tags api' + go test -tags api Missing enum 'VIR_DOMAIN_SAVE_IMAGE_XML_SECURE' Missing enum 'VIR_DOMAIN_SNAPSHOT_XML_SECURE' --- FAIL: TestAPICoverage (0.61s) panic: Missing symbols found [recovered] panic: Missing symbols found goroutine 5 [running]: testing.tRunner.func1(0xc0000aa100) /usr/local/go/src/testing/testing.go:792 +0x387 panic(0x222880, 0x28f0a0) /usr/local/go/src/runtime/panic.go:513 +0x1b9 _/usr<https://ci.centos.org/job/libvirt-go-check/systems=libvirt-freebsd-12/ws/.TestAPICoverage(0xc0000aa100)> /usr<https://ci.centos.org/job/libvirt-go-check/systems=libvirt-freebsd-12/ws/api_test.go>:501 +0x554 testing.tRunner(0xc0000aa100, 0x2706c0) /usr/local/go/src/testing/testing.go:827 +0xbf created by testing.(*T).Run /usr/local/go/src/testing/testing.go:878 +0x35c exit status 2 FAIL _/usr<https://ci.centos.org/job/libvirt-go-check/systems=libvirt-freebsd-12/ws/> 1.377s Build step 'Execute shell' marked build as failure

See <https://ci.centos.org/job/libvirt-go-check/systems=libvirt-freebsd-12/264/display/redirect> ------------------------------------------ Started by upstream project "libvirt-go-check" build number 264 originally caused by: Started by upstream project "libvirt-go-build" build number 268 originally caused by: Started by upstream project "libvirt-build" build number 331 originally caused by: Started by an SCM change Started by an SCM change Started by an SCM change [EnvInject] - Loading node environment variables. Building remotely on libvirt-freebsd-12 (libvirt) in workspace <https://ci.centos.org/job/libvirt-go-check/systems=libvirt-freebsd-12/ws/> [libvirt-go] $ /bin/sh -xe /tmp/jenkins1857736551343643779.sh + export 'TEST_ARGS=-tags api' + go test -tags api Missing enum 'VIR_DOMAIN_SAVE_IMAGE_XML_SECURE' Missing enum 'VIR_DOMAIN_SNAPSHOT_XML_SECURE' --- FAIL: TestAPICoverage (0.57s) panic: Missing symbols found [recovered] panic: Missing symbols found goroutine 19 [running]: testing.tRunner.func1(0xc0000c6100) /usr/local/go/src/testing/testing.go:792 +0x387 panic(0x222880, 0x28f0a0) /usr/local/go/src/runtime/panic.go:513 +0x1b9 _/usr<https://ci.centos.org/job/libvirt-go-check/systems=libvirt-freebsd-12/ws/.TestAPICoverage(0xc0000c6100)> /usr<https://ci.centos.org/job/libvirt-go-check/systems=libvirt-freebsd-12/ws/api_test.go>:501 +0x554 testing.tRunner(0xc0000c6100, 0x2706c0) /usr/local/go/src/testing/testing.go:827 +0xbf created by testing.(*T).Run /usr/local/go/src/testing/testing.go:878 +0x35c exit status 2 FAIL _/usr<https://ci.centos.org/job/libvirt-go-check/systems=libvirt-freebsd-12/ws/> 0.825s Build step 'Execute shell' marked build as failure

See <https://ci.centos.org/job/libvirt-go-check/systems=libvirt-freebsd-12/265/display/redirect> ------------------------------------------ Started by upstream project "libvirt-go-check" build number 265 originally caused by: Started by upstream project "libvirt-go-build" build number 269 originally caused by: Started by upstream project "libvirt-build" build number 332 originally caused by: Started by an SCM change [EnvInject] - Loading node environment variables. Building remotely on libvirt-freebsd-12 (libvirt) in workspace <https://ci.centos.org/job/libvirt-go-check/systems=libvirt-freebsd-12/ws/> [libvirt-go] $ /bin/sh -xe /tmp/jenkins3752699292872083235.sh + export 'TEST_ARGS=-tags api' + go test -tags api Missing enum 'VIR_DOMAIN_SAVE_IMAGE_XML_SECURE' Missing enum 'VIR_DOMAIN_SNAPSHOT_XML_SECURE' --- FAIL: TestAPICoverage (0.46s) panic: Missing symbols found [recovered] panic: Missing symbols found goroutine 4 [running]: testing.tRunner.func1(0xc0000b0100) /usr/local/go/src/testing/testing.go:792 +0x387 panic(0x222880, 0x28f0a0) /usr/local/go/src/runtime/panic.go:513 +0x1b9 _/usr<https://ci.centos.org/job/libvirt-go-check/systems=libvirt-freebsd-12/ws/.TestAPICoverage(0xc0000b0100)> /usr<https://ci.centos.org/job/libvirt-go-check/systems=libvirt-freebsd-12/ws/api_test.go>:501 +0x554 testing.tRunner(0xc0000b0100, 0x2706c0) /usr/local/go/src/testing/testing.go:827 +0xbf created by testing.(*T).Run /usr/local/go/src/testing/testing.go:878 +0x35c exit status 2 FAIL _/usr<https://ci.centos.org/job/libvirt-go-check/systems=libvirt-freebsd-12/ws/> 1.027s Build step 'Execute shell' marked build as failure

See <https://ci.centos.org/job/libvirt-go-check/systems=libvirt-freebsd-12/266/display/redirect> ------------------------------------------ Started by upstream project "libvirt-go-check" build number 266 originally caused by: Started by upstream project "libvirt-go-build" build number 270 originally caused by: Started by upstream project "libvirt-build" build number 333 originally caused by: Started by an SCM change [EnvInject] - Loading node environment variables. Building remotely on libvirt-freebsd-12 (libvirt) in workspace <https://ci.centos.org/job/libvirt-go-check/systems=libvirt-freebsd-12/ws/> [libvirt-go] $ /bin/sh -xe /tmp/jenkins320608915083675909.sh + export 'TEST_ARGS=-tags api' + go test -tags api Missing enum 'VIR_DOMAIN_SAVE_IMAGE_XML_SECURE' Missing enum 'VIR_DOMAIN_SNAPSHOT_XML_SECURE' --- FAIL: TestAPICoverage (0.74s) panic: Missing symbols found [recovered] panic: Missing symbols found goroutine 19 [running]: testing.tRunner.func1(0xc0000c6100) /usr/local/go/src/testing/testing.go:792 +0x387 panic(0x222880, 0x28f0a0) /usr/local/go/src/runtime/panic.go:513 +0x1b9 _/usr<https://ci.centos.org/job/libvirt-go-check/systems=libvirt-freebsd-12/ws/.TestAPICoverage(0xc0000c6100)> /usr<https://ci.centos.org/job/libvirt-go-check/systems=libvirt-freebsd-12/ws/api_test.go>:501 +0x554 testing.tRunner(0xc0000c6100, 0x2706c0) /usr/local/go/src/testing/testing.go:827 +0xbf created by testing.(*T).Run /usr/local/go/src/testing/testing.go:878 +0x35c exit status 2 FAIL _/usr<https://ci.centos.org/job/libvirt-go-check/systems=libvirt-freebsd-12/ws/> 1.401s Build step 'Execute shell' marked build as failure

See <https://ci.centos.org/job/libvirt-go-check/systems=libvirt-freebsd-12/267/display/redirect> ------------------------------------------ Started by upstream project "libvirt-go-check" build number 267 originally caused by: Started by upstream project "libvirt-go-build" build number 271 originally caused by: Started by upstream project "libvirt-build" build number 334 originally caused by: Started by an SCM change [EnvInject] - Loading node environment variables. Building remotely on libvirt-freebsd-12 (libvirt) in workspace <https://ci.centos.org/job/libvirt-go-check/systems=libvirt-freebsd-12/ws/> [libvirt-go] $ /bin/sh -xe /tmp/jenkins2368840694474847698.sh + export 'TEST_ARGS=-tags api' + go test -tags api Missing enum 'VIR_DOMAIN_SAVE_IMAGE_XML_SECURE' Missing enum 'VIR_DOMAIN_SNAPSHOT_XML_SECURE' --- FAIL: TestAPICoverage (0.47s) panic: Missing symbols found [recovered] panic: Missing symbols found goroutine 20 [running]: testing.tRunner.func1(0xc0000c4100) /usr/local/go/src/testing/testing.go:792 +0x387 panic(0x222880, 0x28f0a0) /usr/local/go/src/runtime/panic.go:513 +0x1b9 _/usr<https://ci.centos.org/job/libvirt-go-check/systems=libvirt-freebsd-12/ws/.TestAPICoverage(0xc0000c4100)> /usr<https://ci.centos.org/job/libvirt-go-check/systems=libvirt-freebsd-12/ws/api_test.go>:501 +0x554 testing.tRunner(0xc0000c4100, 0x2706c0) /usr/local/go/src/testing/testing.go:827 +0xbf created by testing.(*T).Run /usr/local/go/src/testing/testing.go:878 +0x35c exit status 2 FAIL _/usr<https://ci.centos.org/job/libvirt-go-check/systems=libvirt-freebsd-12/ws/> 1.137s Build step 'Execute shell' marked build as failure

participants (1)
-
ci@centos.org