[Libvirt-ci] Build failed in Jenkins: libvirt+mingw32-build » libvirt-fedora-rawhide #424

See <https://ci.centos.org/job/libvirt+mingw32-build/systems=libvirt-fedora-rawhide/424/display/redirect?page=changes> Changes: [mprivozn] node_device_hal.c: Follow _class -> klass rename [abologna] tests: Document how to add new replies files [crobinso] tests: domcaps: Add a default 'empty' test [crobinso] tests: domcaps: Remove unused typedef [crobinso] tests: domcaps: Remove 'full' test [crobinso] conf: domcaps: Add single line formatting macro [crobinso] conf: domcaps: use virTristateBool for 'supported' [crobinso] qemu: domcaps: fill in explicit supported BOOL_NO [crobinso] libxl: domcaps: fill in explicit supported BOOL_NO [crobinso] bhyve: domcaps: fill in explicit supported BOOL_NO [crobinso] schemas: domcaps: Make more elements optional [crobinso] conf: domcaps: Don't output XML on tristate ABSENT [crobinso] conf: domcaps: Add virCapsEnum 'report' [crobinso] qemu: fill in virCapsEnum 'report' [crobinso] libxl: fill in virCapsEnum 'report' [crobinso] bhyve: fill in virCapsEnum 'report' [crobinso] conf: domcaps: Don't format XML on report=false [crobinso] docs: formatdomaincaps: Describe optional XML changes ------------------------------------------ [...truncated 151.54 KB...] GEN testsuites.html GEN drvlxc.html GEN news-2006.html GEN securityprocess.html GEN acl.html GEN news-2013.html GEN governance.html GEN drvqemu.html GEN testtck.html GEN drivers.html GEN api_extension.html GEN remote.html GEN migration.html touch ../../docs/apibuild.py.stamp GEN cgroups.html GEN errors.html GEN format.html GEN locking-lockd.html GEN drvhyperv.html GEN drvremote.html GEN devguide.html GEN python.html GEN downloads.html GEN drvvmware.html GEN secureusage.html GEN drvvirtuozzo.html GEN auditlog.html GEN news-2007.html GEN dbus.html GEN formatstorage.html GEN locking-sanlock.html GEN 404.html GEN auth.html GEN news-2010.html GEN compiling.html GEN drvesx.html GEN php.html GEN contribute.html GEN index.html GEN drvxen.html GEN news-2015.html GEN news-2008.html GEN virshcmdref.html GEN hooks.html GEN firewall.html GEN formatnwfilter.html GEN apps.html GEN news-2014.html GEN support.html GEN java.html GEN drvtest.html GEN drvvbox.html GEN drvphyp.html GEN formatstoragecaps.html GEN docs.html GEN goals.html GEN news-2005.html GEN storage.html GEN formatdomain.html GEN formatstorageencryption.html GEN formatsecret.html GEN windows.html GEN formatnode.html GEN architecture.html GEN news-2009.html GEN platforms.html GEN nss.html GEN bindings.html GEN news-2012.html GEN aclpolkit.html GEN logging.html GEN drvopenvz.html GEN formatnetwork.html GEN testapi.html GEN bugs.html GEN drvnodedev.html GEN formatsnapshot.html GEN formatcaps.html GEN api.html GEN news-2011.html GEN drvbhyve.html GEN locking.html GEN internals.html GEN news-2016.html GEN pci-hotplug.html GEN csharp.html GEN contact.html GEN hacking.html GEN internals/locking.html GEN internals/rpc.html GEN internals/eventloop.html GEN internals/command.html GEN internals/oomtesting.html GEN search.php GEN ../../docs/hvsupport.html.in GEN news.html GEN html/index.html GEN ../../docs/devhelp/index.html GEN hvsupport.html.tmp GEN hvsupport.html rm internals/rpc.html.tmp drvopenvz.html.tmp logging.html.tmp aclpolkit.html.tmp windows.html.tmp formatnwfilter.html.tmp news-2014.html.tmp php.html.tmp formatstorageencryption.html.tmp drvhyperv.html.tmp testapi.html.tmp format.html.tmp errors.html.tmp api_extension.html.tmp virshcmdref.html.tmp platforms.html.tmp news-2006.html.tmp formatcaps.html.tmp internals.html.tmp dbus.html.tmp auditlog.html.tmp downloads.html.tmp internals/oomtesting.html.tmp bugs.html.tmp drvphyp.html.tmp java.html.tmp locking.html.tmp bindings.html.tmp contribute.html.tmp news-2016.html.tmp locking-lockd.html.tmp drvqemu.html.tmp drvvmware.html.tmp architecture.html.tmp drvvirtuozzo.html.tmp formatdomaincaps.html.tmp internals/command.html.tmp formatsnapshot.html.tmp drvesx.html.tmp acl.html.tmp news-2005.html.tmp drvxen.html.tmp securityprocess.html.tmp 404.html.tmp formatstoragecaps.html.tmp news-2008.html.tmp search.php.tmp news-2015.html.tmp formatstorage.html.tmp python.html.tmp drvremote.html.tmp hooks.html.tmp docs.html.tmp internals/locking.html.tmp remote.html.tmp drivers.html.tmp compiling.html.tmp formatsecret.html.tmp news.html.tmp formatnode.html.tmp internals/eventloop.html.tmp goals.html.tmp apps.html.tmp formatdomain.html.tmp drvvbox.html.tmp csharp.html.tmp firewall.html.tmp secureusage.html.tmp governance.html.tmp hacking.html.tmp cgroups.html.tmp news-2013.html.tmp news-2007.html.tmp api.html.tmp news-2010.html.tmp news-2009.html.tmp news-2011.html.tmp index.html.tmp formatnetwork.html.tmp drvlxc.html.tmp uri.html.tmp pci-hotplug.html.tmp news-2012.html.tmp hvsupport.html.tmp locking-sanlock.html.tmp drvtest.html.tmp support.html.tmp testtck.html.tmp devguide.html.tmp drvbhyve.html.tmp testsuites.html.tmp nss.html.tmp migration.html.tmp drvnodedev.html.tmp storage.html.tmp contact.html.tmp auth.html.tmp gmake[2]: Leaving directory '<https://ci.centos.org/job/libvirt+mingw32-build/systems=libvirt-fedora-rawhide/ws/build/docs'> Making all in gnulib/tests gmake[2]: Entering directory '<https://ci.centos.org/job/libvirt+mingw32-build/systems=libvirt-fedora-rawhide/ws/build/gnulib/tests'> GEN ctype.h GEN inttypes.h GEN math.h GEN spawn.h /usr/bin/gmake all-recursive gmake[3]: Entering directory '<https://ci.centos.org/job/libvirt+mingw32-build/systems=libvirt-fedora-rawhide/ws/build/gnulib/tests'> Making all in . gmake[4]: Entering directory '<https://ci.centos.org/job/libvirt+mingw32-build/systems=libvirt-fedora-rawhide/ws/build/gnulib/tests'> CC test-localcharset.o CC exitfail.o CC fatal-signal.o CC getprogname.o CC localename.o CC localename-table.o CC math.o CC wait-process.o CC xmalloc.o CC xalloc-die.o CC dup.o CC error.o CC fdopen.o CC ftruncate.o CC getpagesize.o CC getsockopt.o CC grantpt.o CC nanosleep.o CC ptsname.o CC ptsname_r.o CC putenv.o CC read.o CC setlocale.o CC spawn_faction_addclose.o CC spawn_faction_adddup2.o CC spawn_faction_addopen.o CC spawn_faction_destroy.o CC spawn_faction_init.o CC spawnattr_destroy.o CC spawnattr_init.o CC spawnattr_setflags.o CC spawnattr_setsigmask.o CC spawni.o CC spawnp.o CC symlink.o CC unlockpt.o CC wctob.o CC write.o CC glthread/thread.o AR libtests.a CCLD test-localcharset.exe gmake[4]: Leaving directory '<https://ci.centos.org/job/libvirt+mingw32-build/systems=libvirt-fedora-rawhide/ws/build/gnulib/tests'> gmake[3]: Leaving directory '<https://ci.centos.org/job/libvirt+mingw32-build/systems=libvirt-fedora-rawhide/ws/build/gnulib/tests'> gmake[2]: Leaving directory '<https://ci.centos.org/job/libvirt+mingw32-build/systems=libvirt-fedora-rawhide/ws/build/gnulib/tests'> Making all in tests gmake[2]: Entering directory '<https://ci.centos.org/job/libvirt+mingw32-build/systems=libvirt-fedora-rawhide/ws/build/tests'> CC virshtest.o CC testutils.o CC sockettest.o CC virhostcputest.o CC virbuftest.o CC virfilewrapper.o CC commandtest.o CC seclabeltest.o CC virhashtest.o CC virconftest.o CC viratomictest.o CC utiltest.o CC shunloadtest.o CC shunloadhelper.lo CC virtimetest.o CC viruritest.o CC virkeyfiletest.o CC viralloctest.o CC virauthconfigtest.o CC virbitmaptest.o CC vircgrouptest.o CC vircryptotest.o CC virpcitest.o CC virendiantest.o CC virfiletest.o CC virfilecachetest.o CC virfirewalltest-virfirewalltest.o CC virfirewalltest-testutils.o CC viriscsitest.o CC virkeycodetest.o CC virlockspacetest.o CC virlogtest.o CC virrotatingfiletest.o CC virschematest.o CC virstringtest.o CC virportallocatortest.o CC sysinfotest.o CC virkmodtest.o CC vircapstest.o CC domaincapstest.o CC domainconftest.o CC virhostdevtest.o CC virnetdevtest-virnetdevtest.o CC virnetdevtest-testutils.o CC virtypedparamtest.o CC vshtabletest.o CC virerrortest.o CC virnetmessagetest.o CC virnetsockettest.o CC virnetdaemontest.o CC virnetserverclienttest.o CC virnettlscontexttest.o CC virnettlshelpers.o CC pkix_asn1_tab.o CC virnettlssessiontest.o CC virdbustest-virdbustest.o CC virdbustest-testutils.o CC virsystemdtest-virsystemdtest.o CC virsystemdtest-testutils.o CC virpolkittest-virpolkittest.o CC virpolkittest-testutils.o CC esxutilstest.o CC vmx2xmltest.o CC xml2vmxtest.o CC vmwarevertest.o CC networkxml2xmltest.o CC networkxml2xmlupdatetest.o CC nwfilterxml2xmltest.o CC virnwfilterbindingxml2xmltest.o CC storagevolxml2xmltest.o CC nodedevxml2xmltest.o CC interfacexml2xmltest.o CC cputest.o CC metadatatest.o CC secretxml2xmltest.o CC genericxml2xmltest.o CC objecteventtest.o CC commandhelper.o CC ssh.o CC virportallocatormock.lo ../../tests/domaincapstest.c:28:1: error: 'fillStringValues' defined but not used [-Werror=unused-function] fillStringValues(virDomainCapsStringValuesPtr values, ...) ^~~~~~~~~~~~~~~~ cc1: all warnings being treated as errors gmake[2]: *** [Makefile:5684: domaincapstest.o] Error 1 gmake[2]: *** Waiting for unfinished jobs.... gmake[2]: Leaving directory '<https://ci.centos.org/job/libvirt+mingw32-build/systems=libvirt-fedora-rawhide/ws/build/tests'> gmake[1]: *** [Makefile:2129: all-recursive] Error 1 gmake[1]: Leaving directory '<https://ci.centos.org/job/libvirt+mingw32-build/systems=libvirt-fedora-rawhide/ws/build'> gmake: *** [Makefile:2022: all] Error 2 Build step 'Execute shell' marked build as failure

See <https://ci.centos.org/job/libvirt+mingw32-build/systems=libvirt-fedora-rawhide/425/display/redirect?page=changes> Changes: [berrange] storage: split off code for calling rbd_list [berrange] storage: add support for new rbd_list2 method ------------------------------------------ [...truncated 150.33 KB...] GEN formatstorageencryption.html.tmp GEN formatsecret.html.tmp GEN windows.html.tmp GEN formatnode.html.tmp GEN architecture.html.tmp GEN news-2009.html.tmp GEN platforms.html.tmp GEN nss.html.tmp GEN bindings.html.tmp GEN aclpolkit.html.tmp GEN news-2012.html.tmp GEN logging.html.tmp GEN drvopenvz.html.tmp GEN formatnetwork.html.tmp GEN testapi.html.tmp GEN bugs.html.tmp GEN drvnodedev.html.tmp GEN formatsnapshot.html.tmp GEN formatcaps.html.tmp GEN api.html.tmp GEN news-2011.html.tmp GEN drvbhyve.html.tmp GEN locking.html.tmp GEN internals.html.tmp GEN news-2016.html.tmp GEN pci-hotplug.html.tmp GEN csharp.html.tmp GEN contact.html.tmp GEN hacking.html.tmp GEN internals/locking.html.tmp GEN internals/rpc.html.tmp GEN internals/eventloop.html.tmp GEN internals/command.html.tmp GEN internals/oomtesting.html.tmp GEN search.php.tmp GEN formatdomaincaps.html GEN news.html.tmp GEN uri.html GEN testsuites.html GEN drvlxc.html GEN news-2006.html GEN securityprocess.html GEN acl.html GEN news-2013.html GEN governance.html GEN drvqemu.html GEN testtck.html GEN drivers.html GEN api_extension.html GEN remote.html GEN migration.html GEN cgroups.html GEN errors.html GEN format.html GEN locking-lockd.html GEN drvhyperv.html GEN drvremote.html touch ../../docs/apibuild.py.stamp GEN devguide.html GEN python.html GEN downloads.html GEN drvvmware.html GEN secureusage.html GEN auditlog.html GEN drvvirtuozzo.html GEN news-2007.html GEN formatstorage.html GEN dbus.html GEN locking-sanlock.html GEN 404.html GEN news-2010.html GEN auth.html GEN compiling.html GEN drvesx.html GEN php.html GEN contribute.html GEN index.html GEN drvxen.html GEN news-2015.html GEN news-2008.html GEN virshcmdref.html GEN hooks.html GEN formatnwfilter.html GEN firewall.html GEN apps.html GEN news-2014.html GEN support.html GEN java.html GEN drvtest.html GEN drvvbox.html GEN drvphyp.html GEN formatstoragecaps.html GEN docs.html GEN goals.html GEN news-2005.html GEN storage.html GEN formatdomain.html GEN formatstorageencryption.html GEN formatsecret.html GEN windows.html GEN formatnode.html GEN architecture.html GEN news-2009.html GEN platforms.html GEN nss.html GEN bindings.html GEN aclpolkit.html GEN news-2012.html GEN logging.html GEN drvopenvz.html GEN formatnetwork.html GEN testapi.html GEN bugs.html GEN formatsnapshot.html GEN drvnodedev.html GEN formatcaps.html GEN api.html GEN news-2011.html GEN drvbhyve.html GEN internals.html GEN locking.html GEN news-2016.html GEN pci-hotplug.html GEN csharp.html GEN contact.html GEN hacking.html GEN internals/locking.html GEN internals/eventloop.html GEN internals/rpc.html GEN internals/command.html GEN internals/oomtesting.html GEN search.php GEN ../../docs/hvsupport.html.in GEN news.html GEN html/index.html GEN ../../docs/devhelp/index.html GEN hvsupport.html.tmp GEN hvsupport.html rm internals/rpc.html.tmp drvopenvz.html.tmp logging.html.tmp aclpolkit.html.tmp windows.html.tmp formatnwfilter.html.tmp news-2014.html.tmp php.html.tmp formatstorageencryption.html.tmp drvhyperv.html.tmp testapi.html.tmp format.html.tmp errors.html.tmp api_extension.html.tmp virshcmdref.html.tmp platforms.html.tmp news-2006.html.tmp formatcaps.html.tmp internals.html.tmp dbus.html.tmp auditlog.html.tmp downloads.html.tmp internals/oomtesting.html.tmp bugs.html.tmp drvphyp.html.tmp java.html.tmp locking.html.tmp bindings.html.tmp contribute.html.tmp news-2016.html.tmp locking-lockd.html.tmp drvqemu.html.tmp drvvmware.html.tmp architecture.html.tmp drvvirtuozzo.html.tmp formatdomaincaps.html.tmp internals/command.html.tmp formatsnapshot.html.tmp drvesx.html.tmp acl.html.tmp news-2005.html.tmp drvxen.html.tmp securityprocess.html.tmp 404.html.tmp formatstoragecaps.html.tmp news-2008.html.tmp search.php.tmp news-2015.html.tmp formatstorage.html.tmp python.html.tmp drvremote.html.tmp hooks.html.tmp docs.html.tmp internals/locking.html.tmp remote.html.tmp drivers.html.tmp compiling.html.tmp formatsecret.html.tmp news.html.tmp formatnode.html.tmp internals/eventloop.html.tmp goals.html.tmp apps.html.tmp formatdomain.html.tmp drvvbox.html.tmp csharp.html.tmp firewall.html.tmp secureusage.html.tmp governance.html.tmp hacking.html.tmp cgroups.html.tmp news-2013.html.tmp news-2007.html.tmp api.html.tmp news-2010.html.tmp news-2009.html.tmp news-2011.html.tmp index.html.tmp formatnetwork.html.tmp drvlxc.html.tmp uri.html.tmp pci-hotplug.html.tmp news-2012.html.tmp hvsupport.html.tmp locking-sanlock.html.tmp drvtest.html.tmp support.html.tmp testtck.html.tmp devguide.html.tmp drvbhyve.html.tmp testsuites.html.tmp nss.html.tmp migration.html.tmp drvnodedev.html.tmp storage.html.tmp contact.html.tmp auth.html.tmp gmake[2]: Leaving directory '<https://ci.centos.org/job/libvirt+mingw32-build/systems=libvirt-fedora-rawhide/ws/build/docs'> Making all in gnulib/tests gmake[2]: Entering directory '<https://ci.centos.org/job/libvirt+mingw32-build/systems=libvirt-fedora-rawhide/ws/build/gnulib/tests'> GEN ctype.h GEN inttypes.h GEN math.h GEN spawn.h /usr/bin/gmake all-recursive gmake[3]: Entering directory '<https://ci.centos.org/job/libvirt+mingw32-build/systems=libvirt-fedora-rawhide/ws/build/gnulib/tests'> Making all in . gmake[4]: Entering directory '<https://ci.centos.org/job/libvirt+mingw32-build/systems=libvirt-fedora-rawhide/ws/build/gnulib/tests'> CC test-localcharset.o CC exitfail.o CC fatal-signal.o CC getprogname.o CC localename.o CC localename-table.o CC math.o CC wait-process.o CC xmalloc.o CC xalloc-die.o CC dup.o CC error.o CC fdopen.o CC ftruncate.o CC getpagesize.o CC getsockopt.o CC grantpt.o CC nanosleep.o CC ptsname.o CC ptsname_r.o CC putenv.o CC read.o CC setlocale.o CC spawn_faction_addclose.o CC spawn_faction_adddup2.o CC spawn_faction_addopen.o CC spawn_faction_destroy.o CC spawn_faction_init.o CC spawnattr_destroy.o CC spawnattr_init.o CC spawnattr_setflags.o CC spawnattr_setsigmask.o CC spawni.o CC spawnp.o CC symlink.o CC unlockpt.o CC wctob.o CC write.o CC glthread/thread.o AR libtests.a CCLD test-localcharset.exe gmake[4]: Leaving directory '<https://ci.centos.org/job/libvirt+mingw32-build/systems=libvirt-fedora-rawhide/ws/build/gnulib/tests'> gmake[3]: Leaving directory '<https://ci.centos.org/job/libvirt+mingw32-build/systems=libvirt-fedora-rawhide/ws/build/gnulib/tests'> gmake[2]: Leaving directory '<https://ci.centos.org/job/libvirt+mingw32-build/systems=libvirt-fedora-rawhide/ws/build/gnulib/tests'> Making all in tests gmake[2]: Entering directory '<https://ci.centos.org/job/libvirt+mingw32-build/systems=libvirt-fedora-rawhide/ws/build/tests'> CC virshtest.o CC testutils.o CC sockettest.o CC virhostcputest.o CC virfilewrapper.o CC virbuftest.o CC commandtest.o CC seclabeltest.o CC virhashtest.o CC virconftest.o CC viratomictest.o CC utiltest.o CC shunloadtest.o CC shunloadhelper.lo CC virtimetest.o CC viruritest.o CC virkeyfiletest.o CC viralloctest.o CC virauthconfigtest.o CC virbitmaptest.o CC vircgrouptest.o CC vircryptotest.o CC virpcitest.o CC virendiantest.o CC virfiletest.o CC virfilecachetest.o CC virfirewalltest-virfirewalltest.o CC virfirewalltest-testutils.o CC viriscsitest.o CC virkeycodetest.o CC virlockspacetest.o CC virlogtest.o CC virrotatingfiletest.o CC virschematest.o CC virstringtest.o CC virportallocatortest.o CC sysinfotest.o CC virkmodtest.o CC vircapstest.o CC domaincapstest.o CC domainconftest.o CC virhostdevtest.o ../../tests/domaincapstest.c:28:1: error: 'fillStringValues' defined but not used [-Werror=unused-function] fillStringValues(virDomainCapsStringValuesPtr values, ...) ^~~~~~~~~~~~~~~~ cc1: all warnings being treated as errors gmake[2]: *** [Makefile:5684: domaincapstest.o] Error 1 gmake[2]: *** Waiting for unfinished jobs.... gmake[2]: Leaving directory '<https://ci.centos.org/job/libvirt+mingw32-build/systems=libvirt-fedora-rawhide/ws/build/tests'> gmake[1]: *** [Makefile:2129: all-recursive] Error 1 gmake[1]: Leaving directory '<https://ci.centos.org/job/libvirt+mingw32-build/systems=libvirt-fedora-rawhide/ws/build'> gmake: *** [Makefile:2022: all] Error 2 Build step 'Execute shell' marked build as failure

participants (1)
-
ci@centos.org