[Libvirt-ci] Build failed in Jenkins: libvirt-go-xml-master-check » libvirt-fedora-27 #405

See <https://ci.centos.org/job/libvirt-go-xml-master-check/systems=libvirt-fedora-27/405/display/redirect> ------------------------------------------ Started by upstream project "libvirt-go-xml-master-check" build number 405 originally caused by: Started by upstream project "libvirt-go-xml-master-build" build number 413 originally caused by: Started by upstream project "libvirt-master-build" build number 1463 originally caused by: Started by an SCM change [EnvInject] - Loading node environment variables. Building remotely on libvirt-fedora-27 (libvirt) in workspace <https://ci.centos.org/job/libvirt-go-xml-master-check/systems=libvirt-fedora-27/ws/> [libvirt-go-xml-master] $ /bin/sh -xe /tmp/jenkins4167561749119329529.sh + export 'TEST_ARGS=-tags xmlroundtrip' + TEST_ARGS='-tags xmlroundtrip' + go test -tags xmlroundtrip --- FAIL: TestRoundTrip (9.94s) xml_test.go:383: testdata/libvirt/tests/domaincapsschemadata/basic.xml: /domainCapabilities[0]/features[0]/genid[0]: element in expected XML missing in actual XML FAIL exit status 1 FAIL _<https://ci.centos.org/job/libvirt-go-xml-master-check/systems=libvirt-fedora-27/ws/> 10.091s Build step 'Execute shell' marked build as failure

See <https://ci.centos.org/job/libvirt-go-xml-master-check/systems=libvirt-fedora-27/406/display/redirect> ------------------------------------------ Started by upstream project "libvirt-go-xml-master-check" build number 406 originally caused by: Started by upstream project "libvirt-go-xml-master-build" build number 414 originally caused by: Started by upstream project "libvirt-master-build" build number 1464 originally caused by: Started by an SCM change [EnvInject] - Loading node environment variables. Building remotely on libvirt-fedora-27 (libvirt) in workspace <https://ci.centos.org/job/libvirt-go-xml-master-check/systems=libvirt-fedora-27/ws/> [libvirt-go-xml-master] $ /bin/sh -xe /tmp/jenkins4922446432904635769.sh + export 'TEST_ARGS=-tags xmlroundtrip' + TEST_ARGS='-tags xmlroundtrip' + go test -tags xmlroundtrip --- FAIL: TestRoundTrip (7.91s) xml_test.go:383: testdata/libvirt/tests/capabilityschemadata/caps-test2.xml: /capabilities[0]/host[0]/cpu[0]/microcode[0]: element in expected XML missing in actual XML FAIL exit status 1 FAIL _<https://ci.centos.org/job/libvirt-go-xml-master-check/systems=libvirt-fedora-27/ws/> 8.181s Build step 'Execute shell' marked build as failure

See <https://ci.centos.org/job/libvirt-go-xml-master-check/systems=libvirt-fedora-27/407/display/redirect> ------------------------------------------ Started by upstream project "libvirt-go-xml-master-check" build number 407 originally caused by: Started by upstream project "libvirt-go-xml-master-build" build number 415 originally caused by: Started by upstream project "libvirt-master-build" build number 1465 originally caused by: Started by an SCM change [EnvInject] - Loading node environment variables. Building remotely on libvirt-fedora-27 (libvirt) in workspace <https://ci.centos.org/job/libvirt-go-xml-master-check/systems=libvirt-fedora-27/ws/> [libvirt-go-xml-master] $ /bin/sh -xe /tmp/jenkins3174572944190044576.sh + export 'TEST_ARGS=-tags xmlroundtrip' + TEST_ARGS='-tags xmlroundtrip' + go test -tags xmlroundtrip --- FAIL: TestRoundTrip (8.32s) xml_test.go:383: testdata/libvirt/tests/capabilityschemadata/caps-test2.xml: /capabilities[0]/host[0]/cpu[0]/microcode[0]: element in expected XML missing in actual XML FAIL exit status 1 FAIL _<https://ci.centos.org/job/libvirt-go-xml-master-check/systems=libvirt-fedora-27/ws/> 8.478s Build step 'Execute shell' marked build as failure

See <https://ci.centos.org/job/libvirt-go-xml-master-check/systems=libvirt-fedora-27/408/display/redirect> ------------------------------------------ Started by upstream project "libvirt-go-xml-master-check" build number 408 originally caused by: Started by upstream project "libvirt-go-xml-master-build" build number 416 originally caused by: Started by upstream project "libvirt-master-build" build number 1466 originally caused by: Started by an SCM change [EnvInject] - Loading node environment variables. Building remotely on libvirt-fedora-27 (libvirt) in workspace <https://ci.centos.org/job/libvirt-go-xml-master-check/systems=libvirt-fedora-27/ws/> [libvirt-go-xml-master] $ /bin/sh -xe /tmp/jenkins6212717658449297563.sh + export 'TEST_ARGS=-tags xmlroundtrip' + TEST_ARGS='-tags xmlroundtrip' + go test -tags xmlroundtrip --- FAIL: TestRoundTrip (8.92s) xml_test.go:383: testdata/libvirt/tests/capabilityschemadata/caps-test2.xml: /capabilities[0]/host[0]/cpu[0]/microcode[0]: element in expected XML missing in actual XML FAIL exit status 1 FAIL _<https://ci.centos.org/job/libvirt-go-xml-master-check/systems=libvirt-fedora-27/ws/> 8.993s Build step 'Execute shell' marked build as failure

See <https://ci.centos.org/job/libvirt-go-xml-master-check/systems=libvirt-fedora-27/409/display/redirect> ------------------------------------------ Started by upstream project "libvirt-go-xml-master-check" build number 409 originally caused by: Started by upstream project "libvirt-go-xml-master-build" build number 417 originally caused by: Started by upstream project "libvirt-master-build" build number 1467 originally caused by: Started by an SCM change Started by an SCM change [EnvInject] - Loading node environment variables. Building remotely on libvirt-fedora-27 (libvirt) in workspace <https://ci.centos.org/job/libvirt-go-xml-master-check/systems=libvirt-fedora-27/ws/> [libvirt-go-xml-master] $ /bin/sh -xe /tmp/jenkins1264808499720006281.sh + export 'TEST_ARGS=-tags xmlroundtrip' + TEST_ARGS='-tags xmlroundtrip' + go test -tags xmlroundtrip --- FAIL: TestRoundTrip (6.73s) xml_test.go:383: testdata/libvirt/tests/capabilityschemadata/caps-test2.xml: /capabilities[0]/host[0]/cpu[0]/microcode[0]: element in expected XML missing in actual XML FAIL exit status 1 FAIL _<https://ci.centos.org/job/libvirt-go-xml-master-check/systems=libvirt-fedora-27/ws/> 6.916s Build step 'Execute shell' marked build as failure

See <https://ci.centos.org/job/libvirt-go-xml-master-check/systems=libvirt-fedora-27/410/display/redirect> ------------------------------------------ Started by upstream project "libvirt-go-xml-master-check" build number 410 originally caused by: Started by upstream project "libvirt-go-xml-master-build" build number 418 originally caused by: Started by upstream project "libvirt-master-build" build number 1468 originally caused by: Started by an SCM change [EnvInject] - Loading node environment variables. Building remotely on libvirt-fedora-27 (libvirt) in workspace <https://ci.centos.org/job/libvirt-go-xml-master-check/systems=libvirt-fedora-27/ws/> [libvirt-go-xml-master] $ /bin/sh -xe /tmp/jenkins5457818409317485304.sh + export 'TEST_ARGS=-tags xmlroundtrip' + TEST_ARGS='-tags xmlroundtrip' + go test -tags xmlroundtrip --- FAIL: TestRoundTrip (7.14s) xml_test.go:383: testdata/libvirt/tests/capabilityschemadata/caps-test2.xml: /capabilities[0]/host[0]/cpu[0]/microcode[0]: element in expected XML missing in actual XML FAIL exit status 1 FAIL _<https://ci.centos.org/job/libvirt-go-xml-master-check/systems=libvirt-fedora-27/ws/> 7.422s Build step 'Execute shell' marked build as failure

See <https://ci.centos.org/job/libvirt-go-xml-master-check/systems=libvirt-fedora-27/411/display/redirect> ------------------------------------------ Started by upstream project "libvirt-go-xml-master-check" build number 411 originally caused by: Started by upstream project "libvirt-go-xml-master-build" build number 419 originally caused by: Started by upstream project "libvirt-master-build" build number 1469 originally caused by: Started by an SCM change [EnvInject] - Loading node environment variables. Building remotely on libvirt-fedora-27 (libvirt) in workspace <https://ci.centos.org/job/libvirt-go-xml-master-check/systems=libvirt-fedora-27/ws/> [libvirt-go-xml-master] $ /bin/sh -xe /tmp/jenkins7360403778136093436.sh + export 'TEST_ARGS=-tags xmlroundtrip' + TEST_ARGS='-tags xmlroundtrip' + go test -tags xmlroundtrip --- FAIL: TestRoundTrip (5.58s) xml_test.go:383: testdata/libvirt/tests/capabilityschemadata/caps-test2.xml: /capabilities[0]/host[0]/cpu[0]/microcode[0]: element in expected XML missing in actual XML FAIL exit status 1 FAIL _<https://ci.centos.org/job/libvirt-go-xml-master-check/systems=libvirt-fedora-27/ws/> 5.681s Build step 'Execute shell' marked build as failure

See <https://ci.centos.org/job/libvirt-go-xml-master-check/systems=libvirt-fedora-27/412/display/redirect> ------------------------------------------ Started by upstream project "libvirt-go-xml-master-check" build number 412 originally caused by: Started by upstream project "libvirt-go-xml-master-build" build number 420 originally caused by: Started by upstream project "libvirt-master-build" build number 1470 originally caused by: Started by an SCM change [EnvInject] - Loading node environment variables. Building remotely on libvirt-fedora-27 (libvirt) in workspace <https://ci.centos.org/job/libvirt-go-xml-master-check/systems=libvirt-fedora-27/ws/> [libvirt-go-xml-master] $ /bin/sh -xe /tmp/jenkins2289461784061638880.sh + export 'TEST_ARGS=-tags xmlroundtrip' + TEST_ARGS='-tags xmlroundtrip' + go test -tags xmlroundtrip --- FAIL: TestRoundTrip (9.19s) xml_test.go:383: testdata/libvirt/tests/capabilityschemadata/caps-test2.xml: /capabilities[0]/host[0]/cpu[0]/microcode[0]: element in expected XML missing in actual XML FAIL exit status 1 FAIL _<https://ci.centos.org/job/libvirt-go-xml-master-check/systems=libvirt-fedora-27/ws/> 9.315s Build step 'Execute shell' marked build as failure

See <https://ci.centos.org/job/libvirt-go-xml-master-check/systems=libvirt-fedora-27/413/display/redirect> ------------------------------------------ Started by upstream project "libvirt-go-xml-master-check" build number 413 originally caused by: Started by upstream project "libvirt-go-xml-master-build" build number 421 originally caused by: Started by upstream project "libvirt-master-build" build number 1471 originally caused by: Started by an SCM change Started by an SCM change [EnvInject] - Loading node environment variables. Building remotely on libvirt-fedora-27 (libvirt) in workspace <https://ci.centos.org/job/libvirt-go-xml-master-check/systems=libvirt-fedora-27/ws/> [libvirt-go-xml-master] $ /bin/sh -xe /tmp/jenkins8509777983754875539.sh + export 'TEST_ARGS=-tags xmlroundtrip' + TEST_ARGS='-tags xmlroundtrip' + go test -tags xmlroundtrip --- FAIL: TestRoundTrip (1.76s) xml_test.go:383: testdata/libvirt/tests/capabilityschemadata/caps-test2.xml: /capabilities[0]/host[0]/cpu[0]/microcode[0]: element in expected XML missing in actual XML FAIL exit status 1 FAIL _<https://ci.centos.org/job/libvirt-go-xml-master-check/systems=libvirt-fedora-27/ws/> 1.947s Build step 'Execute shell' marked build as failure

See <https://ci.centos.org/job/libvirt-go-xml-master-check/systems=libvirt-fedora-27/414/display/redirect> ------------------------------------------ Started by upstream project "libvirt-go-xml-master-check" build number 414 originally caused by: Started by upstream project "libvirt-go-xml-master-build" build number 422 originally caused by: Started by upstream project "libvirt-master-build" build number 1472 originally caused by: Started by an SCM change [EnvInject] - Loading node environment variables. Building remotely on libvirt-fedora-27 (libvirt) in workspace <https://ci.centos.org/job/libvirt-go-xml-master-check/systems=libvirt-fedora-27/ws/> [libvirt-go-xml-master] $ /bin/sh -xe /tmp/jenkins8527228998958869065.sh + export 'TEST_ARGS=-tags xmlroundtrip' + TEST_ARGS='-tags xmlroundtrip' + go test -tags xmlroundtrip --- FAIL: TestRoundTrip (5.24s) xml_test.go:383: testdata/libvirt/tests/capabilityschemadata/caps-test2.xml: /capabilities[0]/host[0]/cpu[0]/microcode[0]: element in expected XML missing in actual XML FAIL exit status 1 FAIL _<https://ci.centos.org/job/libvirt-go-xml-master-check/systems=libvirt-fedora-27/ws/> 5.513s Build step 'Execute shell' marked build as failure

See <https://ci.centos.org/job/libvirt-go-xml-master-check/systems=libvirt-fedora-27/415/display/redirect> ------------------------------------------ Started by upstream project "libvirt-go-xml-master-check" build number 415 originally caused by: Started by upstream project "libvirt-go-xml-master-build" build number 423 originally caused by: Started by upstream project "libvirt-master-build" build number 1473 originally caused by: Started by an SCM change [EnvInject] - Loading node environment variables. Building remotely on libvirt-fedora-27 (libvirt) in workspace <https://ci.centos.org/job/libvirt-go-xml-master-check/systems=libvirt-fedora-27/ws/> [libvirt-go-xml-master] $ /bin/sh -xe /tmp/jenkins1910433418483350147.sh + export 'TEST_ARGS=-tags xmlroundtrip' + TEST_ARGS='-tags xmlroundtrip' + go test -tags xmlroundtrip --- FAIL: TestRoundTrip (6.15s) xml_test.go:383: testdata/libvirt/tests/capabilityschemadata/caps-test2.xml: /capabilities[0]/host[0]/cpu[0]/microcode[0]: element in expected XML missing in actual XML FAIL exit status 1 FAIL _<https://ci.centos.org/job/libvirt-go-xml-master-check/systems=libvirt-fedora-27/ws/> 6.244s Build step 'Execute shell' marked build as failure

See <https://ci.centos.org/job/libvirt-go-xml-master-check/systems=libvirt-fedora-27/416/display/redirect> ------------------------------------------ Started by upstream project "libvirt-go-xml-master-check" build number 416 originally caused by: Started by upstream project "libvirt-go-xml-master-build" build number 424 originally caused by: Started by upstream project "libvirt-master-build" build number 1474 originally caused by: Started by an SCM change Started by an SCM change Started by an SCM change [EnvInject] - Loading node environment variables. Building remotely on libvirt-fedora-27 (libvirt) in workspace <https://ci.centos.org/job/libvirt-go-xml-master-check/systems=libvirt-fedora-27/ws/> [libvirt-go-xml-master] $ /bin/sh -xe /tmp/jenkins3089360512300571334.sh + export 'TEST_ARGS=-tags xmlroundtrip' + TEST_ARGS='-tags xmlroundtrip' + go test -tags xmlroundtrip --- FAIL: TestRoundTrip (2.42s) xml_test.go:383: testdata/libvirt/tests/capabilityschemadata/caps-test2.xml: /capabilities[0]/host[0]/cpu[0]/microcode[0]: element in expected XML missing in actual XML FAIL exit status 1 FAIL _<https://ci.centos.org/job/libvirt-go-xml-master-check/systems=libvirt-fedora-27/ws/> 2.565s Build step 'Execute shell' marked build as failure

See <https://ci.centos.org/job/libvirt-go-xml-master-check/systems=libvirt-fedora-27/417/display/redirect> ------------------------------------------ Started by upstream project "libvirt-go-xml-master-check" build number 417 originally caused by: Started by upstream project "libvirt-go-xml-master-build" build number 425 originally caused by: Started by upstream project "libvirt-master-build" build number 1475 originally caused by: Started by an SCM change [EnvInject] - Loading node environment variables. Building remotely on libvirt-fedora-27 (libvirt) in workspace <https://ci.centos.org/job/libvirt-go-xml-master-check/systems=libvirt-fedora-27/ws/> [libvirt-go-xml-master] $ /bin/sh -xe /tmp/jenkins5433608934798120538.sh + export 'TEST_ARGS=-tags xmlroundtrip' + TEST_ARGS='-tags xmlroundtrip' + go test -tags xmlroundtrip --- FAIL: TestRoundTrip (7.36s) xml_test.go:383: testdata/libvirt/tests/capabilityschemadata/caps-test2.xml: /capabilities[0]/host[0]/cpu[0]/microcode[0]: element in expected XML missing in actual XML FAIL exit status 1 FAIL _<https://ci.centos.org/job/libvirt-go-xml-master-check/systems=libvirt-fedora-27/ws/> 7.528s Build step 'Execute shell' marked build as failure

See <https://ci.centos.org/job/libvirt-go-xml-master-check/systems=libvirt-fedora-27/418/display/redirect> ------------------------------------------ Started by upstream project "libvirt-go-xml-master-check" build number 418 originally caused by: Started by upstream project "libvirt-go-xml-master-build" build number 426 originally caused by: Started by upstream project "libvirt-master-build" build number 1476 originally caused by: Started by an SCM change [EnvInject] - Loading node environment variables. Building remotely on libvirt-fedora-27 (libvirt) in workspace <https://ci.centos.org/job/libvirt-go-xml-master-check/systems=libvirt-fedora-27/ws/> [libvirt-go-xml-master] $ /bin/sh -xe /tmp/jenkins4870278207889065921.sh + export 'TEST_ARGS=-tags xmlroundtrip' + TEST_ARGS='-tags xmlroundtrip' + go test -tags xmlroundtrip --- FAIL: TestRoundTrip (5.63s) xml_test.go:383: testdata/libvirt/tests/capabilityschemadata/caps-test2.xml: /capabilities[0]/host[0]/cpu[0]/microcode[0]: element in expected XML missing in actual XML FAIL exit status 1 FAIL _<https://ci.centos.org/job/libvirt-go-xml-master-check/systems=libvirt-fedora-27/ws/> 5.734s Build step 'Execute shell' marked build as failure

See <https://ci.centos.org/job/libvirt-go-xml-master-check/systems=libvirt-fedora-27/419/display/redirect> ------------------------------------------ Started by upstream project "libvirt-go-xml-master-check" build number 419 originally caused by: Started by upstream project "libvirt-go-xml-master-build" build number 427 originally caused by: Started by upstream project "libvirt-master-build" build number 1477 originally caused by: Started by an SCM change Started by an SCM change Started by an SCM change [EnvInject] - Loading node environment variables. Building remotely on libvirt-fedora-27 (libvirt) in workspace <https://ci.centos.org/job/libvirt-go-xml-master-check/systems=libvirt-fedora-27/ws/> [libvirt-go-xml-master] $ /bin/sh -xe /tmp/jenkins3677018072795677852.sh + export 'TEST_ARGS=-tags xmlroundtrip' + TEST_ARGS='-tags xmlroundtrip' + go test -tags xmlroundtrip --- FAIL: TestRoundTrip (7.18s) xml_test.go:383: testdata/libvirt/tests/capabilityschemadata/caps-test2.xml: /capabilities[0]/host[0]/cpu[0]/microcode[0]: element in expected XML missing in actual XML FAIL exit status 1 FAIL _<https://ci.centos.org/job/libvirt-go-xml-master-check/systems=libvirt-fedora-27/ws/> 7.264s Build step 'Execute shell' marked build as failure

See <https://ci.centos.org/job/libvirt-go-xml-master-check/systems=libvirt-fedora-27/420/display/redirect> ------------------------------------------ Started by upstream project "libvirt-go-xml-master-check" build number 420 originally caused by: Started by upstream project "libvirt-go-xml-master-build" build number 428 originally caused by: Started by upstream project "libvirt-master-build" build number 1478 originally caused by: Started by an SCM change [EnvInject] - Loading node environment variables. Building remotely on libvirt-fedora-27 (libvirt) in workspace <https://ci.centos.org/job/libvirt-go-xml-master-check/systems=libvirt-fedora-27/ws/> [libvirt-go-xml-master] $ /bin/sh -xe /tmp/jenkins6521118777267558646.sh + export 'TEST_ARGS=-tags xmlroundtrip' + TEST_ARGS='-tags xmlroundtrip' + go test -tags xmlroundtrip --- FAIL: TestRoundTrip (6.31s) xml_test.go:383: testdata/libvirt/tests/capabilityschemadata/caps-test2.xml: /capabilities[0]/host[0]/cpu[0]/microcode[0]: element in expected XML missing in actual XML FAIL exit status 1 FAIL _<https://ci.centos.org/job/libvirt-go-xml-master-check/systems=libvirt-fedora-27/ws/> 6.393s Build step 'Execute shell' marked build as failure

See <https://ci.centos.org/job/libvirt-go-xml-master-check/systems=libvirt-fedora-27/421/display/redirect> ------------------------------------------ Started by upstream project "libvirt-go-xml-master-check" build number 421 originally caused by: Started by upstream project "libvirt-go-xml-master-build" build number 429 originally caused by: Started by upstream project "libvirt-master-build" build number 1479 originally caused by: Started by an SCM change [EnvInject] - Loading node environment variables. Building remotely on libvirt-fedora-27 (libvirt) in workspace <https://ci.centos.org/job/libvirt-go-xml-master-check/systems=libvirt-fedora-27/ws/> [libvirt-go-xml-master] $ /bin/sh -xe /tmp/jenkins8208951375500316063.sh + export 'TEST_ARGS=-tags xmlroundtrip' + TEST_ARGS='-tags xmlroundtrip' + go test -tags xmlroundtrip --- FAIL: TestRoundTrip (5.54s) xml_test.go:383: testdata/libvirt/tests/capabilityschemadata/caps-test2.xml: /capabilities[0]/host[0]/cpu[0]/microcode[0]: element in expected XML missing in actual XML FAIL exit status 1 FAIL _<https://ci.centos.org/job/libvirt-go-xml-master-check/systems=libvirt-fedora-27/ws/> 5.807s Build step 'Execute shell' marked build as failure

See <https://ci.centos.org/job/libvirt-go-xml-master-check/systems=libvirt-fedora-27/422/display/redirect> ------------------------------------------ Started by upstream project "libvirt-go-xml-master-check" build number 422 originally caused by: Started by upstream project "libvirt-go-xml-master-build" build number 430 originally caused by: Started by upstream project "libvirt-master-build" build number 1480 originally caused by: Started by an SCM change [EnvInject] - Loading node environment variables. Building remotely on libvirt-fedora-27 (libvirt) in workspace <https://ci.centos.org/job/libvirt-go-xml-master-check/systems=libvirt-fedora-27/ws/> [libvirt-go-xml-master] $ /bin/sh -xe /tmp/jenkins1867613050966230905.sh + export 'TEST_ARGS=-tags xmlroundtrip' + TEST_ARGS='-tags xmlroundtrip' + go test -tags xmlroundtrip --- FAIL: TestRoundTrip (6.21s) xml_test.go:383: testdata/libvirt/tests/capabilityschemadata/caps-test2.xml: /capabilities[0]/host[0]/cpu[0]/microcode[0]: element in expected XML missing in actual XML FAIL exit status 1 FAIL _<https://ci.centos.org/job/libvirt-go-xml-master-check/systems=libvirt-fedora-27/ws/> 6.318s Build step 'Execute shell' marked build as failure

See <https://ci.centos.org/job/libvirt-go-xml-master-check/systems=libvirt-fedora-27/423/display/redirect> ------------------------------------------ Started by upstream project "libvirt-go-xml-master-check" build number 423 originally caused by: Started by upstream project "libvirt-go-xml-master-build" build number 431 originally caused by: Started by upstream project "libvirt-master-build" build number 1481 originally caused by: Started by an SCM change Started by an SCM change [EnvInject] - Loading node environment variables. Building remotely on libvirt-fedora-27 (libvirt) in workspace <https://ci.centos.org/job/libvirt-go-xml-master-check/systems=libvirt-fedora-27/ws/> [libvirt-go-xml-master] $ /bin/sh -xe /tmp/jenkins5543640792889834388.sh + export 'TEST_ARGS=-tags xmlroundtrip' + TEST_ARGS='-tags xmlroundtrip' + go test -tags xmlroundtrip --- FAIL: TestRoundTrip (2.94s) xml_test.go:383: testdata/libvirt/tests/capabilityschemadata/caps-test2.xml: /capabilities[0]/host[0]/cpu[0]/microcode[0]: element in expected XML missing in actual XML FAIL exit status 1 FAIL _<https://ci.centos.org/job/libvirt-go-xml-master-check/systems=libvirt-fedora-27/ws/> 3.111s Build step 'Execute shell' marked build as failure

participants (1)
-
ci@centos.org