[Libvirt-ci] Build failed in Jenkins: libvirt-go-xml-check » libvirt-fedora-rawhide #304

See <https://ci.centos.org/job/libvirt-go-xml-check/systems=libvirt-fedora-rawhide/304/display/redirect> ------------------------------------------ Started by upstream project "libvirt-go-xml-check" build number 304 originally caused by: Started by upstream project "libvirt-go-xml-build" build number 304 originally caused by: Started by upstream project "libvirt-build" build number 370 originally caused by: Started by an SCM change Started by an SCM change Started by an SCM change Started by an SCM change [EnvInject] - Loading node environment variables. Building remotely on libvirt-fedora-rawhide (libvirt) in workspace <https://ci.centos.org/job/libvirt-go-xml-check/systems=libvirt-fedora-rawhide/ws/> [libvirt-go-xml] $ /bin/sh -xe /tmp/jenkins6419206165426909399.sh + export 'TEST_ARGS=-tags xmlroundtrip' + TEST_ARGS='-tags xmlroundtrip' + go test -tags xmlroundtrip --- FAIL: TestRoundTrip (11.92s) xml_test.go:400: testdata/libvirt/tests/qemuxml2argvdata/aarch64-virt-graphics.xml: /domain[0]/devices[0]/channel[0]/source[0]: element in expected XML missing in actual XML FAIL exit status 1 FAIL _<https://ci.centos.org/job/libvirt-go-xml-check/systems=libvirt-fedora-rawhide/ws/> 12.059s Build step 'Execute shell' marked build as failure

See <https://ci.centos.org/job/libvirt-go-xml-check/systems=libvirt-fedora-rawhide/305/display/redirect> ------------------------------------------ Started by upstream project "libvirt-go-xml-check" build number 305 originally caused by: Started by upstream project "libvirt-go-xml-build" build number 305 originally caused by: Started by upstream project "libvirt-build" build number 371 originally caused by: Started by an SCM change [EnvInject] - Loading node environment variables. Building remotely on libvirt-fedora-rawhide (libvirt) in workspace <https://ci.centos.org/job/libvirt-go-xml-check/systems=libvirt-fedora-rawhide/ws/> [libvirt-go-xml] $ /bin/sh -xe /tmp/jenkins2179772359908860205.sh + export 'TEST_ARGS=-tags xmlroundtrip' + TEST_ARGS='-tags xmlroundtrip' + go test -tags xmlroundtrip --- FAIL: TestRoundTrip (22.40s) xml_test.go:400: testdata/libvirt/tests/qemuxml2argvdata/aarch64-virt-graphics.xml: /domain[0]/devices[0]/channel[0]/source[0]: element in expected XML missing in actual XML FAIL exit status 1 FAIL _<https://ci.centos.org/job/libvirt-go-xml-check/systems=libvirt-fedora-rawhide/ws/> 22.674s Build step 'Execute shell' marked build as failure

See <https://ci.centos.org/job/libvirt-go-xml-check/systems=libvirt-fedora-rawhide/306/display/redirect> ------------------------------------------ Started by upstream project "libvirt-go-xml-check" build number 306 originally caused by: Started by upstream project "libvirt-go-xml-build" build number 306 originally caused by: Started by upstream project "libvirt-build" build number 372 originally caused by: Started by an SCM change [EnvInject] - Loading node environment variables. Building remotely on libvirt-fedora-rawhide (libvirt) in workspace <https://ci.centos.org/job/libvirt-go-xml-check/systems=libvirt-fedora-rawhide/ws/> [libvirt-go-xml] $ /bin/sh -xe /tmp/jenkins2037396576595370949.sh + export 'TEST_ARGS=-tags xmlroundtrip' + TEST_ARGS='-tags xmlroundtrip' + go test -tags xmlroundtrip --- FAIL: TestRoundTrip (10.62s) xml_test.go:400: testdata/libvirt/tests/qemuxml2argvdata/aarch64-virt-graphics.xml: /domain[0]/devices[0]/channel[0]/source[0]: element in expected XML missing in actual XML FAIL exit status 1 FAIL _<https://ci.centos.org/job/libvirt-go-xml-check/systems=libvirt-fedora-rawhide/ws/> 10.840s Build step 'Execute shell' marked build as failure

See <https://ci.centos.org/job/libvirt-go-xml-check/systems=libvirt-fedora-rawhide/307/display/redirect> ------------------------------------------ Started by upstream project "libvirt-go-xml-check" build number 307 originally caused by: Started by upstream project "libvirt-go-xml-build" build number 307 originally caused by: Started by upstream project "libvirt-build" build number 373 originally caused by: Started by an SCM change [EnvInject] - Loading node environment variables. Building remotely on libvirt-fedora-rawhide (libvirt) in workspace <https://ci.centos.org/job/libvirt-go-xml-check/systems=libvirt-fedora-rawhide/ws/> [libvirt-go-xml] $ /bin/sh -xe /tmp/jenkins8330601352361845702.sh + export 'TEST_ARGS=-tags xmlroundtrip' + TEST_ARGS='-tags xmlroundtrip' + go test -tags xmlroundtrip --- FAIL: TestRoundTrip (12.42s) xml_test.go:400: testdata/libvirt/tests/qemuxml2argvdata/aarch64-virt-graphics.xml: /domain[0]/devices[0]/channel[0]/source[0]: element in expected XML missing in actual XML FAIL exit status 1 FAIL _<https://ci.centos.org/job/libvirt-go-xml-check/systems=libvirt-fedora-rawhide/ws/> 12.574s Build step 'Execute shell' marked build as failure

See <https://ci.centos.org/job/libvirt-go-xml-check/systems=libvirt-fedora-rawhide/308/display/redirect> ------------------------------------------ Started by upstream project "libvirt-go-xml-check" build number 308 originally caused by: Started by upstream project "libvirt-go-xml-build" build number 308 originally caused by: Started by upstream project "libvirt-build" build number 374 originally caused by: Started by an SCM change Started by an SCM change Started by an SCM change Started by an SCM change [EnvInject] - Loading node environment variables. Building remotely on libvirt-fedora-rawhide (libvirt) in workspace <https://ci.centos.org/job/libvirt-go-xml-check/systems=libvirt-fedora-rawhide/ws/> [libvirt-go-xml] $ /bin/sh -xe /tmp/jenkins8454124285235724451.sh + export 'TEST_ARGS=-tags xmlroundtrip' + TEST_ARGS='-tags xmlroundtrip' + go test -tags xmlroundtrip --- FAIL: TestRoundTrip (14.29s) xml_test.go:400: testdata/libvirt/tests/qemuxml2argvdata/aarch64-os-firmware-efi.xml: /domain[0]/os[0]/@firmware: attribute 'efi' in expected XML missing in actual XML FAIL exit status 1 FAIL _<https://ci.centos.org/job/libvirt-go-xml-check/systems=libvirt-fedora-rawhide/ws/> 14.470s Build step 'Execute shell' marked build as failure

See <https://ci.centos.org/job/libvirt-go-xml-check/systems=libvirt-fedora-rawhide/309/display/redirect> ------------------------------------------ Started by upstream project "libvirt-go-xml-check" build number 309 originally caused by: Started by upstream project "libvirt-go-xml-build" build number 309 originally caused by: Started by upstream project "libvirt-build" build number 375 originally caused by: Started by an SCM change Started by an SCM change Started by an SCM change Started by an SCM change Started by an SCM change Started by an SCM change [EnvInject] - Loading node environment variables. Building remotely on libvirt-fedora-rawhide (libvirt) in workspace <https://ci.centos.org/job/libvirt-go-xml-check/systems=libvirt-fedora-rawhide/ws/> [libvirt-go-xml] $ /bin/sh -xe /tmp/jenkins3948133387877430563.sh + export 'TEST_ARGS=-tags xmlroundtrip' + TEST_ARGS='-tags xmlroundtrip' + go test -tags xmlroundtrip --- FAIL: TestRoundTrip (19.70s) xml_test.go:400: testdata/libvirt/tests/qemuxml2argvdata/aarch64-os-firmware-efi.xml: /domain[0]/os[0]/@firmware: attribute 'efi' in expected XML missing in actual XML FAIL exit status 1 FAIL _<https://ci.centos.org/job/libvirt-go-xml-check/systems=libvirt-fedora-rawhide/ws/> 19.822s Build step 'Execute shell' marked build as failure

See <https://ci.centos.org/job/libvirt-go-xml-check/systems=libvirt-fedora-rawhide/310/display/redirect> ------------------------------------------ Started by upstream project "libvirt-go-xml-check" build number 310 originally caused by: Started by upstream project "libvirt-go-xml-build" build number 310 originally caused by: Started by an SCM change [EnvInject] - Loading node environment variables. Building remotely on libvirt-fedora-rawhide (libvirt) in workspace <https://ci.centos.org/job/libvirt-go-xml-check/systems=libvirt-fedora-rawhide/ws/> [libvirt-go-xml] $ /bin/sh -xe /tmp/jenkins7107704754897572474.sh + export 'TEST_ARGS=-tags xmlroundtrip' + TEST_ARGS='-tags xmlroundtrip' + go test -tags xmlroundtrip --- FAIL: TestRoundTrip (7.88s) xml_test.go:400: testdata/libvirt/tests/qemuxml2argvdata/aarch64-virt-graphics.xml: /domain[0]/devices[0]/channel[0]/source[0]: element in expected XML missing in actual XML FAIL exit status 1 FAIL _<https://ci.centos.org/job/libvirt-go-xml-check/systems=libvirt-fedora-rawhide/ws/> 7.956s Build step 'Execute shell' marked build as failure

See <https://ci.centos.org/job/libvirt-go-xml-check/systems=libvirt-fedora-rawhide/311/display/redirect> ------------------------------------------ Started by upstream project "libvirt-go-xml-check" build number 311 originally caused by: Started by upstream project "libvirt-go-xml-build" build number 311 originally caused by: Started by an SCM change [EnvInject] - Loading node environment variables. Building remotely on libvirt-fedora-rawhide (libvirt) in workspace <https://ci.centos.org/job/libvirt-go-xml-check/systems=libvirt-fedora-rawhide/ws/> [libvirt-go-xml] $ /bin/sh -xe /tmp/jenkins165981520577833412.sh + export 'TEST_ARGS=-tags xmlroundtrip' + TEST_ARGS='-tags xmlroundtrip' + go test -tags xmlroundtrip --- FAIL: TestRoundTrip (17.28s) xml_test.go:400: testdata/libvirt/tests/qemuxml2argvdata/aarch64-virt-graphics.xml: /domain[0]/devices[0]/channel[0]/source[0]: element in expected XML missing in actual XML FAIL exit status 1 FAIL _<https://ci.centos.org/job/libvirt-go-xml-check/systems=libvirt-fedora-rawhide/ws/> 17.618s Build step 'Execute shell' marked build as failure

See <https://ci.centos.org/job/libvirt-go-xml-check/systems=libvirt-fedora-rawhide/312/display/redirect> ------------------------------------------ Started by upstream project "libvirt-go-xml-check" build number 312 originally caused by: Started by upstream project "libvirt-go-xml-build" build number 312 originally caused by: Started by upstream project "libvirt-build" build number 377 originally caused by: Started by an SCM change [EnvInject] - Loading node environment variables. Building remotely on libvirt-fedora-rawhide (libvirt) in workspace <https://ci.centos.org/job/libvirt-go-xml-check/systems=libvirt-fedora-rawhide/ws/> [libvirt-go-xml] $ /bin/sh -xe /tmp/jenkins2842624714633598068.sh + export 'TEST_ARGS=-tags xmlroundtrip' + TEST_ARGS='-tags xmlroundtrip' + go test -tags xmlroundtrip --- FAIL: TestRoundTrip (4.98s) xml_test.go:400: testdata/libvirt/tests/qemuxml2argvdata/aarch64-virt-graphics.xml: /domain[0]/devices[0]/channel[0]/source[0]: element in expected XML missing in actual XML FAIL exit status 1 FAIL _<https://ci.centos.org/job/libvirt-go-xml-check/systems=libvirt-fedora-rawhide/ws/> 5.088s Build step 'Execute shell' marked build as failure

participants (1)
-
ci@centos.org