[Libvirt-ci] Build failed in Jenkins: libvirt-go-xml-check » libvirt-debian-8 #222

See <https://ci.centos.org/job/libvirt-go-xml-check/systems=libvirt-debian-8/222/display/redirect> ------------------------------------------ Started by upstream project "libvirt-go-xml-check" build number 222 originally caused by: Started by upstream project "libvirt-go-xml-build" build number 222 originally caused by: Started by upstream project "libvirt-build" build number 280 originally caused by: Started by an SCM change Started by an SCM change Started by an SCM change [EnvInject] - Loading node environment variables. Building remotely on libvirt-debian-8 (libvirt) in workspace <https://ci.centos.org/job/libvirt-go-xml-check/systems=libvirt-debian-8/ws/> [libvirt-go-xml] $ /bin/sh -xe /tmp/jenkins804672907747200270.sh + export TEST_ARGS=-tags xmlroundtrip + go test -tags xmlroundtrip --- FAIL: TestRoundTrip (22.42s) xml_test.go:400: testdata/libvirt/tests/networkxml2xmlin/routed-network.xml: /network[0]/bridge[0]/@zone: attribute 'myzone' in expected XML missing in actual XML FAIL exit status 1 FAIL _<https://ci.centos.org/job/libvirt-go-xml-check/systems=libvirt-debian-8/ws/> 22.599s Build step 'Execute shell' marked build as failure

See <https://ci.centos.org/job/libvirt-go-xml-check/systems=libvirt-debian-8/223/display/redirect> ------------------------------------------ Started by upstream project "libvirt-go-xml-check" build number 223 originally caused by: Started by upstream project "libvirt-go-xml-build" build number 223 originally caused by: Started by upstream project "libvirt-build" build number 281 originally caused by: Started by an SCM change Started by an SCM change Started by an SCM change Started by an SCM change Started by an SCM change Started by an SCM change Started by an SCM change Started by an SCM change [EnvInject] - Loading node environment variables. Building remotely on libvirt-debian-8 (libvirt) in workspace <https://ci.centos.org/job/libvirt-go-xml-check/systems=libvirt-debian-8/ws/> [libvirt-go-xml] $ /bin/sh -xe /tmp/jenkins3122443335111677037.sh + export TEST_ARGS=-tags xmlroundtrip + go test -tags xmlroundtrip --- FAIL: TestRoundTrip (4.23s) xml_test.go:400: testdata/libvirt/tests/networkxml2xmlin/routed-network.xml: /network[0]/bridge[0]/@zone: attribute 'myzone' in expected XML missing in actual XML FAIL exit status 1 FAIL _<https://ci.centos.org/job/libvirt-go-xml-check/systems=libvirt-debian-8/ws/> 4.344s Build step 'Execute shell' marked build as failure

See <https://ci.centos.org/job/libvirt-go-xml-check/systems=libvirt-debian-8/224/display/redirect> ------------------------------------------ Started by upstream project "libvirt-go-xml-check" build number 224 originally caused by: Started by upstream project "libvirt-go-xml-build" build number 224 originally caused by: Started by upstream project "libvirt-build" build number 282 originally caused by: Started by an SCM change [EnvInject] - Loading node environment variables. Building remotely on libvirt-debian-8 (libvirt) in workspace <https://ci.centos.org/job/libvirt-go-xml-check/systems=libvirt-debian-8/ws/> [libvirt-go-xml] $ /bin/sh -xe /tmp/jenkins3992752003319885341.sh + export TEST_ARGS=-tags xmlroundtrip + go test -tags xmlroundtrip --- FAIL: TestRoundTrip (13.68s) xml_test.go:400: testdata/libvirt/tests/networkxml2xmlin/routed-network.xml: /network[0]/bridge[0]/@zone: attribute 'myzone' in expected XML missing in actual XML FAIL exit status 1 FAIL _<https://ci.centos.org/job/libvirt-go-xml-check/systems=libvirt-debian-8/ws/> 13.855s Build step 'Execute shell' marked build as failure

See <https://ci.centos.org/job/libvirt-go-xml-check/systems=libvirt-debian-8/225/display/redirect> ------------------------------------------ Started by upstream project "libvirt-go-xml-check" build number 225 originally caused by: Started by upstream project "libvirt-go-xml-build" build number 225 originally caused by: Started by upstream project "libvirt-build" build number 284 originally caused by: Started by an SCM change [EnvInject] - Loading node environment variables. Building remotely on libvirt-debian-8 (libvirt) in workspace <https://ci.centos.org/job/libvirt-go-xml-check/systems=libvirt-debian-8/ws/> [libvirt-go-xml] $ /bin/sh -xe /tmp/jenkins2111797103813543780.sh + export TEST_ARGS=-tags xmlroundtrip + go test -tags xmlroundtrip --- FAIL: TestRoundTrip (19.15s) xml_test.go:400: testdata/libvirt/tests/networkxml2xmlin/routed-network.xml: /network[0]/bridge[0]/@zone: attribute 'myzone' in expected XML missing in actual XML FAIL exit status 1 FAIL _<https://ci.centos.org/job/libvirt-go-xml-check/systems=libvirt-debian-8/ws/> 19.272s Build step 'Execute shell' marked build as failure

participants (1)
-
ci@centos.org