[Libvirt-ci] Build failed in Jenkins: libvirt-go-check » libvirt-freebsd-11 #289

See <https://ci.centos.org/job/libvirt-go-check/systems=libvirt-freebsd-11/289/display/redirect> ------------------------------------------ Started by upstream project "libvirt-go-check" build number 289 originally caused by: Started by upstream project "libvirt-go-build" build number 293 originally caused by: Started by upstream project "libvirt-build" build number 360 originally caused by: Started by an SCM change [EnvInject] - Loading node environment variables. Building remotely on libvirt-freebsd-11 (libvirt) in workspace <https://ci.centos.org/job/libvirt-go-check/systems=libvirt-freebsd-11/ws/> [libvirt-go] $ /bin/sh -xe /tmp/jenkins3607126763925985320.sh + export 'TEST_ARGS=-tags api' + go test -tags api Missing function 'virConnectGetStoragePoolCapabilities' --- FAIL: TestAPICoverage (0.81s) panic: Missing symbols found [recovered] panic: Missing symbols found goroutine 19 [running]: testing.tRunner.func1(0xc0000c8100) /usr/local/go/src/testing/testing.go:830 +0x388 panic(0x5cf8a0, 0x644c80) /usr/local/go/src/runtime/panic.go:522 +0x1b5 _/usr<https://ci.centos.org/job/libvirt-go-check/systems=libvirt-freebsd-11/ws/.TestAPICoverage(0xc0000c8100)> /usr<https://ci.centos.org/job/libvirt-go-check/systems=libvirt-freebsd-11/ws/api_test.go>:501 +0x551 testing.tRunner(0xc0000c8100, 0x61f2f8) /usr/local/go/src/testing/testing.go:865 +0xc0 created by testing.(*T).Run /usr/local/go/src/testing/testing.go:916 +0x357 exit status 2 FAIL _/usr<https://ci.centos.org/job/libvirt-go-check/systems=libvirt-freebsd-11/ws/> 1.479s Build step 'Execute shell' marked build as failure

See <https://ci.centos.org/job/libvirt-go-check/systems=libvirt-freebsd-11/290/display/redirect> ------------------------------------------ Started by upstream project "libvirt-go-check" build number 290 originally caused by: Started by upstream project "libvirt-go-build" build number 294 originally caused by: Started by upstream project "libvirt-build" build number 361 originally caused by: Started by an SCM change Started by an SCM change Started by an SCM change Started by an SCM change Started by an SCM change Started by an SCM change Started by an SCM change Started by an SCM change Started by an SCM change Started by an SCM change Started by an SCM change Started by an SCM change Started by an SCM change Started by an SCM change Started by an SCM change Started by an SCM change Started by an SCM change Started by an SCM change [EnvInject] - Loading node environment variables. Building remotely on libvirt-freebsd-11 (libvirt) in workspace <https://ci.centos.org/job/libvirt-go-check/systems=libvirt-freebsd-11/ws/> [libvirt-go] $ /bin/sh -xe /tmp/jenkins5765715314608127166.sh + export 'TEST_ARGS=-tags api' + go test -tags api Missing function 'virConnectGetStoragePoolCapabilities' --- FAIL: TestAPICoverage (1.04s) panic: Missing symbols found [recovered] panic: Missing symbols found goroutine 5 [running]: testing.tRunner.func1(0xc0000ac100) /usr/local/go/src/testing/testing.go:830 +0x388 panic(0x5cf8a0, 0x644c80) /usr/local/go/src/runtime/panic.go:522 +0x1b5 _/usr<https://ci.centos.org/job/libvirt-go-check/systems=libvirt-freebsd-11/ws/.TestAPICoverage(0xc0000ac100)> /usr<https://ci.centos.org/job/libvirt-go-check/systems=libvirt-freebsd-11/ws/api_test.go>:501 +0x551 testing.tRunner(0xc0000ac100, 0x61f2f8) /usr/local/go/src/testing/testing.go:865 +0xc0 created by testing.(*T).Run /usr/local/go/src/testing/testing.go:916 +0x357 exit status 2 FAIL _/usr<https://ci.centos.org/job/libvirt-go-check/systems=libvirt-freebsd-11/ws/> 1.422s Build step 'Execute shell' marked build as failure

See <https://ci.centos.org/job/libvirt-go-check/systems=libvirt-freebsd-11/291/display/redirect> ------------------------------------------ Started by upstream project "libvirt-go-check" build number 291 originally caused by: Started by upstream project "libvirt-go-build" build number 295 originally caused by: Started by upstream project "libvirt-build" build number 362 originally caused by: Started by an SCM change Started by an SCM change Started by an SCM change Started by an SCM change Started by an SCM change Started by an SCM change Started by an SCM change Started by an SCM change Started by an SCM change Started by an SCM change Started by an SCM change Started by an SCM change Started by an SCM change Started by an SCM change Started by an SCM change Started by an SCM change [EnvInject] - Loading node environment variables. Building remotely on libvirt-freebsd-11 (libvirt) in workspace <https://ci.centos.org/job/libvirt-go-check/systems=libvirt-freebsd-11/ws/> [libvirt-go] $ /bin/sh -xe /tmp/jenkins8079408144746728453.sh + export 'TEST_ARGS=-tags api' + go test -tags api Missing function 'virConnectGetStoragePoolCapabilities' --- FAIL: TestAPICoverage (0.39s) panic: Missing symbols found [recovered] panic: Missing symbols found goroutine 18 [running]: testing.tRunner.func1(0xc0000ca100) /usr/local/go/src/testing/testing.go:830 +0x388 panic(0x5cf8a0, 0x644c80) /usr/local/go/src/runtime/panic.go:522 +0x1b5 _/usr<https://ci.centos.org/job/libvirt-go-check/systems=libvirt-freebsd-11/ws/.TestAPICoverage(0xc0000ca100)> /usr<https://ci.centos.org/job/libvirt-go-check/systems=libvirt-freebsd-11/ws/api_test.go>:501 +0x551 testing.tRunner(0xc0000ca100, 0x61f2f8) /usr/local/go/src/testing/testing.go:865 +0xc0 created by testing.(*T).Run /usr/local/go/src/testing/testing.go:916 +0x357 exit status 2 FAIL _/usr<https://ci.centos.org/job/libvirt-go-check/systems=libvirt-freebsd-11/ws/> 0.789s Build step 'Execute shell' marked build as failure

See <https://ci.centos.org/job/libvirt-go-check/systems=libvirt-freebsd-11/292/display/redirect> ------------------------------------------ Started by upstream project "libvirt-go-check" build number 292 originally caused by: Started by upstream project "libvirt-go-build" build number 296 originally caused by: Started by upstream project "libvirt-build" build number 363 originally caused by: Started by an SCM change Started by an SCM change Started by an SCM change Started by an SCM change Started by an SCM change Started by an SCM change Started by an SCM change Started by an SCM change Started by an SCM change Started by an SCM change [EnvInject] - Loading node environment variables. Building remotely on libvirt-freebsd-11 (libvirt) in workspace <https://ci.centos.org/job/libvirt-go-check/systems=libvirt-freebsd-11/ws/> [libvirt-go] $ /bin/sh -xe /tmp/jenkins656619023632543335.sh + export 'TEST_ARGS=-tags api' + go test -tags api Missing function 'virConnectGetStoragePoolCapabilities' --- FAIL: TestAPICoverage (0.55s) panic: Missing symbols found [recovered] panic: Missing symbols found goroutine 19 [running]: testing.tRunner.func1(0xc0000ca100) /usr/local/go/src/testing/testing.go:830 +0x388 panic(0x5cf8a0, 0x644c80) /usr/local/go/src/runtime/panic.go:522 +0x1b5 _/usr<https://ci.centos.org/job/libvirt-go-check/systems=libvirt-freebsd-11/ws/.TestAPICoverage(0xc0000ca100)> /usr<https://ci.centos.org/job/libvirt-go-check/systems=libvirt-freebsd-11/ws/api_test.go>:501 +0x551 testing.tRunner(0xc0000ca100, 0x61f2f8) /usr/local/go/src/testing/testing.go:865 +0xc0 created by testing.(*T).Run /usr/local/go/src/testing/testing.go:916 +0x357 exit status 2 FAIL _/usr<https://ci.centos.org/job/libvirt-go-check/systems=libvirt-freebsd-11/ws/> 0.946s Build step 'Execute shell' marked build as failure

See <https://ci.centos.org/job/libvirt-go-check/systems=libvirt-freebsd-11/293/display/redirect> ------------------------------------------ Started by upstream project "libvirt-go-check" build number 293 originally caused by: Started by upstream project "libvirt-go-build" build number 297 originally caused by: Started by upstream project "libvirt-build" build number 364 originally caused by: Started by an SCM change [EnvInject] - Loading node environment variables. Building remotely on libvirt-freebsd-11 (libvirt) in workspace <https://ci.centos.org/job/libvirt-go-check/systems=libvirt-freebsd-11/ws/> [libvirt-go] $ /bin/sh -xe /tmp/jenkins4986498154347208570.sh + export 'TEST_ARGS=-tags api' + go test -tags api Missing function 'virConnectGetStoragePoolCapabilities' --- FAIL: TestAPICoverage (0.33s) panic: Missing symbols found [recovered] panic: Missing symbols found goroutine 4 [running]: testing.tRunner.func1(0xc0000ca100) /usr/local/go/src/testing/testing.go:830 +0x388 panic(0x5cf8a0, 0x644c80) /usr/local/go/src/runtime/panic.go:522 +0x1b5 _/usr<https://ci.centos.org/job/libvirt-go-check/systems=libvirt-freebsd-11/ws/.TestAPICoverage(0xc0000ca100)> /usr<https://ci.centos.org/job/libvirt-go-check/systems=libvirt-freebsd-11/ws/api_test.go>:501 +0x551 testing.tRunner(0xc0000ca100, 0x61f2f8) /usr/local/go/src/testing/testing.go:865 +0xc0 created by testing.(*T).Run /usr/local/go/src/testing/testing.go:916 +0x357 exit status 2 FAIL _/usr<https://ci.centos.org/job/libvirt-go-check/systems=libvirt-freebsd-11/ws/> 0.826s Build step 'Execute shell' marked build as failure

See <https://ci.centos.org/job/libvirt-go-check/systems=libvirt-freebsd-11/294/display/redirect> ------------------------------------------ Started by upstream project "libvirt-go-check" build number 294 originally caused by: Started by upstream project "libvirt-go-build" build number 298 originally caused by: Started by upstream project "libvirt-build" build number 365 originally caused by: Started by an SCM change [EnvInject] - Loading node environment variables. Building remotely on libvirt-freebsd-11 (libvirt) in workspace <https://ci.centos.org/job/libvirt-go-check/systems=libvirt-freebsd-11/ws/> [libvirt-go] $ /bin/sh -xe /tmp/jenkins8315306278195940263.sh + export 'TEST_ARGS=-tags api' + go test -tags api Missing function 'virConnectGetStoragePoolCapabilities' --- FAIL: TestAPICoverage (0.20s) panic: Missing symbols found [recovered] panic: Missing symbols found goroutine 19 [running]: testing.tRunner.func1(0xc0000c8100) /usr/local/go/src/testing/testing.go:830 +0x388 panic(0x5cf8a0, 0x644c80) /usr/local/go/src/runtime/panic.go:522 +0x1b5 _/usr<https://ci.centos.org/job/libvirt-go-check/systems=libvirt-freebsd-11/ws/.TestAPICoverage(0xc0000c8100)> /usr<https://ci.centos.org/job/libvirt-go-check/systems=libvirt-freebsd-11/ws/api_test.go>:501 +0x551 testing.tRunner(0xc0000c8100, 0x61f2f8) /usr/local/go/src/testing/testing.go:865 +0xc0 created by testing.(*T).Run /usr/local/go/src/testing/testing.go:916 +0x357 exit status 2 FAIL _/usr<https://ci.centos.org/job/libvirt-go-check/systems=libvirt-freebsd-11/ws/> 0.336s Build step 'Execute shell' marked build as failure

See <https://ci.centos.org/job/libvirt-go-check/systems=libvirt-freebsd-11/295/display/redirect> ------------------------------------------ Started by upstream project "libvirt-go-check" build number 295 originally caused by: Started by upstream project "libvirt-go-build" build number 299 originally caused by: Started by upstream project "libvirt-build" build number 366 originally caused by: Started by an SCM change [EnvInject] - Loading node environment variables. Building remotely on libvirt-freebsd-11 (libvirt) in workspace <https://ci.centos.org/job/libvirt-go-check/systems=libvirt-freebsd-11/ws/> [libvirt-go] $ /bin/sh -xe /tmp/jenkins1212739531215245303.sh + export 'TEST_ARGS=-tags api' + go test -tags api Missing function 'virConnectGetStoragePoolCapabilities' --- FAIL: TestAPICoverage (0.23s) panic: Missing symbols found [recovered] panic: Missing symbols found goroutine 19 [running]: testing.tRunner.func1(0xc0000c8100) /usr/local/go/src/testing/testing.go:830 +0x388 panic(0x5cf8a0, 0x644c80) /usr/local/go/src/runtime/panic.go:522 +0x1b5 _/usr<https://ci.centos.org/job/libvirt-go-check/systems=libvirt-freebsd-11/ws/.TestAPICoverage(0xc0000c8100)> /usr<https://ci.centos.org/job/libvirt-go-check/systems=libvirt-freebsd-11/ws/api_test.go>:501 +0x551 testing.tRunner(0xc0000c8100, 0x61f2f8) /usr/local/go/src/testing/testing.go:865 +0xc0 created by testing.(*T).Run /usr/local/go/src/testing/testing.go:916 +0x357 exit status 2 FAIL _/usr<https://ci.centos.org/job/libvirt-go-check/systems=libvirt-freebsd-11/ws/> 0.545s Build step 'Execute shell' marked build as failure

See <https://ci.centos.org/job/libvirt-go-check/systems=libvirt-freebsd-11/296/display/redirect> ------------------------------------------ Started by upstream project "libvirt-go-check" build number 296 originally caused by: Started by upstream project "libvirt-go-build" build number 300 originally caused by: Started by upstream project "libvirt-build" build number 367 originally caused by: Started by an SCM change [EnvInject] - Loading node environment variables. Building remotely on libvirt-freebsd-11 (libvirt) in workspace <https://ci.centos.org/job/libvirt-go-check/systems=libvirt-freebsd-11/ws/> [libvirt-go] $ /bin/sh -xe /tmp/jenkins5635099816280611047.sh + export 'TEST_ARGS=-tags api' + go test -tags api Missing function 'virConnectGetStoragePoolCapabilities' --- FAIL: TestAPICoverage (0.52s) panic: Missing symbols found [recovered] panic: Missing symbols found goroutine 5 [running]: testing.tRunner.func1(0xc0000ac100) /usr/local/go/src/testing/testing.go:830 +0x388 panic(0x5cf8a0, 0x644c80) /usr/local/go/src/runtime/panic.go:522 +0x1b5 _/usr<https://ci.centos.org/job/libvirt-go-check/systems=libvirt-freebsd-11/ws/.TestAPICoverage(0xc0000ac100)> /usr<https://ci.centos.org/job/libvirt-go-check/systems=libvirt-freebsd-11/ws/api_test.go>:501 +0x551 testing.tRunner(0xc0000ac100, 0x61f2f8) /usr/local/go/src/testing/testing.go:865 +0xc0 created by testing.(*T).Run /usr/local/go/src/testing/testing.go:916 +0x357 exit status 2 FAIL _/usr<https://ci.centos.org/job/libvirt-go-check/systems=libvirt-freebsd-11/ws/> 0.881s Build step 'Execute shell' marked build as failure

See <https://ci.centos.org/job/libvirt-go-check/systems=libvirt-freebsd-11/297/display/redirect> ------------------------------------------ Started by upstream project "libvirt-go-check" build number 297 originally caused by: Started by upstream project "libvirt-go-build" build number 301 originally caused by: Started by upstream project "libvirt-build" build number 368 originally caused by: Started by an SCM change Started by an SCM change Started by an SCM change Started by an SCM change Started by an SCM change [EnvInject] - Loading node environment variables. Building remotely on libvirt-freebsd-11 (libvirt) in workspace <https://ci.centos.org/job/libvirt-go-check/systems=libvirt-freebsd-11/ws/> [libvirt-go] $ /bin/sh -xe /tmp/jenkins5086179607929057012.sh + export 'TEST_ARGS=-tags api' + go test -tags api Missing function 'virConnectGetStoragePoolCapabilities' --- FAIL: TestAPICoverage (0.35s) panic: Missing symbols found [recovered] panic: Missing symbols found goroutine 19 [running]: testing.tRunner.func1(0xc0000c8100) /usr/local/go/src/testing/testing.go:830 +0x388 panic(0x5cf8a0, 0x644c80) /usr/local/go/src/runtime/panic.go:522 +0x1b5 _/usr<https://ci.centos.org/job/libvirt-go-check/systems=libvirt-freebsd-11/ws/.TestAPICoverage(0xc0000c8100)> /usr<https://ci.centos.org/job/libvirt-go-check/systems=libvirt-freebsd-11/ws/api_test.go>:501 +0x551 testing.tRunner(0xc0000c8100, 0x61f2f8) /usr/local/go/src/testing/testing.go:865 +0xc0 created by testing.(*T).Run /usr/local/go/src/testing/testing.go:916 +0x357 exit status 2 FAIL _/usr<https://ci.centos.org/job/libvirt-go-check/systems=libvirt-freebsd-11/ws/> 0.864s Build step 'Execute shell' marked build as failure

See <https://ci.centos.org/job/libvirt-go-check/systems=libvirt-freebsd-11/298/display/redirect> ------------------------------------------ Started by upstream project "libvirt-go-check" build number 298 originally caused by: Started by upstream project "libvirt-go-build" build number 302 originally caused by: Started by upstream project "libvirt-build" build number 370 originally caused by: Started by an SCM change Started by an SCM change Started by an SCM change Started by an SCM change [EnvInject] - Loading node environment variables. Building remotely on libvirt-freebsd-11 (libvirt) in workspace <https://ci.centos.org/job/libvirt-go-check/systems=libvirt-freebsd-11/ws/> [libvirt-go] $ /bin/sh -xe /tmp/jenkins443987108402398298.sh + export 'TEST_ARGS=-tags api' + go test -tags api Missing function 'virConnectGetStoragePoolCapabilities' --- FAIL: TestAPICoverage (1.15s) panic: Missing symbols found [recovered] panic: Missing symbols found goroutine 19 [running]: testing.tRunner.func1(0xc0000c8100) /usr/local/go/src/testing/testing.go:830 +0x388 panic(0x5cf8a0, 0x644c80) /usr/local/go/src/runtime/panic.go:522 +0x1b5 _/usr<https://ci.centos.org/job/libvirt-go-check/systems=libvirt-freebsd-11/ws/.TestAPICoverage(0xc0000c8100)> /usr<https://ci.centos.org/job/libvirt-go-check/systems=libvirt-freebsd-11/ws/api_test.go>:501 +0x551 testing.tRunner(0xc0000c8100, 0x61f2f8) /usr/local/go/src/testing/testing.go:865 +0xc0 created by testing.(*T).Run /usr/local/go/src/testing/testing.go:916 +0x357 exit status 2 FAIL _/usr<https://ci.centos.org/job/libvirt-go-check/systems=libvirt-freebsd-11/ws/> 2.088s Build step 'Execute shell' marked build as failure

See <https://ci.centos.org/job/libvirt-go-check/systems=libvirt-freebsd-11/299/display/redirect> ------------------------------------------ Started by upstream project "libvirt-go-check" build number 299 originally caused by: Started by upstream project "libvirt-go-build" build number 303 originally caused by: Started by upstream project "libvirt-build" build number 371 originally caused by: Started by an SCM change [EnvInject] - Loading node environment variables. Building remotely on libvirt-freebsd-11 (libvirt) in workspace <https://ci.centos.org/job/libvirt-go-check/systems=libvirt-freebsd-11/ws/> [libvirt-go] $ /bin/sh -xe /tmp/jenkins4699680914607154984.sh + export 'TEST_ARGS=-tags api' + go test -tags api Missing function 'virConnectGetStoragePoolCapabilities' --- FAIL: TestAPICoverage (0.48s) panic: Missing symbols found [recovered] panic: Missing symbols found goroutine 18 [running]: testing.tRunner.func1(0xc0000be100) /usr/local/go/src/testing/testing.go:830 +0x388 panic(0x5cf8a0, 0x644c80) /usr/local/go/src/runtime/panic.go:522 +0x1b5 _/usr<https://ci.centos.org/job/libvirt-go-check/systems=libvirt-freebsd-11/ws/.TestAPICoverage(0xc0000be100)> /usr<https://ci.centos.org/job/libvirt-go-check/systems=libvirt-freebsd-11/ws/api_test.go>:501 +0x551 testing.tRunner(0xc0000be100, 0x61f2f8) /usr/local/go/src/testing/testing.go:865 +0xc0 created by testing.(*T).Run /usr/local/go/src/testing/testing.go:916 +0x357 exit status 2 FAIL _/usr<https://ci.centos.org/job/libvirt-go-check/systems=libvirt-freebsd-11/ws/> 0.846s Build step 'Execute shell' marked build as failure

See <https://ci.centos.org/job/libvirt-go-check/systems=libvirt-freebsd-11/300/display/redirect> ------------------------------------------ Started by upstream project "libvirt-go-check" build number 300 originally caused by: Started by upstream project "libvirt-go-build" build number 304 originally caused by: Started by upstream project "libvirt-build" build number 372 originally caused by: Started by an SCM change [EnvInject] - Loading node environment variables. Building remotely on libvirt-freebsd-11 (libvirt) in workspace <https://ci.centos.org/job/libvirt-go-check/systems=libvirt-freebsd-11/ws/> [libvirt-go] $ /bin/sh -xe /tmp/jenkins2113212378819251628.sh + export 'TEST_ARGS=-tags api' + go test -tags api Missing function 'virConnectGetStoragePoolCapabilities' --- FAIL: TestAPICoverage (0.46s) panic: Missing symbols found [recovered] panic: Missing symbols found goroutine 5 [running]: testing.tRunner.func1(0xc0000ac100) /usr/local/go/src/testing/testing.go:830 +0x388 panic(0x5cf8a0, 0x644c80) /usr/local/go/src/runtime/panic.go:522 +0x1b5 _/usr<https://ci.centos.org/job/libvirt-go-check/systems=libvirt-freebsd-11/ws/.TestAPICoverage(0xc0000ac100)> /usr<https://ci.centos.org/job/libvirt-go-check/systems=libvirt-freebsd-11/ws/api_test.go>:501 +0x551 testing.tRunner(0xc0000ac100, 0x61f2f8) /usr/local/go/src/testing/testing.go:865 +0xc0 created by testing.(*T).Run /usr/local/go/src/testing/testing.go:916 +0x357 exit status 2 FAIL _/usr<https://ci.centos.org/job/libvirt-go-check/systems=libvirt-freebsd-11/ws/> 0.907s Build step 'Execute shell' marked build as failure

participants (1)
-
ci@centos.org