[Libvirt-ci] Build failed in Jenkins: libvirt-go-xml-master-check » libvirt-centos-7 #481

See <https://ci.centos.org/job/libvirt-go-xml-master-check/systems=libvirt-centos-7/481/display/redirect> ------------------------------------------ Started by upstream project "libvirt-go-xml-master-check" build number 481 originally caused by: Started by upstream project "libvirt-go-xml-master-build" build number 490 originally caused by: Started by upstream project "libvirt-master-build" build number 1541 originally caused by: Started by an SCM change [EnvInject] - Loading node environment variables. Building remotely on libvirt-centos-7 (libvirt) in workspace <https://ci.centos.org/job/libvirt-go-xml-master-check/systems=libvirt-centos-7/ws/> [libvirt-go-xml-master] $ /bin/sh -xe /tmp/jenkins8812056205481219580.sh + export 'TEST_ARGS=-tags xmlroundtrip' + TEST_ARGS='-tags xmlroundtrip' + go test -tags xmlroundtrip --- FAIL: TestRoundTrip (42.59s) xml_test.go:383: testdata/libvirt/tests/storagevolxml2xmlin/vol-luks-convert.xml: /volume[0]/source[0]: element in expected XML missing in actual XML FAIL exit status 1 FAIL _<https://ci.centos.org/job/libvirt-go-xml-master-check/systems=libvirt-centos-7/ws/> 42.739s Build step 'Execute shell' marked build as failure

See <https://ci.centos.org/job/libvirt-go-xml-master-check/systems=libvirt-centos-7/482/display/redirect> ------------------------------------------ Started by upstream project "libvirt-go-xml-master-check" build number 482 originally caused by: Started by upstream project "libvirt-go-xml-master-build" build number 491 originally caused by: Started by upstream project "libvirt-master-build" build number 1542 originally caused by: Started by an SCM change Started by an SCM change Started by an SCM change Started by an SCM change Started by an SCM change [EnvInject] - Loading node environment variables. Building remotely on libvirt-centos-7 (libvirt) in workspace <https://ci.centos.org/job/libvirt-go-xml-master-check/systems=libvirt-centos-7/ws/> [libvirt-go-xml-master] $ /bin/sh -xe /tmp/jenkins443628080244827056.sh + export 'TEST_ARGS=-tags xmlroundtrip' + TEST_ARGS='-tags xmlroundtrip' + go test -tags xmlroundtrip --- FAIL: TestRoundTrip (39.58s) xml_test.go:383: testdata/libvirt/tests/storagevolxml2xmlin/vol-luks-convert.xml: /volume[0]/source[0]: element in expected XML missing in actual XML FAIL exit status 1 FAIL _<https://ci.centos.org/job/libvirt-go-xml-master-check/systems=libvirt-centos-7/ws/> 39.828s Build step 'Execute shell' marked build as failure

See <https://ci.centos.org/job/libvirt-go-xml-master-check/systems=libvirt-centos-7/483/display/redirect> ------------------------------------------ Started by upstream project "libvirt-go-xml-master-check" build number 483 originally caused by: Started by upstream project "libvirt-go-xml-master-build" build number 492 originally caused by: Started by upstream project "libvirt-master-build" build number 1543 originally caused by: Started by an SCM change Started by an SCM change Started by an SCM change [EnvInject] - Loading node environment variables. Building remotely on libvirt-centos-7 (libvirt) in workspace <https://ci.centos.org/job/libvirt-go-xml-master-check/systems=libvirt-centos-7/ws/> [libvirt-go-xml-master] $ /bin/sh -xe /tmp/jenkins880864690815743090.sh + export 'TEST_ARGS=-tags xmlroundtrip' + TEST_ARGS='-tags xmlroundtrip' + go test -tags xmlroundtrip --- FAIL: TestRoundTrip (41.57s) xml_test.go:383: testdata/libvirt/tests/storagevolxml2xmlin/vol-luks-convert.xml: /volume[0]/source[0]: element in expected XML missing in actual XML FAIL exit status 1 FAIL _<https://ci.centos.org/job/libvirt-go-xml-master-check/systems=libvirt-centos-7/ws/> 41.901s Build step 'Execute shell' marked build as failure

See <https://ci.centos.org/job/libvirt-go-xml-master-check/systems=libvirt-centos-7/484/display/redirect> ------------------------------------------ Started by upstream project "libvirt-go-xml-master-check" build number 484 originally caused by: Started by upstream project "libvirt-go-xml-master-build" build number 493 originally caused by: Started by upstream project "libvirt-master-build" build number 1544 originally caused by: Started by an SCM change [EnvInject] - Loading node environment variables. Building remotely on libvirt-centos-7 (libvirt) in workspace <https://ci.centos.org/job/libvirt-go-xml-master-check/systems=libvirt-centos-7/ws/> [libvirt-go-xml-master] $ /bin/sh -xe /tmp/jenkins4645321002057207861.sh + export 'TEST_ARGS=-tags xmlroundtrip' + TEST_ARGS='-tags xmlroundtrip' + go test -tags xmlroundtrip --- FAIL: TestRoundTrip (9.13s) xml_test.go:383: testdata/libvirt/tests/storagevolxml2xmlin/vol-luks-convert.xml: /volume[0]/source[0]: element in expected XML missing in actual XML FAIL exit status 1 FAIL _<https://ci.centos.org/job/libvirt-go-xml-master-check/systems=libvirt-centos-7/ws/> 9.161s Build step 'Execute shell' marked build as failure

See <https://ci.centos.org/job/libvirt-go-xml-master-check/systems=libvirt-centos-7/485/display/redirect> ------------------------------------------ Started by upstream project "libvirt-go-xml-master-check" build number 485 originally caused by: Started by upstream project "libvirt-go-xml-master-build" build number 494 originally caused by: Started by upstream project "libvirt-master-build" build number 1545 originally caused by: Started by an SCM change [EnvInject] - Loading node environment variables. Building remotely on libvirt-centos-7 (libvirt) in workspace <https://ci.centos.org/job/libvirt-go-xml-master-check/systems=libvirt-centos-7/ws/> [libvirt-go-xml-master] $ /bin/sh -xe /tmp/jenkins1493818078510787775.sh + export 'TEST_ARGS=-tags xmlroundtrip' + TEST_ARGS='-tags xmlroundtrip' + go test -tags xmlroundtrip --- FAIL: TestRoundTrip (45.91s) xml_test.go:383: testdata/libvirt/tests/storagevolxml2xmlin/vol-luks-convert.xml: /volume[0]/source[0]: element in expected XML missing in actual XML FAIL exit status 1 FAIL _<https://ci.centos.org/job/libvirt-go-xml-master-check/systems=libvirt-centos-7/ws/> 46.206s Build step 'Execute shell' marked build as failure

See <https://ci.centos.org/job/libvirt-go-xml-master-check/systems=libvirt-centos-7/486/display/redirect> ------------------------------------------ Started by upstream project "libvirt-go-xml-master-check" build number 486 originally caused by: Started by upstream project "libvirt-go-xml-master-build" build number 495 originally caused by: Started by upstream project "libvirt-master-build" build number 1546 originally caused by: Started by an SCM change [EnvInject] - Loading node environment variables. Building remotely on libvirt-centos-7 (libvirt) in workspace <https://ci.centos.org/job/libvirt-go-xml-master-check/systems=libvirt-centos-7/ws/> [libvirt-go-xml-master] $ /bin/sh -xe /tmp/jenkins5977038469382948368.sh + export 'TEST_ARGS=-tags xmlroundtrip' + TEST_ARGS='-tags xmlroundtrip' + go test -tags xmlroundtrip --- FAIL: TestRoundTrip (9.12s) xml_test.go:383: testdata/libvirt/tests/storagevolxml2xmlin/vol-luks-convert.xml: /volume[0]/source[0]: element in expected XML missing in actual XML FAIL exit status 1 FAIL _<https://ci.centos.org/job/libvirt-go-xml-master-check/systems=libvirt-centos-7/ws/> 9.157s Build step 'Execute shell' marked build as failure

See <https://ci.centos.org/job/libvirt-go-xml-master-check/systems=libvirt-centos-7/487/display/redirect> ------------------------------------------ Started by upstream project "libvirt-go-xml-master-check" build number 487 originally caused by: Started by upstream project "libvirt-go-xml-master-build" build number 496 originally caused by: Started by upstream project "libvirt-master-build" build number 1547 originally caused by: Started by an SCM change [EnvInject] - Loading node environment variables. Building remotely on libvirt-centos-7 (libvirt) in workspace <https://ci.centos.org/job/libvirt-go-xml-master-check/systems=libvirt-centos-7/ws/> [libvirt-go-xml-master] $ /bin/sh -xe /tmp/jenkins409983571407939998.sh + export 'TEST_ARGS=-tags xmlroundtrip' + TEST_ARGS='-tags xmlroundtrip' + go test -tags xmlroundtrip --- FAIL: TestRoundTrip (9.85s) xml_test.go:383: testdata/libvirt/tests/storagevolxml2xmlin/vol-luks-convert.xml: /volume[0]/source[0]: element in expected XML missing in actual XML FAIL exit status 1 FAIL _<https://ci.centos.org/job/libvirt-go-xml-master-check/systems=libvirt-centos-7/ws/> 9.886s Build step 'Execute shell' marked build as failure

See <https://ci.centos.org/job/libvirt-go-xml-master-check/systems=libvirt-centos-7/488/display/redirect> ------------------------------------------ Started by upstream project "libvirt-go-xml-master-check" build number 488 originally caused by: Started by upstream project "libvirt-go-xml-master-build" build number 497 originally caused by: Started by upstream project "libvirt-master-build" build number 1548 originally caused by: Started by an SCM change [EnvInject] - Loading node environment variables. Building remotely on libvirt-centos-7 (libvirt) in workspace <https://ci.centos.org/job/libvirt-go-xml-master-check/systems=libvirt-centos-7/ws/> [libvirt-go-xml-master] $ /bin/sh -xe /tmp/jenkins5853406455326245234.sh + export 'TEST_ARGS=-tags xmlroundtrip' + TEST_ARGS='-tags xmlroundtrip' + go test -tags xmlroundtrip --- FAIL: TestRoundTrip (7.80s) xml_test.go:383: testdata/libvirt/tests/storagevolxml2xmlin/vol-luks-convert.xml: /volume[0]/source[0]: element in expected XML missing in actual XML FAIL exit status 1 FAIL _<https://ci.centos.org/job/libvirt-go-xml-master-check/systems=libvirt-centos-7/ws/> 7.854s Build step 'Execute shell' marked build as failure

See <https://ci.centos.org/job/libvirt-go-xml-master-check/systems=libvirt-centos-7/489/display/redirect> ------------------------------------------ Started by upstream project "libvirt-go-xml-master-check" build number 489 originally caused by: Started by upstream project "libvirt-go-xml-master-build" build number 498 originally caused by: Started by upstream project "libvirt-master-build" build number 1549 originally caused by: Started by an SCM change Started by an SCM change Started by an SCM change [EnvInject] - Loading node environment variables. Building remotely on libvirt-centos-7 (libvirt) in workspace <https://ci.centos.org/job/libvirt-go-xml-master-check/systems=libvirt-centos-7/ws/> [libvirt-go-xml-master] $ /bin/sh -xe /tmp/jenkins7786737025167281180.sh + export 'TEST_ARGS=-tags xmlroundtrip' + TEST_ARGS='-tags xmlroundtrip' + go test -tags xmlroundtrip --- FAIL: TestRoundTrip (18.77s) xml_test.go:383: testdata/libvirt/tests/storagevolxml2xmlin/vol-luks-convert.xml: /volume[0]/source[0]: element in expected XML missing in actual XML FAIL exit status 1 FAIL _<https://ci.centos.org/job/libvirt-go-xml-master-check/systems=libvirt-centos-7/ws/> 18.804s Build step 'Execute shell' marked build as failure

participants (1)
-
ci@centos.org