[Libvirt-ci] Build failed in Jenkins: libvirt-go-check » libvirt-fedora-29 #257

See <https://ci.centos.org/job/libvirt-go-check/systems=libvirt-fedora-29/257/display/redirect> ------------------------------------------ Started by upstream project "libvirt-go-check" build number 257 originally caused by: Started by upstream project "libvirt-go-build" build number 261 originally caused by: Started by upstream project "libvirt-build" build number 323 originally caused by: Started by an SCM change [EnvInject] - Loading node environment variables. Building remotely on libvirt-fedora-29 (libvirt) in workspace <https://ci.centos.org/job/libvirt-go-check/systems=libvirt-fedora-29/ws/> [libvirt-go] $ /bin/sh -xe /tmp/jenkins6317422892643787421.sh + export 'TEST_ARGS=-tags api' + TEST_ARGS='-tags api' + go test -tags api Missing enum 'VIR_DOMAIN_SAVE_IMAGE_XML_SECURE' Missing enum 'VIR_DOMAIN_SNAPSHOT_XML_SECURE' --- FAIL: TestAPICoverage (0.77s) panic: Missing symbols found [recovered] panic: Missing symbols found goroutine 19 [running]: testing.tRunner.func1(0xc0000c2100) /usr/lib/golang/src/testing/testing.go:792 +0x387 panic(0x5cca80, 0x639c80) /usr/lib/golang/src/runtime/panic.go:513 +0x1b9 _<https://ci.centos.org/job/libvirt-go-check/systems=libvirt-fedora-29/ws/.TestAPICoverage(0xc0000c2100)> <https://ci.centos.org/job/libvirt-go-check/systems=libvirt-fedora-29/ws/api_test.go>:501 +0x554 testing.tRunner(0xc0000c2100, 0x61b0e8) /usr/lib/golang/src/testing/testing.go:827 +0xbf created by testing.(*T).Run /usr/lib/golang/src/testing/testing.go:878 +0x35c exit status 2 FAIL _<https://ci.centos.org/job/libvirt-go-check/systems=libvirt-fedora-29/ws/> 0.905s Build step 'Execute shell' marked build as failure

See <https://ci.centos.org/job/libvirt-go-check/systems=libvirt-fedora-29/258/display/redirect> ------------------------------------------ Started by upstream project "libvirt-go-check" build number 258 originally caused by: Started by upstream project "libvirt-go-build" build number 262 originally caused by: Started by upstream project "libvirt-build" build number 324 originally caused by: Started by an SCM change [EnvInject] - Loading node environment variables. Building remotely on libvirt-fedora-29 (libvirt) in workspace <https://ci.centos.org/job/libvirt-go-check/systems=libvirt-fedora-29/ws/> [libvirt-go] $ /bin/sh -xe /tmp/jenkins6466228587339183443.sh + export 'TEST_ARGS=-tags api' + TEST_ARGS='-tags api' + go test -tags api Missing enum 'VIR_DOMAIN_SAVE_IMAGE_XML_SECURE' Missing enum 'VIR_DOMAIN_SNAPSHOT_XML_SECURE' --- FAIL: TestAPICoverage (0.70s) panic: Missing symbols found [recovered] panic: Missing symbols found goroutine 19 [running]: testing.tRunner.func1(0xc0000c2100) /usr/lib/golang/src/testing/testing.go:792 +0x387 panic(0x5cca80, 0x639c80) /usr/lib/golang/src/runtime/panic.go:513 +0x1b9 _<https://ci.centos.org/job/libvirt-go-check/systems=libvirt-fedora-29/ws/.TestAPICoverage(0xc0000c2100)> <https://ci.centos.org/job/libvirt-go-check/systems=libvirt-fedora-29/ws/api_test.go>:501 +0x554 testing.tRunner(0xc0000c2100, 0x61b0e8) /usr/lib/golang/src/testing/testing.go:827 +0xbf created by testing.(*T).Run /usr/lib/golang/src/testing/testing.go:878 +0x35c exit status 2 FAIL _<https://ci.centos.org/job/libvirt-go-check/systems=libvirt-fedora-29/ws/> 0.906s Build step 'Execute shell' marked build as failure

See <https://ci.centos.org/job/libvirt-go-check/systems=libvirt-fedora-29/259/display/redirect> ------------------------------------------ Started by upstream project "libvirt-go-check" build number 259 originally caused by: Started by upstream project "libvirt-go-build" build number 263 originally caused by: Started by upstream project "libvirt-build" build number 325 originally caused by: Started by an SCM change [EnvInject] - Loading node environment variables. Building remotely on libvirt-fedora-29 (libvirt) in workspace <https://ci.centos.org/job/libvirt-go-check/systems=libvirt-fedora-29/ws/> [libvirt-go] $ /bin/sh -xe /tmp/jenkins6159517414393980903.sh + export 'TEST_ARGS=-tags api' + TEST_ARGS='-tags api' + go test -tags api Missing enum 'VIR_DOMAIN_SAVE_IMAGE_XML_SECURE' Missing enum 'VIR_DOMAIN_SNAPSHOT_XML_SECURE' --- FAIL: TestAPICoverage (0.77s) panic: Missing symbols found [recovered] panic: Missing symbols found goroutine 18 [running]: testing.tRunner.func1(0xc0000c8100) /usr/lib/golang/src/testing/testing.go:792 +0x387 panic(0x5cca80, 0x639c80) /usr/lib/golang/src/runtime/panic.go:513 +0x1b9 _<https://ci.centos.org/job/libvirt-go-check/systems=libvirt-fedora-29/ws/.TestAPICoverage(0xc0000c8100)> <https://ci.centos.org/job/libvirt-go-check/systems=libvirt-fedora-29/ws/api_test.go>:501 +0x554 testing.tRunner(0xc0000c8100, 0x61b0e8) /usr/lib/golang/src/testing/testing.go:827 +0xbf created by testing.(*T).Run /usr/lib/golang/src/testing/testing.go:878 +0x35c exit status 2 FAIL _<https://ci.centos.org/job/libvirt-go-check/systems=libvirt-fedora-29/ws/> 0.931s Build step 'Execute shell' marked build as failure

See <https://ci.centos.org/job/libvirt-go-check/systems=libvirt-fedora-29/260/display/redirect> ------------------------------------------ Started by upstream project "libvirt-go-check" build number 260 originally caused by: Started by upstream project "libvirt-go-build" build number 264 originally caused by: Started by upstream project "libvirt-build" build number 326 originally caused by: Started by an SCM change Started by an SCM change Started by an SCM change Started by an SCM change Started by an SCM change [EnvInject] - Loading node environment variables. Building remotely on libvirt-fedora-29 (libvirt) in workspace <https://ci.centos.org/job/libvirt-go-check/systems=libvirt-fedora-29/ws/> [libvirt-go] $ /bin/sh -xe /tmp/jenkins6251671484359143723.sh + export 'TEST_ARGS=-tags api' + TEST_ARGS='-tags api' + go test -tags api Missing enum 'VIR_DOMAIN_SAVE_IMAGE_XML_SECURE' Missing enum 'VIR_DOMAIN_SNAPSHOT_XML_SECURE' --- FAIL: TestAPICoverage (0.50s) panic: Missing symbols found [recovered] panic: Missing symbols found goroutine 19 [running]: testing.tRunner.func1(0xc0000c2100) /usr/lib/golang/src/testing/testing.go:792 +0x387 panic(0x5cca80, 0x639c80) /usr/lib/golang/src/runtime/panic.go:513 +0x1b9 _<https://ci.centos.org/job/libvirt-go-check/systems=libvirt-fedora-29/ws/.TestAPICoverage(0xc0000c2100)> <https://ci.centos.org/job/libvirt-go-check/systems=libvirt-fedora-29/ws/api_test.go>:501 +0x554 testing.tRunner(0xc0000c2100, 0x61b0e8) /usr/lib/golang/src/testing/testing.go:827 +0xbf created by testing.(*T).Run /usr/lib/golang/src/testing/testing.go:878 +0x35c exit status 2 FAIL _<https://ci.centos.org/job/libvirt-go-check/systems=libvirt-fedora-29/ws/> 0.605s Build step 'Execute shell' marked build as failure

See <https://ci.centos.org/job/libvirt-go-check/systems=libvirt-fedora-29/261/display/redirect> ------------------------------------------ Started by upstream project "libvirt-go-check" build number 261 originally caused by: Started by upstream project "libvirt-go-build" build number 265 originally caused by: Started by upstream project "libvirt-build" build number 327 originally caused by: Started by an SCM change [EnvInject] - Loading node environment variables. Building remotely on libvirt-fedora-29 (libvirt) in workspace <https://ci.centos.org/job/libvirt-go-check/systems=libvirt-fedora-29/ws/> [libvirt-go] $ /bin/sh -xe /tmp/jenkins7905989482849455195.sh + export 'TEST_ARGS=-tags api' + TEST_ARGS='-tags api' + go test -tags api Missing enum 'VIR_DOMAIN_SAVE_IMAGE_XML_SECURE' Missing enum 'VIR_DOMAIN_SNAPSHOT_XML_SECURE' --- FAIL: TestAPICoverage (0.64s) panic: Missing symbols found [recovered] panic: Missing symbols found goroutine 5 [running]: testing.tRunner.func1(0xc0000a8100) /usr/lib/golang/src/testing/testing.go:792 +0x387 panic(0x5cca80, 0x639c80) /usr/lib/golang/src/runtime/panic.go:513 +0x1b9 _<https://ci.centos.org/job/libvirt-go-check/systems=libvirt-fedora-29/ws/.TestAPICoverage(0xc0000a8100)> <https://ci.centos.org/job/libvirt-go-check/systems=libvirt-fedora-29/ws/api_test.go>:501 +0x554 testing.tRunner(0xc0000a8100, 0x61b0e8) /usr/lib/golang/src/testing/testing.go:827 +0xbf created by testing.(*T).Run /usr/lib/golang/src/testing/testing.go:878 +0x35c exit status 2 FAIL _<https://ci.centos.org/job/libvirt-go-check/systems=libvirt-fedora-29/ws/> 0.727s Build step 'Execute shell' marked build as failure

See <https://ci.centos.org/job/libvirt-go-check/systems=libvirt-fedora-29/262/display/redirect> ------------------------------------------ Started by upstream project "libvirt-go-check" build number 262 originally caused by: Started by upstream project "libvirt-go-build" build number 266 originally caused by: Started by upstream project "libvirt-build" build number 328 originally caused by: Started by an SCM change Started by an SCM change Started by an SCM change Started by an SCM change [EnvInject] - Loading node environment variables. Building remotely on libvirt-fedora-29 (libvirt) in workspace <https://ci.centos.org/job/libvirt-go-check/systems=libvirt-fedora-29/ws/> [libvirt-go] $ /bin/sh -xe /tmp/jenkins3894933297824820210.sh + export 'TEST_ARGS=-tags api' + TEST_ARGS='-tags api' + go test -tags api Missing enum 'VIR_DOMAIN_SAVE_IMAGE_XML_SECURE' Missing enum 'VIR_DOMAIN_SNAPSHOT_XML_SECURE' --- FAIL: TestAPICoverage (0.98s) panic: Missing symbols found [recovered] panic: Missing symbols found goroutine 5 [running]: testing.tRunner.func1(0xc0000a8100) /usr/lib/golang/src/testing/testing.go:792 +0x387 panic(0x5cca80, 0x639c80) /usr/lib/golang/src/runtime/panic.go:513 +0x1b9 _<https://ci.centos.org/job/libvirt-go-check/systems=libvirt-fedora-29/ws/.TestAPICoverage(0xc0000a8100)> <https://ci.centos.org/job/libvirt-go-check/systems=libvirt-fedora-29/ws/api_test.go>:501 +0x554 testing.tRunner(0xc0000a8100, 0x61b0e8) /usr/lib/golang/src/testing/testing.go:827 +0xbf created by testing.(*T).Run /usr/lib/golang/src/testing/testing.go:878 +0x35c exit status 2 FAIL _<https://ci.centos.org/job/libvirt-go-check/systems=libvirt-fedora-29/ws/> 1.152s Build step 'Execute shell' marked build as failure

See <https://ci.centos.org/job/libvirt-go-check/systems=libvirt-fedora-29/263/display/redirect> ------------------------------------------ Started by upstream project "libvirt-go-check" build number 263 originally caused by: Started by upstream project "libvirt-go-build" build number 267 originally caused by: Started by upstream project "libvirt-build" build number 330 originally caused by: Started by an SCM change [EnvInject] - Loading node environment variables. Building remotely on libvirt-fedora-29 (libvirt) in workspace <https://ci.centos.org/job/libvirt-go-check/systems=libvirt-fedora-29/ws/> [libvirt-go] $ /bin/sh -xe /tmp/jenkins7509572770640650670.sh + export 'TEST_ARGS=-tags api' + TEST_ARGS='-tags api' + go test -tags api Missing enum 'VIR_DOMAIN_SAVE_IMAGE_XML_SECURE' Missing enum 'VIR_DOMAIN_SNAPSHOT_XML_SECURE' --- FAIL: TestAPICoverage (0.48s) panic: Missing symbols found [recovered] panic: Missing symbols found goroutine 19 [running]: testing.tRunner.func1(0xc0000c2100) /usr/lib/golang/src/testing/testing.go:792 +0x387 panic(0x5cca80, 0x639c80) /usr/lib/golang/src/runtime/panic.go:513 +0x1b9 _<https://ci.centos.org/job/libvirt-go-check/systems=libvirt-fedora-29/ws/.TestAPICoverage(0xc0000c2100)> <https://ci.centos.org/job/libvirt-go-check/systems=libvirt-fedora-29/ws/api_test.go>:501 +0x554 testing.tRunner(0xc0000c2100, 0x61b0e8) /usr/lib/golang/src/testing/testing.go:827 +0xbf created by testing.(*T).Run /usr/lib/golang/src/testing/testing.go:878 +0x35c exit status 2 FAIL _<https://ci.centos.org/job/libvirt-go-check/systems=libvirt-fedora-29/ws/> 0.728s Build step 'Execute shell' marked build as failure

See <https://ci.centos.org/job/libvirt-go-check/systems=libvirt-fedora-29/264/display/redirect> ------------------------------------------ Started by upstream project "libvirt-go-check" build number 264 originally caused by: Started by upstream project "libvirt-go-build" build number 268 originally caused by: Started by upstream project "libvirt-build" build number 331 originally caused by: Started by an SCM change Started by an SCM change Started by an SCM change [EnvInject] - Loading node environment variables. Building remotely on libvirt-fedora-29 (libvirt) in workspace <https://ci.centos.org/job/libvirt-go-check/systems=libvirt-fedora-29/ws/> [libvirt-go] $ /bin/sh -xe /tmp/jenkins1996834694024660451.sh + export 'TEST_ARGS=-tags api' + TEST_ARGS='-tags api' + go test -tags api Missing enum 'VIR_DOMAIN_SAVE_IMAGE_XML_SECURE' Missing enum 'VIR_DOMAIN_SNAPSHOT_XML_SECURE' --- FAIL: TestAPICoverage (0.81s) panic: Missing symbols found [recovered] panic: Missing symbols found goroutine 5 [running]: testing.tRunner.func1(0xc0000a8100) /usr/lib/golang/src/testing/testing.go:792 +0x387 panic(0x5cca80, 0x639c80) /usr/lib/golang/src/runtime/panic.go:513 +0x1b9 _<https://ci.centos.org/job/libvirt-go-check/systems=libvirt-fedora-29/ws/.TestAPICoverage(0xc0000a8100)> <https://ci.centos.org/job/libvirt-go-check/systems=libvirt-fedora-29/ws/api_test.go>:501 +0x554 testing.tRunner(0xc0000a8100, 0x61b0e8) /usr/lib/golang/src/testing/testing.go:827 +0xbf created by testing.(*T).Run /usr/lib/golang/src/testing/testing.go:878 +0x35c exit status 2 FAIL _<https://ci.centos.org/job/libvirt-go-check/systems=libvirt-fedora-29/ws/> 0.963s Build step 'Execute shell' marked build as failure

See <https://ci.centos.org/job/libvirt-go-check/systems=libvirt-fedora-29/265/display/redirect> ------------------------------------------ Started by upstream project "libvirt-go-check" build number 265 originally caused by: Started by upstream project "libvirt-go-build" build number 269 originally caused by: Started by upstream project "libvirt-build" build number 332 originally caused by: Started by an SCM change [EnvInject] - Loading node environment variables. Building remotely on libvirt-fedora-29 (libvirt) in workspace <https://ci.centos.org/job/libvirt-go-check/systems=libvirt-fedora-29/ws/> [libvirt-go] $ /bin/sh -xe /tmp/jenkins8220850686585640821.sh + export 'TEST_ARGS=-tags api' + TEST_ARGS='-tags api' + go test -tags api Missing enum 'VIR_DOMAIN_SAVE_IMAGE_XML_SECURE' Missing enum 'VIR_DOMAIN_SNAPSHOT_XML_SECURE' --- FAIL: TestAPICoverage (0.84s) panic: Missing symbols found [recovered] panic: Missing symbols found goroutine 4 [running]: testing.tRunner.func1(0xc0000c4100) /usr/lib/golang/src/testing/testing.go:792 +0x387 panic(0x5cca80, 0x639c80) /usr/lib/golang/src/runtime/panic.go:513 +0x1b9 _<https://ci.centos.org/job/libvirt-go-check/systems=libvirt-fedora-29/ws/.TestAPICoverage(0xc0000c4100)> <https://ci.centos.org/job/libvirt-go-check/systems=libvirt-fedora-29/ws/api_test.go>:501 +0x554 testing.tRunner(0xc0000c4100, 0x61b0e8) /usr/lib/golang/src/testing/testing.go:827 +0xbf created by testing.(*T).Run /usr/lib/golang/src/testing/testing.go:878 +0x35c exit status 2 FAIL _<https://ci.centos.org/job/libvirt-go-check/systems=libvirt-fedora-29/ws/> 0.936s Build step 'Execute shell' marked build as failure

See <https://ci.centos.org/job/libvirt-go-check/systems=libvirt-fedora-29/266/display/redirect> ------------------------------------------ Started by upstream project "libvirt-go-check" build number 266 originally caused by: Started by upstream project "libvirt-go-build" build number 270 originally caused by: Started by upstream project "libvirt-build" build number 333 originally caused by: Started by an SCM change [EnvInject] - Loading node environment variables. Building remotely on libvirt-fedora-29 (libvirt) in workspace <https://ci.centos.org/job/libvirt-go-check/systems=libvirt-fedora-29/ws/> [libvirt-go] $ /bin/sh -xe /tmp/jenkins6103325124998217571.sh + export 'TEST_ARGS=-tags api' + TEST_ARGS='-tags api' + go test -tags api Missing enum 'VIR_DOMAIN_SAVE_IMAGE_XML_SECURE' Missing enum 'VIR_DOMAIN_SNAPSHOT_XML_SECURE' --- FAIL: TestAPICoverage (0.71s) panic: Missing symbols found [recovered] panic: Missing symbols found goroutine 18 [running]: testing.tRunner.func1(0xc0000b4100) /usr/lib/golang/src/testing/testing.go:792 +0x387 panic(0x5cca80, 0x639c80) /usr/lib/golang/src/runtime/panic.go:513 +0x1b9 _<https://ci.centos.org/job/libvirt-go-check/systems=libvirt-fedora-29/ws/.TestAPICoverage(0xc0000b4100)> <https://ci.centos.org/job/libvirt-go-check/systems=libvirt-fedora-29/ws/api_test.go>:501 +0x554 testing.tRunner(0xc0000b4100, 0x61b0e8) /usr/lib/golang/src/testing/testing.go:827 +0xbf created by testing.(*T).Run /usr/lib/golang/src/testing/testing.go:878 +0x35c exit status 2 FAIL _<https://ci.centos.org/job/libvirt-go-check/systems=libvirt-fedora-29/ws/> 1.029s Build step 'Execute shell' marked build as failure

See <https://ci.centos.org/job/libvirt-go-check/systems=libvirt-fedora-29/267/display/redirect> ------------------------------------------ Started by upstream project "libvirt-go-check" build number 267 originally caused by: Started by upstream project "libvirt-go-build" build number 271 originally caused by: Started by upstream project "libvirt-build" build number 334 originally caused by: Started by an SCM change [EnvInject] - Loading node environment variables. Building remotely on libvirt-fedora-29 (libvirt) in workspace <https://ci.centos.org/job/libvirt-go-check/systems=libvirt-fedora-29/ws/> [libvirt-go] $ /bin/sh -xe /tmp/jenkins9177290383067682068.sh + export 'TEST_ARGS=-tags api' + TEST_ARGS='-tags api' + go test -tags api Missing enum 'VIR_DOMAIN_SAVE_IMAGE_XML_SECURE' Missing enum 'VIR_DOMAIN_SNAPSHOT_XML_SECURE' --- FAIL: TestAPICoverage (0.99s) panic: Missing symbols found [recovered] panic: Missing symbols found goroutine 19 [running]: testing.tRunner.func1(0xc0000c2100) /usr/lib/golang/src/testing/testing.go:792 +0x387 panic(0x5cca80, 0x639c80) /usr/lib/golang/src/runtime/panic.go:513 +0x1b9 _<https://ci.centos.org/job/libvirt-go-check/systems=libvirt-fedora-29/ws/.TestAPICoverage(0xc0000c2100)> <https://ci.centos.org/job/libvirt-go-check/systems=libvirt-fedora-29/ws/api_test.go>:501 +0x554 testing.tRunner(0xc0000c2100, 0x61b0e8) /usr/lib/golang/src/testing/testing.go:827 +0xbf created by testing.(*T).Run /usr/lib/golang/src/testing/testing.go:878 +0x35c exit status 2 FAIL _<https://ci.centos.org/job/libvirt-go-check/systems=libvirt-fedora-29/ws/> 1.249s Build step 'Execute shell' marked build as failure

participants (1)
-
ci@centos.org