[Libvirt-ci] Build failed in Jenkins: libvirt-go-check » libvirt-fedora-28 #289

See <https://ci.centos.org/job/libvirt-go-check/systems=libvirt-fedora-28/289/display/redirect> ------------------------------------------ Started by upstream project "libvirt-go-check" build number 289 originally caused by: Started by upstream project "libvirt-go-build" build number 293 originally caused by: Started by upstream project "libvirt-build" build number 360 originally caused by: Started by an SCM change [EnvInject] - Loading node environment variables. Building remotely on libvirt-fedora-28 (libvirt) in workspace <https://ci.centos.org/job/libvirt-go-check/systems=libvirt-fedora-28/ws/> [libvirt-go] $ /bin/sh -xe /tmp/jenkins4246420514423750011.sh + export 'TEST_ARGS=-tags api' + TEST_ARGS='-tags api' + go test -tags api Missing function 'virConnectGetStoragePoolCapabilities' --- FAIL: TestAPICoverage (1.09s) panic: Missing symbols found [recovered] panic: Missing symbols found goroutine 18 [running]: testing.tRunner.func1(0xc4200b60f0) /usr/lib/golang/src/testing/testing.go:742 +0x29d panic(0x5c3ba0, 0x6277b0) /usr/lib/golang/src/runtime/panic.go:502 +0x229 _<https://ci.centos.org/job/libvirt-go-check/systems=libvirt-fedora-28/ws/.TestAPICoverage(0xc4200b60f0)> <https://ci.centos.org/job/libvirt-go-check/systems=libvirt-fedora-28/ws/api_test.go>:501 +0x548 testing.tRunner(0xc4200b60f0, 0x612868) /usr/lib/golang/src/testing/testing.go:777 +0xd0 created by testing.(*T).Run /usr/lib/golang/src/testing/testing.go:824 +0x2e0 exit status 2 FAIL _<https://ci.centos.org/job/libvirt-go-check/systems=libvirt-fedora-28/ws/> 1.455s Build step 'Execute shell' marked build as failure

See <https://ci.centos.org/job/libvirt-go-check/systems=libvirt-fedora-28/290/display/redirect> ------------------------------------------ Started by upstream project "libvirt-go-check" build number 290 originally caused by: Started by upstream project "libvirt-go-build" build number 294 originally caused by: Started by upstream project "libvirt-build" build number 361 originally caused by: Started by an SCM change Started by an SCM change Started by an SCM change Started by an SCM change Started by an SCM change Started by an SCM change Started by an SCM change Started by an SCM change Started by an SCM change Started by an SCM change Started by an SCM change Started by an SCM change Started by an SCM change Started by an SCM change Started by an SCM change Started by an SCM change Started by an SCM change Started by an SCM change [EnvInject] - Loading node environment variables. Building remotely on libvirt-fedora-28 (libvirt) in workspace <https://ci.centos.org/job/libvirt-go-check/systems=libvirt-fedora-28/ws/> [libvirt-go] $ /bin/sh -xe /tmp/jenkins8926387995070491639.sh + export 'TEST_ARGS=-tags api' + TEST_ARGS='-tags api' + go test -tags api Missing function 'virConnectGetStoragePoolCapabilities' --- FAIL: TestAPICoverage (0.65s) panic: Missing symbols found [recovered] panic: Missing symbols found goroutine 5 [running]: testing.tRunner.func1(0xc4200aa0f0) /usr/lib/golang/src/testing/testing.go:742 +0x29d panic(0x5c3ba0, 0x6277b0) /usr/lib/golang/src/runtime/panic.go:502 +0x229 _<https://ci.centos.org/job/libvirt-go-check/systems=libvirt-fedora-28/ws/.TestAPICoverage(0xc4200aa0f0)> <https://ci.centos.org/job/libvirt-go-check/systems=libvirt-fedora-28/ws/api_test.go>:501 +0x548 testing.tRunner(0xc4200aa0f0, 0x612868) /usr/lib/golang/src/testing/testing.go:777 +0xd0 created by testing.(*T).Run /usr/lib/golang/src/testing/testing.go:824 +0x2e0 exit status 2 FAIL _<https://ci.centos.org/job/libvirt-go-check/systems=libvirt-fedora-28/ws/> 0.753s Build step 'Execute shell' marked build as failure

See <https://ci.centos.org/job/libvirt-go-check/systems=libvirt-fedora-28/291/display/redirect> ------------------------------------------ Started by upstream project "libvirt-go-check" build number 291 originally caused by: Started by upstream project "libvirt-go-build" build number 295 originally caused by: Started by upstream project "libvirt-build" build number 362 originally caused by: Started by an SCM change Started by an SCM change Started by an SCM change Started by an SCM change Started by an SCM change Started by an SCM change Started by an SCM change Started by an SCM change Started by an SCM change Started by an SCM change Started by an SCM change Started by an SCM change Started by an SCM change Started by an SCM change Started by an SCM change Started by an SCM change [EnvInject] - Loading node environment variables. Building remotely on libvirt-fedora-28 (libvirt) in workspace <https://ci.centos.org/job/libvirt-go-check/systems=libvirt-fedora-28/ws/> [libvirt-go] $ /bin/sh -xe /tmp/jenkins7205302214884265871.sh + export 'TEST_ARGS=-tags api' + TEST_ARGS='-tags api' + go test -tags api Missing function 'virConnectGetStoragePoolCapabilities' --- FAIL: TestAPICoverage (0.17s) panic: Missing symbols found [recovered] panic: Missing symbols found goroutine 5 [running]: testing.tRunner.func1(0xc4200aa0f0) /usr/lib/golang/src/testing/testing.go:742 +0x29d panic(0x5c3ba0, 0x6277b0) /usr/lib/golang/src/runtime/panic.go:502 +0x229 _<https://ci.centos.org/job/libvirt-go-check/systems=libvirt-fedora-28/ws/.TestAPICoverage(0xc4200aa0f0)> <https://ci.centos.org/job/libvirt-go-check/systems=libvirt-fedora-28/ws/api_test.go>:501 +0x548 testing.tRunner(0xc4200aa0f0, 0x612868) /usr/lib/golang/src/testing/testing.go:777 +0xd0 created by testing.(*T).Run /usr/lib/golang/src/testing/testing.go:824 +0x2e0 exit status 2 FAIL _<https://ci.centos.org/job/libvirt-go-check/systems=libvirt-fedora-28/ws/> 0.214s Build step 'Execute shell' marked build as failure

See <https://ci.centos.org/job/libvirt-go-check/systems=libvirt-fedora-28/292/display/redirect> ------------------------------------------ Started by upstream project "libvirt-go-check" build number 292 originally caused by: Started by upstream project "libvirt-go-build" build number 296 originally caused by: Started by upstream project "libvirt-build" build number 363 originally caused by: Started by an SCM change Started by an SCM change Started by an SCM change Started by an SCM change Started by an SCM change Started by an SCM change Started by an SCM change Started by an SCM change Started by an SCM change Started by an SCM change [EnvInject] - Loading node environment variables. Building remotely on libvirt-fedora-28 (libvirt) in workspace <https://ci.centos.org/job/libvirt-go-check/systems=libvirt-fedora-28/ws/> [libvirt-go] $ /bin/sh -xe /tmp/jenkins1174795047827091055.sh + export 'TEST_ARGS=-tags api' + TEST_ARGS='-tags api' + go test -tags api Missing function 'virConnectGetStoragePoolCapabilities' --- FAIL: TestAPICoverage (0.72s) panic: Missing symbols found [recovered] panic: Missing symbols found goroutine 19 [running]: testing.tRunner.func1(0xc4200c60f0) /usr/lib/golang/src/testing/testing.go:742 +0x29d panic(0x5c3ba0, 0x6277b0) /usr/lib/golang/src/runtime/panic.go:502 +0x229 _<https://ci.centos.org/job/libvirt-go-check/systems=libvirt-fedora-28/ws/.TestAPICoverage(0xc4200c60f0)> <https://ci.centos.org/job/libvirt-go-check/systems=libvirt-fedora-28/ws/api_test.go>:501 +0x548 testing.tRunner(0xc4200c60f0, 0x612868) /usr/lib/golang/src/testing/testing.go:777 +0xd0 created by testing.(*T).Run /usr/lib/golang/src/testing/testing.go:824 +0x2e0 exit status 2 FAIL _<https://ci.centos.org/job/libvirt-go-check/systems=libvirt-fedora-28/ws/> 0.845s Build step 'Execute shell' marked build as failure

See <https://ci.centos.org/job/libvirt-go-check/systems=libvirt-fedora-28/293/display/redirect> ------------------------------------------ Started by upstream project "libvirt-go-check" build number 293 originally caused by: Started by upstream project "libvirt-go-build" build number 297 originally caused by: Started by upstream project "libvirt-build" build number 364 originally caused by: Started by an SCM change [EnvInject] - Loading node environment variables. Building remotely on libvirt-fedora-28 (libvirt) in workspace <https://ci.centos.org/job/libvirt-go-check/systems=libvirt-fedora-28/ws/> [libvirt-go] $ /bin/sh -xe /tmp/jenkins9112479376891565267.sh + export 'TEST_ARGS=-tags api' + TEST_ARGS='-tags api' + go test -tags api Missing function 'virConnectGetStoragePoolCapabilities' --- FAIL: TestAPICoverage (0.38s) panic: Missing symbols found [recovered] panic: Missing symbols found goroutine 19 [running]: testing.tRunner.func1(0xc4200c60f0) /usr/lib/golang/src/testing/testing.go:742 +0x29d panic(0x5c3ba0, 0x6277b0) /usr/lib/golang/src/runtime/panic.go:502 +0x229 _<https://ci.centos.org/job/libvirt-go-check/systems=libvirt-fedora-28/ws/.TestAPICoverage(0xc4200c60f0)> <https://ci.centos.org/job/libvirt-go-check/systems=libvirt-fedora-28/ws/api_test.go>:501 +0x548 testing.tRunner(0xc4200c60f0, 0x612868) /usr/lib/golang/src/testing/testing.go:777 +0xd0 created by testing.(*T).Run /usr/lib/golang/src/testing/testing.go:824 +0x2e0 exit status 2 FAIL _<https://ci.centos.org/job/libvirt-go-check/systems=libvirt-fedora-28/ws/> 0.466s Build step 'Execute shell' marked build as failure

See <https://ci.centos.org/job/libvirt-go-check/systems=libvirt-fedora-28/294/display/redirect> ------------------------------------------ Started by upstream project "libvirt-go-check" build number 294 originally caused by: Started by upstream project "libvirt-go-build" build number 298 originally caused by: Started by upstream project "libvirt-build" build number 365 originally caused by: Started by an SCM change [EnvInject] - Loading node environment variables. Building remotely on libvirt-fedora-28 (libvirt) in workspace <https://ci.centos.org/job/libvirt-go-check/systems=libvirt-fedora-28/ws/> [libvirt-go] $ /bin/sh -xe /tmp/jenkins6609026714402993367.sh + export 'TEST_ARGS=-tags api' + TEST_ARGS='-tags api' + go test -tags api Missing function 'virConnectGetStoragePoolCapabilities' --- FAIL: TestAPICoverage (0.70s) panic: Missing symbols found [recovered] panic: Missing symbols found goroutine 5 [running]: testing.tRunner.func1(0xc4200aa0f0) /usr/lib/golang/src/testing/testing.go:742 +0x29d panic(0x5c3ba0, 0x6277b0) /usr/lib/golang/src/runtime/panic.go:502 +0x229 _<https://ci.centos.org/job/libvirt-go-check/systems=libvirt-fedora-28/ws/.TestAPICoverage(0xc4200aa0f0)> <https://ci.centos.org/job/libvirt-go-check/systems=libvirt-fedora-28/ws/api_test.go>:501 +0x548 testing.tRunner(0xc4200aa0f0, 0x612868) /usr/lib/golang/src/testing/testing.go:777 +0xd0 created by testing.(*T).Run /usr/lib/golang/src/testing/testing.go:824 +0x2e0 exit status 2 FAIL _<https://ci.centos.org/job/libvirt-go-check/systems=libvirt-fedora-28/ws/> 0.835s Build step 'Execute shell' marked build as failure

See <https://ci.centos.org/job/libvirt-go-check/systems=libvirt-fedora-28/295/display/redirect> ------------------------------------------ Started by upstream project "libvirt-go-check" build number 295 originally caused by: Started by upstream project "libvirt-go-build" build number 299 originally caused by: Started by upstream project "libvirt-build" build number 366 originally caused by: Started by an SCM change [EnvInject] - Loading node environment variables. Building remotely on libvirt-fedora-28 (libvirt) in workspace <https://ci.centos.org/job/libvirt-go-check/systems=libvirt-fedora-28/ws/> [libvirt-go] $ /bin/sh -xe /tmp/jenkins8165856229092151161.sh + export 'TEST_ARGS=-tags api' + TEST_ARGS='-tags api' + go test -tags api Missing function 'virConnectGetStoragePoolCapabilities' --- FAIL: TestAPICoverage (0.47s) panic: Missing symbols found [recovered] panic: Missing symbols found goroutine 19 [running]: testing.tRunner.func1(0xc4200c60f0) /usr/lib/golang/src/testing/testing.go:742 +0x29d panic(0x5c3ba0, 0x6277b0) /usr/lib/golang/src/runtime/panic.go:502 +0x229 _<https://ci.centos.org/job/libvirt-go-check/systems=libvirt-fedora-28/ws/.TestAPICoverage(0xc4200c60f0)> <https://ci.centos.org/job/libvirt-go-check/systems=libvirt-fedora-28/ws/api_test.go>:501 +0x548 testing.tRunner(0xc4200c60f0, 0x612868) /usr/lib/golang/src/testing/testing.go:777 +0xd0 created by testing.(*T).Run /usr/lib/golang/src/testing/testing.go:824 +0x2e0 exit status 2 FAIL _<https://ci.centos.org/job/libvirt-go-check/systems=libvirt-fedora-28/ws/> 0.610s Build step 'Execute shell' marked build as failure

See <https://ci.centos.org/job/libvirt-go-check/systems=libvirt-fedora-28/296/display/redirect> ------------------------------------------ Started by upstream project "libvirt-go-check" build number 296 originally caused by: Started by upstream project "libvirt-go-build" build number 300 originally caused by: Started by upstream project "libvirt-build" build number 367 originally caused by: Started by an SCM change [EnvInject] - Loading node environment variables. Building remotely on libvirt-fedora-28 (libvirt) in workspace <https://ci.centos.org/job/libvirt-go-check/systems=libvirt-fedora-28/ws/> [libvirt-go] $ /bin/sh -xe /tmp/jenkins2133399590115172706.sh + export 'TEST_ARGS=-tags api' + TEST_ARGS='-tags api' + go test -tags api Missing function 'virConnectGetStoragePoolCapabilities' --- FAIL: TestAPICoverage (0.69s) panic: Missing symbols found [recovered] panic: Missing symbols found goroutine 19 [running]: testing.tRunner.func1(0xc4200c60f0) /usr/lib/golang/src/testing/testing.go:742 +0x29d panic(0x5c3ba0, 0x6277b0) /usr/lib/golang/src/runtime/panic.go:502 +0x229 _<https://ci.centos.org/job/libvirt-go-check/systems=libvirt-fedora-28/ws/.TestAPICoverage(0xc4200c60f0)> <https://ci.centos.org/job/libvirt-go-check/systems=libvirt-fedora-28/ws/api_test.go>:501 +0x548 testing.tRunner(0xc4200c60f0, 0x612868) /usr/lib/golang/src/testing/testing.go:777 +0xd0 created by testing.(*T).Run /usr/lib/golang/src/testing/testing.go:824 +0x2e0 exit status 2 FAIL _<https://ci.centos.org/job/libvirt-go-check/systems=libvirt-fedora-28/ws/> 0.956s Build step 'Execute shell' marked build as failure

See <https://ci.centos.org/job/libvirt-go-check/systems=libvirt-fedora-28/297/display/redirect> ------------------------------------------ Started by upstream project "libvirt-go-check" build number 297 originally caused by: Started by upstream project "libvirt-go-build" build number 301 originally caused by: Started by upstream project "libvirt-build" build number 368 originally caused by: Started by an SCM change Started by an SCM change Started by an SCM change Started by an SCM change Started by an SCM change [EnvInject] - Loading node environment variables. Building remotely on libvirt-fedora-28 (libvirt) in workspace <https://ci.centos.org/job/libvirt-go-check/systems=libvirt-fedora-28/ws/> [libvirt-go] $ /bin/sh -xe /tmp/jenkins2964856221895772129.sh + export 'TEST_ARGS=-tags api' + TEST_ARGS='-tags api' + go test -tags api Missing function 'virConnectGetStoragePoolCapabilities' --- FAIL: TestAPICoverage (0.74s) panic: Missing symbols found [recovered] panic: Missing symbols found goroutine 5 [running]: testing.tRunner.func1(0xc4200aa0f0) /usr/lib/golang/src/testing/testing.go:742 +0x29d panic(0x5c3ba0, 0x6277b0) /usr/lib/golang/src/runtime/panic.go:502 +0x229 _<https://ci.centos.org/job/libvirt-go-check/systems=libvirt-fedora-28/ws/.TestAPICoverage(0xc4200aa0f0)> <https://ci.centos.org/job/libvirt-go-check/systems=libvirt-fedora-28/ws/api_test.go>:501 +0x548 testing.tRunner(0xc4200aa0f0, 0x612868) /usr/lib/golang/src/testing/testing.go:777 +0xd0 created by testing.(*T).Run /usr/lib/golang/src/testing/testing.go:824 +0x2e0 exit status 2 FAIL _<https://ci.centos.org/job/libvirt-go-check/systems=libvirt-fedora-28/ws/> 0.907s Build step 'Execute shell' marked build as failure

See <https://ci.centos.org/job/libvirt-go-check/systems=libvirt-fedora-28/298/display/redirect> ------------------------------------------ Started by upstream project "libvirt-go-check" build number 298 originally caused by: Started by upstream project "libvirt-go-build" build number 302 originally caused by: Started by upstream project "libvirt-build" build number 370 originally caused by: Started by an SCM change Started by an SCM change Started by an SCM change Started by an SCM change [EnvInject] - Loading node environment variables. Building remotely on libvirt-fedora-28 (libvirt) in workspace <https://ci.centos.org/job/libvirt-go-check/systems=libvirt-fedora-28/ws/> [libvirt-go] $ /bin/sh -xe /tmp/jenkins6250486926113152321.sh + export 'TEST_ARGS=-tags api' + TEST_ARGS='-tags api' + go test -tags api Missing function 'virConnectGetStoragePoolCapabilities' --- FAIL: TestAPICoverage (0.47s) panic: Missing symbols found [recovered] panic: Missing symbols found goroutine 19 [running]: testing.tRunner.func1(0xc4200c60f0) /usr/lib/golang/src/testing/testing.go:742 +0x29d panic(0x5c3ba0, 0x6277b0) /usr/lib/golang/src/runtime/panic.go:502 +0x229 _<https://ci.centos.org/job/libvirt-go-check/systems=libvirt-fedora-28/ws/.TestAPICoverage(0xc4200c60f0)> <https://ci.centos.org/job/libvirt-go-check/systems=libvirt-fedora-28/ws/api_test.go>:501 +0x548 testing.tRunner(0xc4200c60f0, 0x612868) /usr/lib/golang/src/testing/testing.go:777 +0xd0 created by testing.(*T).Run /usr/lib/golang/src/testing/testing.go:824 +0x2e0 exit status 2 FAIL _<https://ci.centos.org/job/libvirt-go-check/systems=libvirt-fedora-28/ws/> 0.623s Build step 'Execute shell' marked build as failure

See <https://ci.centos.org/job/libvirt-go-check/systems=libvirt-fedora-28/299/display/redirect> ------------------------------------------ Started by upstream project "libvirt-go-check" build number 299 originally caused by: Started by upstream project "libvirt-go-build" build number 303 originally caused by: Started by upstream project "libvirt-build" build number 371 originally caused by: Started by an SCM change [EnvInject] - Loading node environment variables. Building remotely on libvirt-fedora-28 (libvirt) in workspace <https://ci.centos.org/job/libvirt-go-check/systems=libvirt-fedora-28/ws/> [libvirt-go] $ /bin/sh -xe /tmp/jenkins7555246213226134444.sh + export 'TEST_ARGS=-tags api' + TEST_ARGS='-tags api' + go test -tags api Missing function 'virConnectGetStoragePoolCapabilities' --- FAIL: TestAPICoverage (0.96s) panic: Missing symbols found [recovered] panic: Missing symbols found goroutine 19 [running]: testing.tRunner.func1(0xc4200c60f0) /usr/lib/golang/src/testing/testing.go:742 +0x29d panic(0x5c3ba0, 0x6277b0) /usr/lib/golang/src/runtime/panic.go:502 +0x229 _<https://ci.centos.org/job/libvirt-go-check/systems=libvirt-fedora-28/ws/.TestAPICoverage(0xc4200c60f0)> <https://ci.centos.org/job/libvirt-go-check/systems=libvirt-fedora-28/ws/api_test.go>:501 +0x548 testing.tRunner(0xc4200c60f0, 0x612868) /usr/lib/golang/src/testing/testing.go:777 +0xd0 created by testing.(*T).Run /usr/lib/golang/src/testing/testing.go:824 +0x2e0 exit status 2 FAIL _<https://ci.centos.org/job/libvirt-go-check/systems=libvirt-fedora-28/ws/> 1.311s Build step 'Execute shell' marked build as failure

See <https://ci.centos.org/job/libvirt-go-check/systems=libvirt-fedora-28/300/display/redirect> ------------------------------------------ Started by upstream project "libvirt-go-check" build number 300 originally caused by: Started by upstream project "libvirt-go-build" build number 304 originally caused by: Started by upstream project "libvirt-build" build number 372 originally caused by: Started by an SCM change [EnvInject] - Loading node environment variables. Building remotely on libvirt-fedora-28 (libvirt) in workspace <https://ci.centos.org/job/libvirt-go-check/systems=libvirt-fedora-28/ws/> [libvirt-go] $ /bin/sh -xe /tmp/jenkins5923512511636318904.sh + export 'TEST_ARGS=-tags api' + TEST_ARGS='-tags api' + go test -tags api Missing function 'virConnectGetStoragePoolCapabilities' --- FAIL: TestAPICoverage (0.55s) panic: Missing symbols found [recovered] panic: Missing symbols found goroutine 5 [running]: testing.tRunner.func1(0xc4200aa0f0) /usr/lib/golang/src/testing/testing.go:742 +0x29d panic(0x5c3ba0, 0x6277b0) /usr/lib/golang/src/runtime/panic.go:502 +0x229 _<https://ci.centos.org/job/libvirt-go-check/systems=libvirt-fedora-28/ws/.TestAPICoverage(0xc4200aa0f0)> <https://ci.centos.org/job/libvirt-go-check/systems=libvirt-fedora-28/ws/api_test.go>:501 +0x548 testing.tRunner(0xc4200aa0f0, 0x612868) /usr/lib/golang/src/testing/testing.go:777 +0xd0 created by testing.(*T).Run /usr/lib/golang/src/testing/testing.go:824 +0x2e0 exit status 2 FAIL _<https://ci.centos.org/job/libvirt-go-check/systems=libvirt-fedora-28/ws/> 0.800s Build step 'Execute shell' marked build as failure

participants (1)
-
ci@centos.org