Build failed in Jenkins: virt-manager-check » libvirt-debian-9 #1456

See <https://ci.centos.org/job/virt-manager-check/systems=libvirt-debian-9/1456/display/redirect> ------------------------------------------ Started by upstream project "virt-manager-check" build number 1456 originally caused by: Started by upstream project "virt-manager-build" build number 1460 originally caused by: Started by an SCM change Running as SYSTEM [EnvInject] - Loading node environment variables. Building remotely on libvirt-debian-9 (libvirt) in workspace <https://ci.centos.org/job/virt-manager-check/systems=libvirt-debian-9/ws/> [virt-manager] $ /bin/sh -xe /tmp/jenkins9219505022267693857.sh + /usr/bin/python3 ./setup.py test running test ............................................................F........................................................................................................................................................................................................................................................................................................................................................................................................................................................................................................................sssssssssssssssss ====================================================================== FAIL: test_dir_searchable (tests.test_xmlconfig.TestXMLMisc) ---------------------------------------------------------------------- Traceback (most recent call last): File "<https://ci.centos.org/job/virt-manager-check/systems=libvirt-debian-9/ws/tests/utils.py",> line 230, in wrapper_cb return cb(*args, **kwargs) File "<https://ci.centos.org/job/virt-manager-check/systems=libvirt-debian-9/ws/tests/test_xmlconfig.py",> line 205, in test_dir_searchable self.assertEqual(searchdata.user, "qemu") AssertionError: '_chrony' != 'qemu' - _chrony + qemu ---------------------------------------------------------------------- Ran 582 tests in 103.816s FAILED (failures=1, skipped=17) Build step 'Execute shell' marked build as failure

See <https://ci.centos.org/job/virt-manager-check/systems=libvirt-debian-9/1457/display/redirect> ------------------------------------------ Started by upstream project "virt-manager-check" build number 1457 originally caused by: Started by upstream project "virt-manager-build" build number 1461 originally caused by: Started by an SCM change Running as SYSTEM [EnvInject] - Loading node environment variables. Building remotely on libvirt-debian-9 (libvirt) in workspace <https://ci.centos.org/job/virt-manager-check/systems=libvirt-debian-9/ws/> [virt-manager] $ /bin/sh -xe /tmp/jenkins6031855205109796555.sh + /usr/bin/python3 ./setup.py test running test ............................................................F.......................................................................................................................................................................................................................................................................................................................................................................................................................................................................................................................sssssssssssssssss ====================================================================== FAIL: test_dir_searchable (tests.test_xmlconfig.TestXMLMisc) ---------------------------------------------------------------------- Traceback (most recent call last): File "<https://ci.centos.org/job/virt-manager-check/systems=libvirt-debian-9/ws/tests/utils.py",> line 230, in wrapper_cb return cb(*args, **kwargs) File "<https://ci.centos.org/job/virt-manager-check/systems=libvirt-debian-9/ws/tests/test_xmlconfig.py",> line 205, in test_dir_searchable self.assertEqual(searchdata.user, "qemu") AssertionError: '_chrony' != 'qemu' - _chrony + qemu ---------------------------------------------------------------------- Ran 581 tests in 70.292s FAILED (failures=1, skipped=17) Build step 'Execute shell' marked build as failure

See <https://ci.centos.org/job/virt-manager-check/systems=libvirt-debian-9/1458/display/redirect> ------------------------------------------ Started by upstream project "virt-manager-check" build number 1458 originally caused by: Started by upstream project "virt-manager-build" build number 1462 originally caused by: Started by upstream project "libvirt-python-build" build number 988 originally caused by: Started by upstream project "libvirt-build" build number 1143 originally caused by: Started by an SCM change Running as SYSTEM [EnvInject] - Loading node environment variables. Building remotely on libvirt-debian-9 (libvirt) in workspace <https://ci.centos.org/job/virt-manager-check/systems=libvirt-debian-9/ws/> [virt-manager] $ /bin/sh -xe /tmp/jenkins2988182019897335377.sh + /usr/bin/python3 ./setup.py test running test ............................................................F.......................................................................................................................................................................................................................................................................................................................................................................................................................................................................................................................sssssssssssssssss ====================================================================== FAIL: test_dir_searchable (tests.test_xmlconfig.TestXMLMisc) ---------------------------------------------------------------------- Traceback (most recent call last): File "<https://ci.centos.org/job/virt-manager-check/systems=libvirt-debian-9/ws/tests/utils.py",> line 230, in wrapper_cb return cb(*args, **kwargs) File "<https://ci.centos.org/job/virt-manager-check/systems=libvirt-debian-9/ws/tests/test_xmlconfig.py",> line 205, in test_dir_searchable self.assertEqual(searchdata.user, "qemu") AssertionError: '_chrony' != 'qemu' - _chrony + qemu ---------------------------------------------------------------------- Ran 581 tests in 128.325s FAILED (failures=1, skipped=17) Build step 'Execute shell' marked build as failure

See <https://ci.centos.org/job/virt-manager-check/systems=libvirt-debian-9/1459/display/redirect> ------------------------------------------ Started by upstream project "virt-manager-check" build number 1459 originally caused by: Started by upstream project "virt-manager-build" build number 1463 originally caused by: Started by upstream project "libvirt-python-build" build number 989 originally caused by: Started by upstream project "libvirt-build" build number 1144 originally caused by: Started by an SCM change Running as SYSTEM [EnvInject] - Loading node environment variables. Building remotely on libvirt-debian-9 (libvirt) in workspace <https://ci.centos.org/job/virt-manager-check/systems=libvirt-debian-9/ws/> [virt-manager] $ /bin/sh -xe /tmp/jenkins1682938410016558655.sh + /usr/bin/python3 ./setup.py test running test ............................................................F.......................................................................................................................................................................................................................................................................................................................................................................................................................................................................................................................sssssssssssssssss ====================================================================== FAIL: test_dir_searchable (tests.test_xmlconfig.TestXMLMisc) ---------------------------------------------------------------------- Traceback (most recent call last): File "<https://ci.centos.org/job/virt-manager-check/systems=libvirt-debian-9/ws/tests/utils.py",> line 230, in wrapper_cb return cb(*args, **kwargs) File "<https://ci.centos.org/job/virt-manager-check/systems=libvirt-debian-9/ws/tests/test_xmlconfig.py",> line 205, in test_dir_searchable self.assertEqual(searchdata.user, "qemu") AssertionError: '_chrony' != 'qemu' - _chrony + qemu ---------------------------------------------------------------------- Ran 581 tests in 191.096s FAILED (failures=1, skipped=17) Build step 'Execute shell' marked build as failure

See <https://ci.centos.org/job/virt-manager-check/systems=libvirt-debian-9/1460/display/redirect> ------------------------------------------ Started by upstream project "virt-manager-check" build number 1460 originally caused by: Started by upstream project "virt-manager-build" build number 1464 originally caused by: Started by upstream project "libvirt-python-build" build number 990 originally caused by: Started by upstream project "libvirt-build" build number 1145 originally caused by: Started by an SCM change Running as SYSTEM [EnvInject] - Loading node environment variables. Building remotely on libvirt-debian-9 (libvirt) in workspace <https://ci.centos.org/job/virt-manager-check/systems=libvirt-debian-9/ws/> [virt-manager] $ /bin/sh -xe /tmp/jenkins7335789709235807445.sh + /usr/bin/python3 ./setup.py test running test ............................................................F.......................................................................................................................................................................................................................................................................................................................................................................................................................................................................................................................sssssssssssssssss ====================================================================== FAIL: test_dir_searchable (tests.test_xmlconfig.TestXMLMisc) ---------------------------------------------------------------------- Traceback (most recent call last): File "<https://ci.centos.org/job/virt-manager-check/systems=libvirt-debian-9/ws/tests/utils.py",> line 230, in wrapper_cb return cb(*args, **kwargs) File "<https://ci.centos.org/job/virt-manager-check/systems=libvirt-debian-9/ws/tests/test_xmlconfig.py",> line 205, in test_dir_searchable self.assertEqual(searchdata.user, "qemu") AssertionError: '_chrony' != 'qemu' - _chrony + qemu ---------------------------------------------------------------------- Ran 581 tests in 89.944s FAILED (failures=1, skipped=17) Build step 'Execute shell' marked build as failure

participants (1)
-
ci@centos.org