[Libvirt-ci] Build failed in Jenkins: libvirt-go-xml-master-check » libvirt-debian-8 #459

See <https://ci.centos.org/job/libvirt-go-xml-master-check/systems=libvirt-debian-8/459/display/redirect> ------------------------------------------ Started by upstream project "libvirt-go-xml-master-check" build number 459 originally caused by: Started by upstream project "libvirt-go-xml-master-build" build number 467 originally caused by: Started by upstream project "libvirt-master-build" build number 1519 originally caused by: Started by an SCM change Started by an SCM change [EnvInject] - Loading node environment variables. Building remotely on libvirt-debian-8 (libvirt) in workspace <https://ci.centos.org/job/libvirt-go-xml-master-check/systems=libvirt-debian-8/ws/> [libvirt-go-xml-master] $ /bin/sh -xe /tmp/jenkins1461296240993036955.sh + export TEST_ARGS=-tags xmlroundtrip + go test -tags xmlroundtrip --- FAIL: TestRoundTrip (5.46 seconds) xml_test.go:383: testdata/libvirt/tests/genericxml2xmlindata/launch-security-sev.xml: /domain[0]/launch-security[0]: element in expected XML missing in actual XML FAIL exit status 1 FAIL _<https://ci.centos.org/job/libvirt-go-xml-master-check/systems=libvirt-debian-8/ws/> 5.533s Build step 'Execute shell' marked build as failure

See <https://ci.centos.org/job/libvirt-go-xml-master-check/systems=libvirt-debian-8/460/display/redirect> ------------------------------------------ Started by upstream project "libvirt-go-xml-master-check" build number 460 originally caused by: Started by upstream project "libvirt-go-xml-master-build" build number 468 originally caused by: Started by upstream project "libvirt-master-build" build number 1520 originally caused by: Started by an SCM change Started by an SCM change Started by an SCM change Started by an SCM change [EnvInject] - Loading node environment variables. Building remotely on libvirt-debian-8 (libvirt) in workspace <https://ci.centos.org/job/libvirt-go-xml-master-check/systems=libvirt-debian-8/ws/> [libvirt-go-xml-master] $ /bin/sh -xe /tmp/jenkins2016003343156837790.sh + export TEST_ARGS=-tags xmlroundtrip + go test -tags xmlroundtrip --- FAIL: TestRoundTrip (6.86 seconds) xml_test.go:383: testdata/libvirt/tests/genericxml2xmlindata/launch-security-sev.xml: /domain[0]/launch-security[0]: element in expected XML missing in actual XML FAIL exit status 1 FAIL _<https://ci.centos.org/job/libvirt-go-xml-master-check/systems=libvirt-debian-8/ws/> 7.321s Build step 'Execute shell' marked build as failure

See <https://ci.centos.org/job/libvirt-go-xml-master-check/systems=libvirt-debian-8/461/display/redirect> ------------------------------------------ Started by upstream project "libvirt-go-xml-master-check" build number 461 originally caused by: Started by upstream project "libvirt-go-xml-master-build" build number 469 originally caused by: Started by upstream project "libvirt-master-build" build number 1521 originally caused by: Started by an SCM change [EnvInject] - Loading node environment variables. Building remotely on libvirt-debian-8 (libvirt) in workspace <https://ci.centos.org/job/libvirt-go-xml-master-check/systems=libvirt-debian-8/ws/> [libvirt-go-xml-master] $ /bin/sh -xe /tmp/jenkins3993907022890689842.sh + export TEST_ARGS=-tags xmlroundtrip + go test -tags xmlroundtrip --- FAIL: TestRoundTrip (9.82 seconds) xml_test.go:383: testdata/libvirt/tests/genericxml2xmlindata/launch-security-sev.xml: /domain[0]/launch-security[0]: element in expected XML missing in actual XML FAIL exit status 1 FAIL _<https://ci.centos.org/job/libvirt-go-xml-master-check/systems=libvirt-debian-8/ws/> 10.015s Build step 'Execute shell' marked build as failure

See <https://ci.centos.org/job/libvirt-go-xml-master-check/systems=libvirt-debian-8/462/display/redirect> ------------------------------------------ Started by upstream project "libvirt-go-xml-master-check" build number 462 originally caused by: Started by upstream project "libvirt-go-xml-master-build" build number 470 originally caused by: Started by upstream project "libvirt-master-build" build number 1522 originally caused by: Started by an SCM change [EnvInject] - Loading node environment variables. Building remotely on libvirt-debian-8 (libvirt) in workspace <https://ci.centos.org/job/libvirt-go-xml-master-check/systems=libvirt-debian-8/ws/> [libvirt-go-xml-master] $ /bin/sh -xe /tmp/jenkins2250236153309098092.sh + export TEST_ARGS=-tags xmlroundtrip + go test -tags xmlroundtrip --- FAIL: TestRoundTrip (7.48 seconds) xml_test.go:383: testdata/libvirt/tests/genericxml2xmlindata/launch-security-sev.xml: /domain[0]/launch-security[0]: element in expected XML missing in actual XML FAIL exit status 1 FAIL _<https://ci.centos.org/job/libvirt-go-xml-master-check/systems=libvirt-debian-8/ws/> 7.771s Build step 'Execute shell' marked build as failure

See <https://ci.centos.org/job/libvirt-go-xml-master-check/systems=libvirt-debian-8/463/display/redirect> ------------------------------------------ Started by upstream project "libvirt-go-xml-master-check" build number 463 originally caused by: Started by upstream project "libvirt-go-xml-master-build" build number 471 originally caused by: Started by upstream project "libvirt-master-build" build number 1523 originally caused by: Started by an SCM change [EnvInject] - Loading node environment variables. Building remotely on libvirt-debian-8 (libvirt) in workspace <https://ci.centos.org/job/libvirt-go-xml-master-check/systems=libvirt-debian-8/ws/> [libvirt-go-xml-master] $ /bin/sh -xe /tmp/jenkins7581304101959416189.sh + export TEST_ARGS=-tags xmlroundtrip + go test -tags xmlroundtrip --- FAIL: TestRoundTrip (17.50 seconds) xml_test.go:383: testdata/libvirt/tests/genericxml2xmlindata/launch-security-sev.xml: /domain[0]/launch-security[0]: element in expected XML missing in actual XML FAIL exit status 1 FAIL _<https://ci.centos.org/job/libvirt-go-xml-master-check/systems=libvirt-debian-8/ws/> 17.725s Build step 'Execute shell' marked build as failure

See <https://ci.centos.org/job/libvirt-go-xml-master-check/systems=libvirt-debian-8/464/display/redirect> ------------------------------------------ Started by upstream project "libvirt-go-xml-master-check" build number 464 originally caused by: Started by upstream project "libvirt-go-xml-master-build" build number 472 originally caused by: Started by upstream project "libvirt-master-build" build number 1524 originally caused by: Started by an SCM change Started by an SCM change Started by an SCM change [EnvInject] - Loading node environment variables. Building remotely on libvirt-debian-8 (libvirt) in workspace <https://ci.centos.org/job/libvirt-go-xml-master-check/systems=libvirt-debian-8/ws/> [libvirt-go-xml-master] $ /bin/sh -xe /tmp/jenkins6341729798129289905.sh + export TEST_ARGS=-tags xmlroundtrip + go test -tags xmlroundtrip --- FAIL: TestRoundTrip (6.48 seconds) xml_test.go:383: testdata/libvirt/tests/genericxml2xmlindata/launch-security-sev.xml: /domain[0]/launch-security[0]: element in expected XML missing in actual XML FAIL exit status 1 FAIL _<https://ci.centos.org/job/libvirt-go-xml-master-check/systems=libvirt-debian-8/ws/> 6.894s Build step 'Execute shell' marked build as failure

See <https://ci.centos.org/job/libvirt-go-xml-master-check/systems=libvirt-debian-8/465/display/redirect> ------------------------------------------ Started by upstream project "libvirt-go-xml-master-check" build number 465 originally caused by: Started by upstream project "libvirt-go-xml-master-build" build number 473 originally caused by: Started by upstream project "libvirt-master-build" build number 1525 originally caused by: Started by an SCM change [EnvInject] - Loading node environment variables. Building remotely on libvirt-debian-8 (libvirt) in workspace <https://ci.centos.org/job/libvirt-go-xml-master-check/systems=libvirt-debian-8/ws/> [libvirt-go-xml-master] $ /bin/sh -xe /tmp/jenkins7553892502084269710.sh + export TEST_ARGS=-tags xmlroundtrip + go test -tags xmlroundtrip --- FAIL: TestRoundTrip (8.60 seconds) xml_test.go:383: testdata/libvirt/tests/genericxml2xmlindata/launch-security-sev.xml: /domain[0]/launch-security[0]: element in expected XML missing in actual XML FAIL exit status 1 FAIL _<https://ci.centos.org/job/libvirt-go-xml-master-check/systems=libvirt-debian-8/ws/> 8.878s Build step 'Execute shell' marked build as failure

See <https://ci.centos.org/job/libvirt-go-xml-master-check/systems=libvirt-debian-8/466/display/redirect> ------------------------------------------ Started by upstream project "libvirt-go-xml-master-check" build number 466 originally caused by: Started by upstream project "libvirt-go-xml-master-build" build number 474 originally caused by: Started by upstream project "libvirt-master-build" build number 1526 originally caused by: Started by an SCM change [EnvInject] - Loading node environment variables. Building remotely on libvirt-debian-8 (libvirt) in workspace <https://ci.centos.org/job/libvirt-go-xml-master-check/systems=libvirt-debian-8/ws/> [libvirt-go-xml-master] $ /bin/sh -xe /tmp/jenkins4747428101123658382.sh + export TEST_ARGS=-tags xmlroundtrip + go test -tags xmlroundtrip --- FAIL: TestRoundTrip (8.30 seconds) xml_test.go:383: testdata/libvirt/tests/genericxml2xmlindata/launch-security-sev.xml: /domain[0]/launchSecurity[0]: element in expected XML missing in actual XML FAIL exit status 1 FAIL _<https://ci.centos.org/job/libvirt-go-xml-master-check/systems=libvirt-debian-8/ws/> 8.465s Build step 'Execute shell' marked build as failure

See <https://ci.centos.org/job/libvirt-go-xml-master-check/systems=libvirt-debian-8/467/display/redirect> ------------------------------------------ Started by upstream project "libvirt-go-xml-master-check" build number 467 originally caused by: Started by upstream project "libvirt-go-xml-master-build" build number 475 originally caused by: Started by upstream project "libvirt-master-build" build number 1527 originally caused by: Started by an SCM change [EnvInject] - Loading node environment variables. Building remotely on libvirt-debian-8 (libvirt) in workspace <https://ci.centos.org/job/libvirt-go-xml-master-check/systems=libvirt-debian-8/ws/> [libvirt-go-xml-master] $ /bin/sh -xe /tmp/jenkins1304806791246003767.sh + export TEST_ARGS=-tags xmlroundtrip + go test -tags xmlroundtrip --- FAIL: TestRoundTrip (8.12 seconds) xml_test.go:383: testdata/libvirt/tests/genericxml2xmlindata/launch-security-sev.xml: /domain[0]/launchSecurity[0]: element in expected XML missing in actual XML FAIL exit status 1 FAIL _<https://ci.centos.org/job/libvirt-go-xml-master-check/systems=libvirt-debian-8/ws/> 8.453s Build step 'Execute shell' marked build as failure

See <https://ci.centos.org/job/libvirt-go-xml-master-check/systems=libvirt-debian-8/468/display/redirect> ------------------------------------------ Started by upstream project "libvirt-go-xml-master-check" build number 468 originally caused by: Started by upstream project "libvirt-go-xml-master-build" build number 476 originally caused by: Started by upstream project "libvirt-master-build" build number 1528 originally caused by: Started by an SCM change [EnvInject] - Loading node environment variables. Building remotely on libvirt-debian-8 (libvirt) in workspace <https://ci.centos.org/job/libvirt-go-xml-master-check/systems=libvirt-debian-8/ws/> [libvirt-go-xml-master] $ /bin/sh -xe /tmp/jenkins5659449538099140026.sh + export TEST_ARGS=-tags xmlroundtrip + go test -tags xmlroundtrip --- FAIL: TestRoundTrip (15.89 seconds) xml_test.go:383: testdata/libvirt/tests/genericxml2xmlindata/launch-security-sev.xml: /domain[0]/launchSecurity[0]: element in expected XML missing in actual XML FAIL exit status 1 FAIL _<https://ci.centos.org/job/libvirt-go-xml-master-check/systems=libvirt-debian-8/ws/> 16.139s Build step 'Execute shell' marked build as failure

See <https://ci.centos.org/job/libvirt-go-xml-master-check/systems=libvirt-debian-8/469/display/redirect> ------------------------------------------ Started by upstream project "libvirt-go-xml-master-check" build number 469 originally caused by: Started by upstream project "libvirt-go-xml-master-build" build number 477 originally caused by: Started by upstream project "libvirt-master-build" build number 1529 originally caused by: Started by an SCM change Started by an SCM change Started by an SCM change [EnvInject] - Loading node environment variables. Building remotely on libvirt-debian-8 (libvirt) in workspace <https://ci.centos.org/job/libvirt-go-xml-master-check/systems=libvirt-debian-8/ws/> [libvirt-go-xml-master] $ /bin/sh -xe /tmp/jenkins4217613602300756911.sh + export TEST_ARGS=-tags xmlroundtrip + go test -tags xmlroundtrip --- FAIL: TestRoundTrip (5.29 seconds) xml_test.go:383: testdata/libvirt/tests/genericxml2xmlindata/launch-security-sev.xml: /domain[0]/launchSecurity[0]: element in expected XML missing in actual XML FAIL exit status 1 FAIL _<https://ci.centos.org/job/libvirt-go-xml-master-check/systems=libvirt-debian-8/ws/> 5.543s Build step 'Execute shell' marked build as failure

See <https://ci.centos.org/job/libvirt-go-xml-master-check/systems=libvirt-debian-8/470/display/redirect> ------------------------------------------ Started by upstream project "libvirt-go-xml-master-check" build number 470 originally caused by: Started by upstream project "libvirt-go-xml-master-build" build number 478 originally caused by: Started by upstream project "libvirt-master-build" build number 1530 originally caused by: Started by an SCM change [EnvInject] - Loading node environment variables. Building remotely on libvirt-debian-8 (libvirt) in workspace <https://ci.centos.org/job/libvirt-go-xml-master-check/systems=libvirt-debian-8/ws/> [libvirt-go-xml-master] $ /bin/sh -xe /tmp/jenkins6842874372857373392.sh + export TEST_ARGS=-tags xmlroundtrip + go test -tags xmlroundtrip --- FAIL: TestRoundTrip (9.06 seconds) xml_test.go:383: testdata/libvirt/tests/genericxml2xmlindata/launch-security-sev.xml: /domain[0]/launchSecurity[0]: element in expected XML missing in actual XML FAIL exit status 1 FAIL _<https://ci.centos.org/job/libvirt-go-xml-master-check/systems=libvirt-debian-8/ws/> 9.352s Build step 'Execute shell' marked build as failure

See <https://ci.centos.org/job/libvirt-go-xml-master-check/systems=libvirt-debian-8/471/display/redirect> ------------------------------------------ Started by upstream project "libvirt-go-xml-master-check" build number 471 originally caused by: Started by upstream project "libvirt-go-xml-master-build" build number 479 originally caused by: Started by upstream project "libvirt-master-build" build number 1531 originally caused by: Started by an SCM change [EnvInject] - Loading node environment variables. Building remotely on libvirt-debian-8 (libvirt) in workspace <https://ci.centos.org/job/libvirt-go-xml-master-check/systems=libvirt-debian-8/ws/> [libvirt-go-xml-master] $ /bin/sh -xe /tmp/jenkins7886512035081401665.sh + export TEST_ARGS=-tags xmlroundtrip + go test -tags xmlroundtrip --- FAIL: TestRoundTrip (8.78 seconds) xml_test.go:383: testdata/libvirt/tests/genericxml2xmlindata/launch-security-sev.xml: /domain[0]/launchSecurity[0]: element in expected XML missing in actual XML FAIL exit status 1 FAIL _<https://ci.centos.org/job/libvirt-go-xml-master-check/systems=libvirt-debian-8/ws/> 9.047s Build step 'Execute shell' marked build as failure

See <https://ci.centos.org/job/libvirt-go-xml-master-check/systems=libvirt-debian-8/472/display/redirect> ------------------------------------------ Started by upstream project "libvirt-go-xml-master-check" build number 472 originally caused by: Started by upstream project "libvirt-go-xml-master-build" build number 480 originally caused by: Started by upstream project "libvirt-master-build" build number 1532 originally caused by: Started by an SCM change [EnvInject] - Loading node environment variables. Building remotely on libvirt-debian-8 (libvirt) in workspace <https://ci.centos.org/job/libvirt-go-xml-master-check/systems=libvirt-debian-8/ws/> [libvirt-go-xml-master] $ /bin/sh -xe /tmp/jenkins5991426323007748499.sh + export TEST_ARGS=-tags xmlroundtrip + go test -tags xmlroundtrip --- FAIL: TestRoundTrip (4.32 seconds) xml_test.go:383: testdata/libvirt/tests/genericxml2xmlindata/launch-security-sev.xml: /domain[0]/launchSecurity[0]: element in expected XML missing in actual XML FAIL exit status 1 FAIL _<https://ci.centos.org/job/libvirt-go-xml-master-check/systems=libvirt-debian-8/ws/> 4.445s Build step 'Execute shell' marked build as failure

See <https://ci.centos.org/job/libvirt-go-xml-master-check/systems=libvirt-debian-8/473/display/redirect> ------------------------------------------ Started by upstream project "libvirt-go-xml-master-check" build number 473 originally caused by: Started by upstream project "libvirt-go-xml-master-build" build number 481 originally caused by: Started by upstream project "libvirt-master-build" build number 1533 originally caused by: Started by an SCM change [EnvInject] - Loading node environment variables. Building remotely on libvirt-debian-8 (libvirt) in workspace <https://ci.centos.org/job/libvirt-go-xml-master-check/systems=libvirt-debian-8/ws/> [libvirt-go-xml-master] $ /bin/sh -xe /tmp/jenkins7763181602853270152.sh + export TEST_ARGS=-tags xmlroundtrip + go test -tags xmlroundtrip --- FAIL: TestRoundTrip (11.19 seconds) xml_test.go:383: testdata/libvirt/tests/genericxml2xmlindata/launch-security-sev.xml: /domain[0]/launchSecurity[0]: element in expected XML missing in actual XML FAIL exit status 1 FAIL _<https://ci.centos.org/job/libvirt-go-xml-master-check/systems=libvirt-debian-8/ws/> 11.509s Build step 'Execute shell' marked build as failure

See <https://ci.centos.org/job/libvirt-go-xml-master-check/systems=libvirt-debian-8/474/display/redirect> ------------------------------------------ Started by upstream project "libvirt-go-xml-master-check" build number 474 originally caused by: Started by upstream project "libvirt-go-xml-master-build" build number 482 originally caused by: Started by upstream project "libvirt-master-build" build number 1534 originally caused by: Started by an SCM change [EnvInject] - Loading node environment variables. Building remotely on libvirt-debian-8 (libvirt) in workspace <https://ci.centos.org/job/libvirt-go-xml-master-check/systems=libvirt-debian-8/ws/> [libvirt-go-xml-master] $ /bin/sh -xe /tmp/jenkins8875836844142665765.sh + export TEST_ARGS=-tags xmlroundtrip + go test -tags xmlroundtrip --- FAIL: TestRoundTrip (8.47 seconds) xml_test.go:383: testdata/libvirt/tests/domaincapsschemadata/basic.xml: /domainCapabilities[0]/features[0]/sev[0]: element in expected XML missing in actual XML FAIL exit status 1 FAIL _<https://ci.centos.org/job/libvirt-go-xml-master-check/systems=libvirt-debian-8/ws/> 8.671s Build step 'Execute shell' marked build as failure

See <https://ci.centos.org/job/libvirt-go-xml-master-check/systems=libvirt-debian-8/475/display/redirect> ------------------------------------------ Started by upstream project "libvirt-go-xml-master-check" build number 475 originally caused by: Started by upstream project "libvirt-go-xml-master-build" build number 483 originally caused by: Started by upstream project "libvirt-master-build" build number 1535 originally caused by: Started by an SCM change [EnvInject] - Loading node environment variables. Building remotely on libvirt-debian-8 (libvirt) in workspace <https://ci.centos.org/job/libvirt-go-xml-master-check/systems=libvirt-debian-8/ws/> [libvirt-go-xml-master] $ /bin/sh -xe /tmp/jenkins8286009383981958619.sh + export TEST_ARGS=-tags xmlroundtrip + go test -tags xmlroundtrip --- FAIL: TestRoundTrip (3.55 seconds) xml_test.go:383: testdata/libvirt/tests/domaincapsschemadata/basic.xml: /domainCapabilities[0]/features[0]/sev[0]: element in expected XML missing in actual XML FAIL exit status 1 FAIL _<https://ci.centos.org/job/libvirt-go-xml-master-check/systems=libvirt-debian-8/ws/> 3.649s Build step 'Execute shell' marked build as failure

See <https://ci.centos.org/job/libvirt-go-xml-master-check/systems=libvirt-debian-8/476/display/redirect> ------------------------------------------ Started by upstream project "libvirt-go-xml-master-check" build number 476 originally caused by: Started by upstream project "libvirt-go-xml-master-build" build number 485 originally caused by: Started by upstream project "libvirt-master-build" build number 1537 originally caused by: Started by user Libvirt [EnvInject] - Loading node environment variables. Building remotely on libvirt-debian-8 (libvirt) in workspace <https://ci.centos.org/job/libvirt-go-xml-master-check/systems=libvirt-debian-8/ws/> [libvirt-go-xml-master] $ /bin/sh -xe /tmp/jenkins6017159687541793776.sh + export TEST_ARGS=-tags xmlroundtrip + go test -tags xmlroundtrip --- FAIL: TestRoundTrip (31.39 seconds) xml_test.go:383: testdata/libvirt/tests/qemuxml2argvdata/name-escape.xml: /domain[0]/devices[0]/smartcard[0]/database[0]: element in expected XML missing in actual XML FAIL exit status 1 FAIL _<https://ci.centos.org/job/libvirt-go-xml-master-check/systems=libvirt-debian-8/ws/> 31.598s Build step 'Execute shell' marked build as failure

See <https://ci.centos.org/job/libvirt-go-xml-master-check/systems=libvirt-debian-8/477/display/redirect> ------------------------------------------ Started by upstream project "libvirt-go-xml-master-check" build number 477 originally caused by: Started by upstream project "libvirt-go-xml-master-build" build number 486 originally caused by: Started by upstream project "libvirt-master-build" build number 1538 originally caused by: Started by an SCM change Started by an SCM change [EnvInject] - Loading node environment variables. Building remotely on libvirt-debian-8 (libvirt) in workspace <https://ci.centos.org/job/libvirt-go-xml-master-check/systems=libvirt-debian-8/ws/> [libvirt-go-xml-master] $ /bin/sh -xe /tmp/jenkins2863010160240786090.sh + export TEST_ARGS=-tags xmlroundtrip + go test -tags xmlroundtrip --- FAIL: TestRoundTrip (18.83 seconds) xml_test.go:383: testdata/libvirt/tests/qemuxml2argvdata/name-escape.xml: /domain[0]/devices[0]/smartcard[0]/database[0]: element in expected XML missing in actual XML FAIL exit status 1 FAIL _<https://ci.centos.org/job/libvirt-go-xml-master-check/systems=libvirt-debian-8/ws/> 19.153s Build step 'Execute shell' marked build as failure

participants (1)
-
ci@centos.org