[Libvirt-ci] Build failed in Jenkins: libvirt-go-xml-check » libvirt-debian-8 #304

See <https://ci.centos.org/job/libvirt-go-xml-check/systems=libvirt-debian-8/304/display/redirect> ------------------------------------------ Started by upstream project "libvirt-go-xml-check" build number 304 originally caused by: Started by upstream project "libvirt-go-xml-build" build number 304 originally caused by: Started by upstream project "libvirt-build" build number 370 originally caused by: Started by an SCM change Started by an SCM change Started by an SCM change Started by an SCM change [EnvInject] - Loading node environment variables. Building remotely on libvirt-debian-8 (libvirt) in workspace <https://ci.centos.org/job/libvirt-go-xml-check/systems=libvirt-debian-8/ws/> [libvirt-go-xml] $ /bin/sh -xe /tmp/jenkins3605089841241990777.sh + export TEST_ARGS=-tags xmlroundtrip + go test -tags xmlroundtrip --- FAIL: TestRoundTrip (7.81s) xml_test.go:400: testdata/libvirt/tests/qemuxml2argvdata/aarch64-virt-graphics.xml: /domain[0]/devices[0]/channel[0]/source[0]: element in expected XML missing in actual XML FAIL exit status 1 FAIL _<https://ci.centos.org/job/libvirt-go-xml-check/systems=libvirt-debian-8/ws/> 7.853s Build step 'Execute shell' marked build as failure

See <https://ci.centos.org/job/libvirt-go-xml-check/systems=libvirt-debian-8/305/display/redirect> ------------------------------------------ Started by upstream project "libvirt-go-xml-check" build number 305 originally caused by: Started by upstream project "libvirt-go-xml-build" build number 305 originally caused by: Started by upstream project "libvirt-build" build number 371 originally caused by: Started by an SCM change [EnvInject] - Loading node environment variables. Building remotely on libvirt-debian-8 (libvirt) in workspace <https://ci.centos.org/job/libvirt-go-xml-check/systems=libvirt-debian-8/ws/> [libvirt-go-xml] $ /bin/sh -xe /tmp/jenkins4231210161725368162.sh + export TEST_ARGS=-tags xmlroundtrip + go test -tags xmlroundtrip --- FAIL: TestRoundTrip (8.28s) xml_test.go:400: testdata/libvirt/tests/qemuxml2argvdata/aarch64-virt-graphics.xml: /domain[0]/devices[0]/channel[0]/source[0]: element in expected XML missing in actual XML FAIL exit status 1 FAIL _<https://ci.centos.org/job/libvirt-go-xml-check/systems=libvirt-debian-8/ws/> 8.347s Build step 'Execute shell' marked build as failure

See <https://ci.centos.org/job/libvirt-go-xml-check/systems=libvirt-debian-8/306/display/redirect> ------------------------------------------ Started by upstream project "libvirt-go-xml-check" build number 306 originally caused by: Started by upstream project "libvirt-go-xml-build" build number 306 originally caused by: Started by upstream project "libvirt-build" build number 372 originally caused by: Started by an SCM change [EnvInject] - Loading node environment variables. Building remotely on libvirt-debian-8 (libvirt) in workspace <https://ci.centos.org/job/libvirt-go-xml-check/systems=libvirt-debian-8/ws/> [libvirt-go-xml] $ /bin/sh -xe /tmp/jenkins4216142403585491139.sh + export TEST_ARGS=-tags xmlroundtrip + go test -tags xmlroundtrip --- FAIL: TestRoundTrip (18.34s) xml_test.go:400: testdata/libvirt/tests/qemuxml2argvdata/aarch64-virt-graphics.xml: /domain[0]/devices[0]/channel[0]/source[0]: element in expected XML missing in actual XML FAIL exit status 1 FAIL _<https://ci.centos.org/job/libvirt-go-xml-check/systems=libvirt-debian-8/ws/> 18.509s Build step 'Execute shell' marked build as failure

See <https://ci.centos.org/job/libvirt-go-xml-check/systems=libvirt-debian-8/307/display/redirect> ------------------------------------------ Started by upstream project "libvirt-go-xml-check" build number 307 originally caused by: Started by upstream project "libvirt-go-xml-build" build number 307 originally caused by: Started by upstream project "libvirt-build" build number 373 originally caused by: Started by an SCM change [EnvInject] - Loading node environment variables. Building remotely on libvirt-debian-8 (libvirt) in workspace <https://ci.centos.org/job/libvirt-go-xml-check/systems=libvirt-debian-8/ws/> [libvirt-go-xml] $ /bin/sh -xe /tmp/jenkins5196987858013679869.sh + export TEST_ARGS=-tags xmlroundtrip + go test -tags xmlroundtrip --- FAIL: TestRoundTrip (9.07s) xml_test.go:400: testdata/libvirt/tests/qemuxml2argvdata/aarch64-virt-graphics.xml: /domain[0]/devices[0]/channel[0]/source[0]: element in expected XML missing in actual XML FAIL exit status 1 FAIL _<https://ci.centos.org/job/libvirt-go-xml-check/systems=libvirt-debian-8/ws/> 9.138s Build step 'Execute shell' marked build as failure

See <https://ci.centos.org/job/libvirt-go-xml-check/systems=libvirt-debian-8/308/display/redirect> ------------------------------------------ Started by upstream project "libvirt-go-xml-check" build number 308 originally caused by: Started by upstream project "libvirt-go-xml-build" build number 308 originally caused by: Started by upstream project "libvirt-build" build number 374 originally caused by: Started by an SCM change Started by an SCM change Started by an SCM change Started by an SCM change [EnvInject] - Loading node environment variables. Building remotely on libvirt-debian-8 (libvirt) in workspace <https://ci.centos.org/job/libvirt-go-xml-check/systems=libvirt-debian-8/ws/> [libvirt-go-xml] $ /bin/sh -xe /tmp/jenkins3581302350932942383.sh + export TEST_ARGS=-tags xmlroundtrip + go test -tags xmlroundtrip --- FAIL: TestRoundTrip (23.19s) xml_test.go:400: testdata/libvirt/tests/qemuxml2argvdata/aarch64-os-firmware-efi.xml: /domain[0]/os[0]/@firmware: attribute 'efi' in expected XML missing in actual XML FAIL exit status 1 FAIL _<https://ci.centos.org/job/libvirt-go-xml-check/systems=libvirt-debian-8/ws/> 23.401s Build step 'Execute shell' marked build as failure

See <https://ci.centos.org/job/libvirt-go-xml-check/systems=libvirt-debian-8/309/display/redirect> ------------------------------------------ Started by upstream project "libvirt-go-xml-check" build number 309 originally caused by: Started by upstream project "libvirt-go-xml-build" build number 309 originally caused by: Started by upstream project "libvirt-build" build number 375 originally caused by: Started by an SCM change Started by an SCM change Started by an SCM change Started by an SCM change Started by an SCM change Started by an SCM change [EnvInject] - Loading node environment variables. Building remotely on libvirt-debian-8 (libvirt) in workspace <https://ci.centos.org/job/libvirt-go-xml-check/systems=libvirt-debian-8/ws/> [libvirt-go-xml] $ /bin/sh -xe /tmp/jenkins2272166367752206397.sh + export TEST_ARGS=-tags xmlroundtrip + go test -tags xmlroundtrip --- FAIL: TestRoundTrip (5.46s) xml_test.go:400: testdata/libvirt/tests/qemuxml2argvdata/aarch64-os-firmware-efi.xml: /domain[0]/os[0]/@firmware: attribute 'efi' in expected XML missing in actual XML FAIL exit status 1 FAIL _<https://ci.centos.org/job/libvirt-go-xml-check/systems=libvirt-debian-8/ws/> 5.497s Build step 'Execute shell' marked build as failure

See <https://ci.centos.org/job/libvirt-go-xml-check/systems=libvirt-debian-8/310/display/redirect> ------------------------------------------ Started by upstream project "libvirt-go-xml-check" build number 310 originally caused by: Started by upstream project "libvirt-go-xml-build" build number 310 originally caused by: Started by an SCM change [EnvInject] - Loading node environment variables. Building remotely on libvirt-debian-8 (libvirt) in workspace <https://ci.centos.org/job/libvirt-go-xml-check/systems=libvirt-debian-8/ws/> [libvirt-go-xml] $ /bin/sh -xe /tmp/jenkins1930773815160667128.sh + export TEST_ARGS=-tags xmlroundtrip + go test -tags xmlroundtrip --- FAIL: TestRoundTrip (8.19s) xml_test.go:400: testdata/libvirt/tests/qemuxml2argvdata/aarch64-virt-graphics.xml: /domain[0]/devices[0]/channel[0]/source[0]: element in expected XML missing in actual XML FAIL exit status 1 FAIL _<https://ci.centos.org/job/libvirt-go-xml-check/systems=libvirt-debian-8/ws/> 8.232s Build step 'Execute shell' marked build as failure

See <https://ci.centos.org/job/libvirt-go-xml-check/systems=libvirt-debian-8/311/display/redirect> ------------------------------------------ Started by upstream project "libvirt-go-xml-check" build number 311 originally caused by: Started by upstream project "libvirt-go-xml-build" build number 311 originally caused by: Started by an SCM change [EnvInject] - Loading node environment variables. Building remotely on libvirt-debian-8 (libvirt) in workspace <https://ci.centos.org/job/libvirt-go-xml-check/systems=libvirt-debian-8/ws/> [libvirt-go-xml] $ /bin/sh -xe /tmp/jenkins6986608832085477387.sh + export TEST_ARGS=-tags xmlroundtrip + go test -tags xmlroundtrip --- FAIL: TestRoundTrip (12.01s) xml_test.go:400: testdata/libvirt/tests/qemuxml2argvdata/aarch64-virt-graphics.xml: /domain[0]/devices[0]/channel[0]/source[0]: element in expected XML missing in actual XML FAIL exit status 1 FAIL _<https://ci.centos.org/job/libvirt-go-xml-check/systems=libvirt-debian-8/ws/> 12.241s Build step 'Execute shell' marked build as failure

See <https://ci.centos.org/job/libvirt-go-xml-check/systems=libvirt-debian-8/312/display/redirect> ------------------------------------------ Started by upstream project "libvirt-go-xml-check" build number 312 originally caused by: Started by upstream project "libvirt-go-xml-build" build number 312 originally caused by: Started by upstream project "libvirt-build" build number 377 originally caused by: Started by an SCM change [EnvInject] - Loading node environment variables. Building remotely on libvirt-debian-8 (libvirt) in workspace <https://ci.centos.org/job/libvirt-go-xml-check/systems=libvirt-debian-8/ws/> [libvirt-go-xml] $ /bin/sh -xe /tmp/jenkins8616888078738094229.sh + export TEST_ARGS=-tags xmlroundtrip + go test -tags xmlroundtrip --- FAIL: TestRoundTrip (3.41s) xml_test.go:400: testdata/libvirt/tests/qemuxml2argvdata/aarch64-virt-graphics.xml: /domain[0]/devices[0]/channel[0]/source[0]: element in expected XML missing in actual XML FAIL exit status 1 FAIL _<https://ci.centos.org/job/libvirt-go-xml-check/systems=libvirt-debian-8/ws/> 3.489s Build step 'Execute shell' marked build as failure

participants (1)
-
ci@centos.org