[Libvirt-ci] Build failed in Jenkins: libvirt-go-check » libvirt-fedora-30 #905

See <https://ci.centos.org/job/libvirt-go-check/systems=libvirt-fedora-30/905/display/redirect> ------------------------------------------ Started by upstream project "libvirt-go-check" build number 905 originally caused by: Started by upstream project "libvirt-go-build" build number 919 originally caused by: Started by upstream project "libvirt-build" build number 1088 originally caused by: Started by an SCM change Running as SYSTEM [EnvInject] - Loading node environment variables. Building remotely on libvirt-fedora-30 (libvirt) in workspace <https://ci.centos.org/job/libvirt-go-check/systems=libvirt-fedora-30/ws/> [libvirt-go] $ /bin/sh -xe /tmp/jenkins14277677892881352919.sh + export 'TEST_ARGS=-tags api' + TEST_ARGS='-tags api' + go test -tags api Missing enum 'VIR_DOMAIN_STATS_MEMORY' --- FAIL: TestAPICoverage (0.41s) panic: Missing symbols found [recovered] panic: Missing symbols found goroutine 19 [running]: testing.tRunner.func1(0xc0000c8100) /usr/lib/golang/src/testing/testing.go:830 +0x392 panic(0x5d26a0, 0x648190) /usr/lib/golang/src/runtime/panic.go:522 +0x1b5 _<https://ci.centos.org/job/libvirt-go-check/systems=libvirt-fedora-30/ws/.TestAPICoverage(0xc0000c8100)> <https://ci.centos.org/job/libvirt-go-check/systems=libvirt-fedora-30/ws/api_test.go>:503 +0x551 testing.tRunner(0xc0000c8100, 0x622630) /usr/lib/golang/src/testing/testing.go:865 +0xc0 created by testing.(*T).Run /usr/lib/golang/src/testing/testing.go:916 +0x35a exit status 2 FAIL _<https://ci.centos.org/job/libvirt-go-check/systems=libvirt-fedora-30/ws/> 0.524s Build step 'Execute shell' marked build as failure

See <https://ci.centos.org/job/libvirt-go-check/systems=libvirt-fedora-30/906/display/redirect> ------------------------------------------ Started by upstream project "libvirt-go-check" build number 906 originally caused by: Started by upstream project "libvirt-go-build" build number 920 originally caused by: Started by upstream project "libvirt-build" build number 1093 originally caused by: Started by an SCM change Running as SYSTEM [EnvInject] - Loading node environment variables. Building remotely on libvirt-fedora-30 (libvirt) in workspace <https://ci.centos.org/job/libvirt-go-check/systems=libvirt-fedora-30/ws/> [libvirt-go] $ /bin/sh -xe /tmp/jenkins15362117696450657031.sh + export 'TEST_ARGS=-tags api' + TEST_ARGS='-tags api' + go test -tags api Missing enum 'VIR_DOMAIN_STATS_MEMORY' --- FAIL: TestAPICoverage (0.95s) panic: Missing symbols found [recovered] panic: Missing symbols found goroutine 5 [running]: testing.tRunner.func1(0xc0000ac100) /usr/lib/golang/src/testing/testing.go:830 +0x392 panic(0x5d26a0, 0x648190) /usr/lib/golang/src/runtime/panic.go:522 +0x1b5 _<https://ci.centos.org/job/libvirt-go-check/systems=libvirt-fedora-30/ws/.TestAPICoverage(0xc0000ac100)> <https://ci.centos.org/job/libvirt-go-check/systems=libvirt-fedora-30/ws/api_test.go>:503 +0x551 testing.tRunner(0xc0000ac100, 0x622630) /usr/lib/golang/src/testing/testing.go:865 +0xc0 created by testing.(*T).Run /usr/lib/golang/src/testing/testing.go:916 +0x35a exit status 2 FAIL _<https://ci.centos.org/job/libvirt-go-check/systems=libvirt-fedora-30/ws/> 1.088s Build step 'Execute shell' marked build as failure

See <https://ci.centos.org/job/libvirt-go-check/systems=libvirt-fedora-30/907/display/redirect> ------------------------------------------ Started by upstream project "libvirt-go-check" build number 907 originally caused by: Started by upstream project "libvirt-go-build" build number 921 originally caused by: Started by upstream project "libvirt-build" build number 1094 originally caused by: Started by an SCM change Running as SYSTEM [EnvInject] - Loading node environment variables. Building remotely on libvirt-fedora-30 (libvirt) in workspace <https://ci.centos.org/job/libvirt-go-check/systems=libvirt-fedora-30/ws/> [libvirt-go] $ /bin/sh -xe /tmp/jenkins751533047818263279.sh + export 'TEST_ARGS=-tags api' + TEST_ARGS='-tags api' + go test -tags api Missing enum 'VIR_DOMAIN_STATS_MEMORY' --- FAIL: TestAPICoverage (1.43s) panic: Missing symbols found [recovered] panic: Missing symbols found goroutine 5 [running]: testing.tRunner.func1(0xc0000ac100) /usr/lib/golang/src/testing/testing.go:830 +0x392 panic(0x5d26a0, 0x648190) /usr/lib/golang/src/runtime/panic.go:522 +0x1b5 _<https://ci.centos.org/job/libvirt-go-check/systems=libvirt-fedora-30/ws/.TestAPICoverage(0xc0000ac100)> <https://ci.centos.org/job/libvirt-go-check/systems=libvirt-fedora-30/ws/api_test.go>:503 +0x551 testing.tRunner(0xc0000ac100, 0x622630) /usr/lib/golang/src/testing/testing.go:865 +0xc0 created by testing.(*T).Run /usr/lib/golang/src/testing/testing.go:916 +0x35a exit status 2 FAIL _<https://ci.centos.org/job/libvirt-go-check/systems=libvirt-fedora-30/ws/> 1.816s Build step 'Execute shell' marked build as failure

See <https://ci.centos.org/job/libvirt-go-check/systems=libvirt-fedora-30/908/display/redirect> ------------------------------------------ Started by upstream project "libvirt-go-check" build number 908 originally caused by: Started by upstream project "libvirt-go-build" build number 922 originally caused by: Started by upstream project "libvirt-build" build number 1095 originally caused by: Started by an SCM change Running as SYSTEM [EnvInject] - Loading node environment variables. Building remotely on libvirt-fedora-30 (libvirt) in workspace <https://ci.centos.org/job/libvirt-go-check/systems=libvirt-fedora-30/ws/> [libvirt-go] $ /bin/sh -xe /tmp/jenkins16951702916955648683.sh + export 'TEST_ARGS=-tags api' + TEST_ARGS='-tags api' + go test -tags api Missing enum 'VIR_DOMAIN_STATS_MEMORY' --- FAIL: TestAPICoverage (1.74s) panic: Missing symbols found [recovered] panic: Missing symbols found goroutine 19 [running]: testing.tRunner.func1(0xc0000c8100) /usr/lib/golang/src/testing/testing.go:830 +0x392 panic(0x5d26a0, 0x648190) /usr/lib/golang/src/runtime/panic.go:522 +0x1b5 _<https://ci.centos.org/job/libvirt-go-check/systems=libvirt-fedora-30/ws/.TestAPICoverage(0xc0000c8100)> <https://ci.centos.org/job/libvirt-go-check/systems=libvirt-fedora-30/ws/api_test.go>:503 +0x551 testing.tRunner(0xc0000c8100, 0x622630) /usr/lib/golang/src/testing/testing.go:865 +0xc0 created by testing.(*T).Run /usr/lib/golang/src/testing/testing.go:916 +0x35a exit status 2 FAIL _<https://ci.centos.org/job/libvirt-go-check/systems=libvirt-fedora-30/ws/> 2.221s Build step 'Execute shell' marked build as failure

See <https://ci.centos.org/job/libvirt-go-check/systems=libvirt-fedora-30/909/display/redirect> ------------------------------------------ Started by upstream project "libvirt-go-check" build number 909 originally caused by: Started by upstream project "libvirt-go-build" build number 923 originally caused by: Started by upstream project "libvirt-build" build number 1096 originally caused by: Started by an SCM change Running as SYSTEM [EnvInject] - Loading node environment variables. Building remotely on libvirt-fedora-30 (libvirt) in workspace <https://ci.centos.org/job/libvirt-go-check/systems=libvirt-fedora-30/ws/> [libvirt-go] $ /bin/sh -xe /tmp/jenkins10208820799602716924.sh + export 'TEST_ARGS=-tags api' + TEST_ARGS='-tags api' + go test -tags api Missing enum 'VIR_DOMAIN_STATS_MEMORY' --- FAIL: TestAPICoverage (1.41s) panic: Missing symbols found [recovered] panic: Missing symbols found goroutine 19 [running]: testing.tRunner.func1(0xc0000c8100) /usr/lib/golang/src/testing/testing.go:830 +0x392 panic(0x5d26a0, 0x648190) /usr/lib/golang/src/runtime/panic.go:522 +0x1b5 _<https://ci.centos.org/job/libvirt-go-check/systems=libvirt-fedora-30/ws/.TestAPICoverage(0xc0000c8100)> <https://ci.centos.org/job/libvirt-go-check/systems=libvirt-fedora-30/ws/api_test.go>:503 +0x551 testing.tRunner(0xc0000c8100, 0x622630) /usr/lib/golang/src/testing/testing.go:865 +0xc0 created by testing.(*T).Run /usr/lib/golang/src/testing/testing.go:916 +0x35a exit status 2 FAIL _<https://ci.centos.org/job/libvirt-go-check/systems=libvirt-fedora-30/ws/> 1.789s Build step 'Execute shell' marked build as failure

See <https://ci.centos.org/job/libvirt-go-check/systems=libvirt-fedora-30/910/display/redirect> ------------------------------------------ Started by upstream project "libvirt-go-check" build number 910 originally caused by: Started by upstream project "libvirt-go-build" build number 924 originally caused by: Started by upstream project "libvirt-build" build number 1097 originally caused by: Started by an SCM change Started by an SCM change Started by an SCM change Running as SYSTEM [EnvInject] - Loading node environment variables. Building remotely on libvirt-fedora-30 (libvirt) in workspace <https://ci.centos.org/job/libvirt-go-check/systems=libvirt-fedora-30/ws/> [libvirt-go] $ /bin/sh -xe /tmp/jenkins782079797400739233.sh + export 'TEST_ARGS=-tags api' + TEST_ARGS='-tags api' + go test -tags api Missing enum 'VIR_DOMAIN_STATS_MEMORY' --- FAIL: TestAPICoverage (1.81s) panic: Missing symbols found [recovered] panic: Missing symbols found goroutine 18 [running]: testing.tRunner.func1(0xc0000b8100) /usr/lib/golang/src/testing/testing.go:830 +0x392 panic(0x5d26a0, 0x648190) /usr/lib/golang/src/runtime/panic.go:522 +0x1b5 _<https://ci.centos.org/job/libvirt-go-check/systems=libvirt-fedora-30/ws/.TestAPICoverage(0xc0000b8100)> <https://ci.centos.org/job/libvirt-go-check/systems=libvirt-fedora-30/ws/api_test.go>:503 +0x551 testing.tRunner(0xc0000b8100, 0x622630) /usr/lib/golang/src/testing/testing.go:865 +0xc0 created by testing.(*T).Run /usr/lib/golang/src/testing/testing.go:916 +0x35a exit status 2 FAIL _<https://ci.centos.org/job/libvirt-go-check/systems=libvirt-fedora-30/ws/> 2.103s Build step 'Execute shell' marked build as failure

See <https://ci.centos.org/job/libvirt-go-check/systems=libvirt-fedora-30/911/display/redirect> ------------------------------------------ Started by upstream project "libvirt-go-check" build number 911 originally caused by: Started by upstream project "libvirt-go-build" build number 925 originally caused by: Started by upstream project "libvirt-build" build number 1098 originally caused by: Started by an SCM change Started by an SCM change Started by an SCM change Running as SYSTEM [EnvInject] - Loading node environment variables. Building remotely on libvirt-fedora-30 (libvirt) in workspace <https://ci.centos.org/job/libvirt-go-check/systems=libvirt-fedora-30/ws/> [libvirt-go] $ /bin/sh -xe /tmp/jenkins8316755220816018741.sh + export 'TEST_ARGS=-tags api' + TEST_ARGS='-tags api' + go test -tags api Missing enum 'VIR_DOMAIN_STATS_MEMORY' --- FAIL: TestAPICoverage (0.67s) panic: Missing symbols found [recovered] panic: Missing symbols found goroutine 19 [running]: testing.tRunner.func1(0xc0000c8100) /usr/lib/golang/src/testing/testing.go:830 +0x392 panic(0x5d26a0, 0x648190) /usr/lib/golang/src/runtime/panic.go:522 +0x1b5 _<https://ci.centos.org/job/libvirt-go-check/systems=libvirt-fedora-30/ws/.TestAPICoverage(0xc0000c8100)> <https://ci.centos.org/job/libvirt-go-check/systems=libvirt-fedora-30/ws/api_test.go>:503 +0x551 testing.tRunner(0xc0000c8100, 0x622630) /usr/lib/golang/src/testing/testing.go:865 +0xc0 created by testing.(*T).Run /usr/lib/golang/src/testing/testing.go:916 +0x35a exit status 2 FAIL _<https://ci.centos.org/job/libvirt-go-check/systems=libvirt-fedora-30/ws/> 0.821s Build step 'Execute shell' marked build as failure

See <https://ci.centos.org/job/libvirt-go-check/systems=libvirt-fedora-30/912/display/redirect> ------------------------------------------ Started by upstream project "libvirt-go-check" build number 912 originally caused by: Started by upstream project "libvirt-go-build" build number 926 originally caused by: Started by upstream project "libvirt-build" build number 1099 originally caused by: Started by user Libvirt Running as SYSTEM [EnvInject] - Loading node environment variables. Building remotely on libvirt-fedora-30 (libvirt) in workspace <https://ci.centos.org/job/libvirt-go-check/systems=libvirt-fedora-30/ws/> [libvirt-go] $ /bin/sh -xe /tmp/jenkins13976448557147137413.sh + export 'TEST_ARGS=-tags api' + TEST_ARGS='-tags api' + go test -tags api Missing enum 'VIR_DOMAIN_STATS_MEMORY' --- FAIL: TestAPICoverage (2.04s) panic: Missing symbols found [recovered] panic: Missing symbols found goroutine 19 [running]: testing.tRunner.func1(0xc0000c8100) /usr/lib/golang/src/testing/testing.go:830 +0x392 panic(0x5d26a0, 0x648190) /usr/lib/golang/src/runtime/panic.go:522 +0x1b5 _<https://ci.centos.org/job/libvirt-go-check/systems=libvirt-fedora-30/ws/.TestAPICoverage(0xc0000c8100)> <https://ci.centos.org/job/libvirt-go-check/systems=libvirt-fedora-30/ws/api_test.go>:503 +0x551 testing.tRunner(0xc0000c8100, 0x622630) /usr/lib/golang/src/testing/testing.go:865 +0xc0 created by testing.(*T).Run /usr/lib/golang/src/testing/testing.go:916 +0x35a exit status 2 FAIL _<https://ci.centos.org/job/libvirt-go-check/systems=libvirt-fedora-30/ws/> 2.403s Build step 'Execute shell' marked build as failure

participants (1)
-
ci@centos.org