libvirt-go-xml | Pipeline #167653292 has failed for master | 3d7a35d3

Your pipeline has failed. Project: libvirt-go-xml ( https://gitlab.com/libvirt/libvirt-go-xml ) Branch: master ( https://gitlab.com/libvirt/libvirt-go-xml/-/commits/master ) Commit: 3d7a35d3 ( https://gitlab.com/libvirt/libvirt-go-xml/-/commit/3d7a35d32e28306f77f5a1c41... ) Commit Message: README: Convert to reStructuredText This is th... Commit Author: Andrea Bolognani ( https://gitlab.com/abologna ) Pipeline #167653292 ( https://gitlab.com/libvirt/libvirt-go-xml/-/pipelines/167653292 ) triggered by Daniel Berrange ( https://gitlab.com/berrange ) had 5 failed builds. Job #643278973 ( https://gitlab.com/libvirt/libvirt-go-xml/-/jobs/643278973/raw ) Stage: build Name: go_1_12 Trace: [32;1mFetching changes...[0;m Initialized empty Git repository in /builds/libvirt/libvirt-go-xml/.git/ [32;1mCreated fresh repository.[0;m [32;1mChecking out 3d7a35d3 as master...[0;m [32;1mSkipping Git submodules setup[0;m section_end:1594955176:get_sources [0Ksection_start:1594955176:step_script [0K[0K[36;1mExecuting "step_script" stage of the job script[0;m [0;m[32;1m$ go test -timeout 10m -tags xmlroundtrip -v[0;m === RUN TestDomainSnapshot --- PASS: TestDomainSnapshot (0.00s) === RUN TestDomain --- PASS: TestDomain (0.01s) === RUN TestNetwork --- PASS: TestNetwork (0.00s) === RUN TestNodeDevice --- PASS: TestNodeDevice (0.00s) === RUN TestSecret --- PASS: TestSecret (0.00s) === RUN TestStoragePool --- PASS: TestStoragePool (0.00s) === RUN TestStorageVolume --- PASS: TestStorageVolume (0.00s) === RUN TestRoundTrip --- FAIL: TestRoundTrip (6.09s) xml_test.go:374: testdata/libvirt/tests/xml2vmxdata/xml2vmx-ethernet-mac-type.xml: /domain[0]/devices[0]/interface[1]/mac[0]/@type: attribute 'static' in expected XML missing in actual XML FAIL exit status 1 FAIL _/builds/libvirt/libvirt-go-xml 6.107s section_end:1594955189:step_script [0K[31;1mERROR: Job failed: exit code 1 [0;m Job #643278932 ( https://gitlab.com/libvirt/libvirt-go-xml/-/jobs/643278932/raw ) Stage: build Name: go_1_11 Trace: [32;1mFetching changes...[0;m Initialized empty Git repository in /builds/libvirt/libvirt-go-xml/.git/ [32;1mCreated fresh repository.[0;m [32;1mChecking out 3d7a35d3 as master...[0;m [32;1mSkipping Git submodules setup[0;m section_end:1594955175:get_sources [0Ksection_start:1594955175:step_script [0K[0K[36;1mExecuting "step_script" stage of the job script[0;m [0;m[32;1m$ go test -timeout 10m -tags xmlroundtrip -v[0;m === RUN TestDomainSnapshot --- PASS: TestDomainSnapshot (0.00s) === RUN TestDomain --- PASS: TestDomain (0.01s) === RUN TestNetwork --- PASS: TestNetwork (0.00s) === RUN TestNodeDevice --- PASS: TestNodeDevice (0.00s) === RUN TestSecret --- PASS: TestSecret (0.00s) === RUN TestStoragePool --- PASS: TestStoragePool (0.00s) === RUN TestStorageVolume --- PASS: TestStorageVolume (0.00s) === RUN TestRoundTrip --- FAIL: TestRoundTrip (5.93s) xml_test.go:374: testdata/libvirt/tests/xml2vmxdata/xml2vmx-ethernet-mac-type.xml: /domain[0]/devices[0]/interface[1]/mac[0]/@type: attribute 'static' in expected XML missing in actual XML FAIL exit status 1 FAIL _/builds/libvirt/libvirt-go-xml 5.949s section_end:1594955188:step_script [0K[31;1mERROR: Job failed: exit code 1 [0;m Job #643278855 ( https://gitlab.com/libvirt/libvirt-go-xml/-/jobs/643278855/raw ) Stage: build Name: go_1_10 Trace: [32;1mFetching changes...[0;m Initialized empty Git repository in /builds/libvirt/libvirt-go-xml/.git/ [32;1mCreated fresh repository.[0;m [32;1mChecking out 3d7a35d3 as master...[0;m [32;1mSkipping Git submodules setup[0;m section_end:1594955171:get_sources [0Ksection_start:1594955171:step_script [0K[0K[36;1mExecuting "step_script" stage of the job script[0;m [0;m[32;1m$ go test -timeout 10m -tags xmlroundtrip -v[0;m === RUN TestDomainSnapshot --- PASS: TestDomainSnapshot (0.00s) === RUN TestDomain --- PASS: TestDomain (0.01s) === RUN TestNetwork --- PASS: TestNetwork (0.00s) === RUN TestNodeDevice --- PASS: TestNodeDevice (0.00s) === RUN TestSecret --- PASS: TestSecret (0.00s) === RUN TestStoragePool --- PASS: TestStoragePool (0.00s) === RUN TestStorageVolume --- PASS: TestStorageVolume (0.00s) === RUN TestRoundTrip --- FAIL: TestRoundTrip (5.49s) xml_test.go:374: testdata/libvirt/tests/xml2vmxdata/xml2vmx-ethernet-mac-type.xml: /domain[0]/devices[0]/interface[1]/mac[0]/@type: attribute 'static' in expected XML missing in actual XML FAIL exit status 1 FAIL _/builds/libvirt/libvirt-go-xml 5.510s section_end:1594955181:step_script [0K[31;1mERROR: Job failed: exit code 1 [0;m Job #643278998 ( https://gitlab.com/libvirt/libvirt-go-xml/-/jobs/643278998/raw ) Stage: build Name: go_1_13 Trace: [32;1mFetching changes...[0;m Initialized empty Git repository in /builds/libvirt/libvirt-go-xml/.git/ [32;1mCreated fresh repository.[0;m [32;1mChecking out 3d7a35d3 as master...[0;m [32;1mSkipping Git submodules setup[0;m section_end:1594955165:get_sources [0Ksection_start:1594955165:step_script [0K[0K[36;1mExecuting "step_script" stage of the job script[0;m [0;m[32;1m$ go test -timeout 10m -tags xmlroundtrip -v[0;m === RUN TestDomainSnapshot --- PASS: TestDomainSnapshot (0.00s) === RUN TestDomain --- PASS: TestDomain (0.01s) === RUN TestNetwork --- PASS: TestNetwork (0.00s) === RUN TestNodeDevice --- PASS: TestNodeDevice (0.00s) === RUN TestSecret --- PASS: TestSecret (0.00s) === RUN TestStoragePool --- PASS: TestStoragePool (0.00s) === RUN TestStorageVolume --- PASS: TestStorageVolume (0.00s) === RUN TestRoundTrip --- FAIL: TestRoundTrip (6.59s) xml_test.go:374: testdata/libvirt/tests/xml2vmxdata/xml2vmx-ethernet-mac-type.xml: /domain[0]/devices[0]/interface[1]/mac[0]/@type: attribute 'static' in expected XML missing in actual XML FAIL exit status 1 FAIL _/builds/libvirt/libvirt-go-xml 6.608s section_end:1594955179:step_script [0K[31;1mERROR: Job failed: exit code 1 [0;m Job #643279018 ( https://gitlab.com/libvirt/libvirt-go-xml/-/jobs/643279018/raw ) Stage: build Name: go_1_14 Trace: [32;1mFetching changes...[0;m Initialized empty Git repository in /builds/libvirt/libvirt-go-xml/.git/ [32;1mCreated fresh repository.[0;m [32;1mChecking out 3d7a35d3 as master...[0;m [32;1mSkipping Git submodules setup[0;m section_end:1594955161:get_sources [0Ksection_start:1594955161:step_script [0K[0K[36;1mExecuting "step_script" stage of the job script[0;m [0;m[32;1m$ go test -timeout 10m -tags xmlroundtrip -v[0;m === RUN TestDomainSnapshot --- PASS: TestDomainSnapshot (0.00s) === RUN TestDomain --- PASS: TestDomain (0.01s) === RUN TestNetwork --- PASS: TestNetwork (0.00s) === RUN TestNodeDevice --- PASS: TestNodeDevice (0.00s) === RUN TestSecret --- PASS: TestSecret (0.00s) === RUN TestStoragePool --- PASS: TestStoragePool (0.00s) === RUN TestStorageVolume --- PASS: TestStorageVolume (0.00s) === RUN TestRoundTrip TestRoundTrip: xml_test.go:374: testdata/libvirt/tests/xml2vmxdata/xml2vmx-ethernet-mac-type.xml: /domain[0]/devices[0]/interface[1]/mac[0]/@type: attribute 'static' in expected XML missing in actual XML --- FAIL: TestRoundTrip (7.90s) FAIL exit status 1 FAIL _/builds/libvirt/libvirt-go-xml 7.916s section_end:1594955175:step_script [0K[31;1mERROR: Job failed: exit code 1 [0;m -- You're receiving this email because of your account on gitlab.com.
participants (1)
-
GitLab