[Libvirt-ci] Build failed in Jenkins: libvirt-go-xml-master-check » libvirt-freebsd-10 #405

See <https://ci.centos.org/job/libvirt-go-xml-master-check/systems=libvirt-freebsd-10/405/display/redirect> ------------------------------------------ Started by upstream project "libvirt-go-xml-master-check" build number 405 originally caused by: Started by upstream project "libvirt-go-xml-master-build" build number 413 originally caused by: Started by upstream project "libvirt-master-build" build number 1463 originally caused by: Started by an SCM change [EnvInject] - Loading node environment variables. Building remotely on libvirt-freebsd-10 (libvirt) in workspace <https://ci.centos.org/job/libvirt-go-xml-master-check/systems=libvirt-freebsd-10/ws/> [libvirt-go-xml-master] $ /bin/sh -xe /tmp/jenkins246780224194400868.sh + export 'TEST_ARGS=-tags xmlroundtrip' + go test -tags xmlroundtrip --- FAIL: TestRoundTrip (7.83s) xml_test.go:383: testdata/libvirt/tests/domaincapsschemadata/basic.xml: /domainCapabilities[0]/features[0]/genid[0]: element in expected XML missing in actual XML FAIL exit status 1 FAIL _/usr<https://ci.centos.org/job/libvirt-go-xml-master-check/systems=libvirt-freebsd-10/ws/> 7.952s Build step 'Execute shell' marked build as failure

See <https://ci.centos.org/job/libvirt-go-xml-master-check/systems=libvirt-freebsd-10/406/display/redirect> ------------------------------------------ Started by upstream project "libvirt-go-xml-master-check" build number 406 originally caused by: Started by upstream project "libvirt-go-xml-master-build" build number 414 originally caused by: Started by upstream project "libvirt-master-build" build number 1464 originally caused by: Started by an SCM change [EnvInject] - Loading node environment variables. Building remotely on libvirt-freebsd-10 (libvirt) in workspace <https://ci.centos.org/job/libvirt-go-xml-master-check/systems=libvirt-freebsd-10/ws/> [libvirt-go-xml-master] $ /bin/sh -xe /tmp/jenkins1468173891314176452.sh + export 'TEST_ARGS=-tags xmlroundtrip' + go test -tags xmlroundtrip --- FAIL: TestRoundTrip (3.37s) xml_test.go:383: testdata/libvirt/tests/capabilityschemadata/caps-test2.xml: /capabilities[0]/host[0]/cpu[0]/microcode[0]: element in expected XML missing in actual XML FAIL exit status 1 FAIL _/usr<https://ci.centos.org/job/libvirt-go-xml-master-check/systems=libvirt-freebsd-10/ws/> 3.521s Build step 'Execute shell' marked build as failure

See <https://ci.centos.org/job/libvirt-go-xml-master-check/systems=libvirt-freebsd-10/407/display/redirect> ------------------------------------------ Started by upstream project "libvirt-go-xml-master-check" build number 407 originally caused by: Started by upstream project "libvirt-go-xml-master-build" build number 415 originally caused by: Started by upstream project "libvirt-master-build" build number 1465 originally caused by: Started by an SCM change [EnvInject] - Loading node environment variables. Building remotely on libvirt-freebsd-10 (libvirt) in workspace <https://ci.centos.org/job/libvirt-go-xml-master-check/systems=libvirt-freebsd-10/ws/> [libvirt-go-xml-master] $ /bin/sh -xe /tmp/jenkins2719660573200707285.sh + export 'TEST_ARGS=-tags xmlroundtrip' + go test -tags xmlroundtrip --- FAIL: TestRoundTrip (18.94s) xml_test.go:383: testdata/libvirt/tests/capabilityschemadata/caps-test2.xml: /capabilities[0]/host[0]/cpu[0]/microcode[0]: element in expected XML missing in actual XML FAIL exit status 1 FAIL _/usr<https://ci.centos.org/job/libvirt-go-xml-master-check/systems=libvirt-freebsd-10/ws/> 19.074s Build step 'Execute shell' marked build as failure

See <https://ci.centos.org/job/libvirt-go-xml-master-check/systems=libvirt-freebsd-10/408/display/redirect> ------------------------------------------ Started by upstream project "libvirt-go-xml-master-check" build number 408 originally caused by: Started by upstream project "libvirt-go-xml-master-build" build number 416 originally caused by: Started by upstream project "libvirt-master-build" build number 1466 originally caused by: Started by an SCM change [EnvInject] - Loading node environment variables. Building remotely on libvirt-freebsd-10 (libvirt) in workspace <https://ci.centos.org/job/libvirt-go-xml-master-check/systems=libvirt-freebsd-10/ws/> [libvirt-go-xml-master] $ /bin/sh -xe /tmp/jenkins2063094726179582442.sh + export 'TEST_ARGS=-tags xmlroundtrip' + go test -tags xmlroundtrip --- FAIL: TestRoundTrip (4.79s) xml_test.go:383: testdata/libvirt/tests/capabilityschemadata/caps-test2.xml: /capabilities[0]/host[0]/cpu[0]/microcode[0]: element in expected XML missing in actual XML FAIL exit status 1 FAIL _/usr<https://ci.centos.org/job/libvirt-go-xml-master-check/systems=libvirt-freebsd-10/ws/> 5.042s Build step 'Execute shell' marked build as failure

See <https://ci.centos.org/job/libvirt-go-xml-master-check/systems=libvirt-freebsd-10/409/display/redirect> ------------------------------------------ Started by upstream project "libvirt-go-xml-master-check" build number 409 originally caused by: Started by upstream project "libvirt-go-xml-master-build" build number 417 originally caused by: Started by upstream project "libvirt-master-build" build number 1467 originally caused by: Started by an SCM change Started by an SCM change [EnvInject] - Loading node environment variables. Building remotely on libvirt-freebsd-10 (libvirt) in workspace <https://ci.centos.org/job/libvirt-go-xml-master-check/systems=libvirt-freebsd-10/ws/> [libvirt-go-xml-master] $ /bin/sh -xe /tmp/jenkins5066755298291971317.sh + export 'TEST_ARGS=-tags xmlroundtrip' + go test -tags xmlroundtrip --- FAIL: TestRoundTrip (4.47s) xml_test.go:383: testdata/libvirt/tests/capabilityschemadata/caps-test2.xml: /capabilities[0]/host[0]/cpu[0]/microcode[0]: element in expected XML missing in actual XML FAIL exit status 1 FAIL _/usr<https://ci.centos.org/job/libvirt-go-xml-master-check/systems=libvirt-freebsd-10/ws/> 4.552s Build step 'Execute shell' marked build as failure

See <https://ci.centos.org/job/libvirt-go-xml-master-check/systems=libvirt-freebsd-10/410/display/redirect> ------------------------------------------ Started by upstream project "libvirt-go-xml-master-check" build number 410 originally caused by: Started by upstream project "libvirt-go-xml-master-build" build number 418 originally caused by: Started by upstream project "libvirt-master-build" build number 1468 originally caused by: Started by an SCM change [EnvInject] - Loading node environment variables. Building remotely on libvirt-freebsd-10 (libvirt) in workspace <https://ci.centos.org/job/libvirt-go-xml-master-check/systems=libvirt-freebsd-10/ws/> [libvirt-go-xml-master] $ /bin/sh -xe /tmp/jenkins1659887857881904621.sh + export 'TEST_ARGS=-tags xmlroundtrip' + go test -tags xmlroundtrip --- FAIL: TestRoundTrip (8.27s) xml_test.go:383: testdata/libvirt/tests/capabilityschemadata/caps-test2.xml: /capabilities[0]/host[0]/cpu[0]/microcode[0]: element in expected XML missing in actual XML FAIL exit status 1 FAIL _/usr<https://ci.centos.org/job/libvirt-go-xml-master-check/systems=libvirt-freebsd-10/ws/> 8.371s Build step 'Execute shell' marked build as failure

See <https://ci.centos.org/job/libvirt-go-xml-master-check/systems=libvirt-freebsd-10/411/display/redirect> ------------------------------------------ Started by upstream project "libvirt-go-xml-master-check" build number 411 originally caused by: Started by upstream project "libvirt-go-xml-master-build" build number 419 originally caused by: Started by upstream project "libvirt-master-build" build number 1469 originally caused by: Started by an SCM change [EnvInject] - Loading node environment variables. Building remotely on libvirt-freebsd-10 (libvirt) in workspace <https://ci.centos.org/job/libvirt-go-xml-master-check/systems=libvirt-freebsd-10/ws/> [libvirt-go-xml-master] $ /bin/sh -xe /tmp/jenkins4988486786593818068.sh + export 'TEST_ARGS=-tags xmlroundtrip' + go test -tags xmlroundtrip --- FAIL: TestRoundTrip (3.17s) xml_test.go:383: testdata/libvirt/tests/capabilityschemadata/caps-test2.xml: /capabilities[0]/host[0]/cpu[0]/microcode[0]: element in expected XML missing in actual XML FAIL exit status 1 FAIL _/usr<https://ci.centos.org/job/libvirt-go-xml-master-check/systems=libvirt-freebsd-10/ws/> 3.322s Build step 'Execute shell' marked build as failure

See <https://ci.centos.org/job/libvirt-go-xml-master-check/systems=libvirt-freebsd-10/412/display/redirect> ------------------------------------------ Started by upstream project "libvirt-go-xml-master-check" build number 412 originally caused by: Started by upstream project "libvirt-go-xml-master-build" build number 420 originally caused by: Started by upstream project "libvirt-master-build" build number 1470 originally caused by: Started by an SCM change [EnvInject] - Loading node environment variables. Building remotely on libvirt-freebsd-10 (libvirt) in workspace <https://ci.centos.org/job/libvirt-go-xml-master-check/systems=libvirt-freebsd-10/ws/> [libvirt-go-xml-master] $ /bin/sh -xe /tmp/jenkins109714019155417531.sh + export 'TEST_ARGS=-tags xmlroundtrip' + go test -tags xmlroundtrip --- FAIL: TestRoundTrip (6.19s) xml_test.go:383: testdata/libvirt/tests/capabilityschemadata/caps-test2.xml: /capabilities[0]/host[0]/cpu[0]/microcode[0]: element in expected XML missing in actual XML FAIL exit status 1 FAIL _/usr<https://ci.centos.org/job/libvirt-go-xml-master-check/systems=libvirt-freebsd-10/ws/> 6.267s Build step 'Execute shell' marked build as failure

See <https://ci.centos.org/job/libvirt-go-xml-master-check/systems=libvirt-freebsd-10/413/display/redirect> ------------------------------------------ Started by upstream project "libvirt-go-xml-master-check" build number 413 originally caused by: Started by upstream project "libvirt-go-xml-master-build" build number 421 originally caused by: Started by upstream project "libvirt-master-build" build number 1471 originally caused by: Started by an SCM change Started by an SCM change [EnvInject] - Loading node environment variables. Building remotely on libvirt-freebsd-10 (libvirt) in workspace <https://ci.centos.org/job/libvirt-go-xml-master-check/systems=libvirt-freebsd-10/ws/> [libvirt-go-xml-master] $ /bin/sh -xe /tmp/jenkins7693670749208747993.sh + export 'TEST_ARGS=-tags xmlroundtrip' + go test -tags xmlroundtrip --- FAIL: TestRoundTrip (0.80s) xml_test.go:383: testdata/libvirt/tests/capabilityschemadata/caps-test2.xml: /capabilities[0]/host[0]/cpu[0]/microcode[0]: element in expected XML missing in actual XML FAIL exit status 1 FAIL _/usr<https://ci.centos.org/job/libvirt-go-xml-master-check/systems=libvirt-freebsd-10/ws/> 0.913s Build step 'Execute shell' marked build as failure

See <https://ci.centos.org/job/libvirt-go-xml-master-check/systems=libvirt-freebsd-10/414/display/redirect> ------------------------------------------ Started by upstream project "libvirt-go-xml-master-check" build number 414 originally caused by: Started by upstream project "libvirt-go-xml-master-build" build number 422 originally caused by: Started by upstream project "libvirt-master-build" build number 1472 originally caused by: Started by an SCM change [EnvInject] - Loading node environment variables. Building remotely on libvirt-freebsd-10 (libvirt) in workspace <https://ci.centos.org/job/libvirt-go-xml-master-check/systems=libvirt-freebsd-10/ws/> [libvirt-go-xml-master] $ /bin/sh -xe /tmp/jenkins3504454269464151011.sh + export 'TEST_ARGS=-tags xmlroundtrip' + go test -tags xmlroundtrip --- FAIL: TestRoundTrip (8.19s) xml_test.go:383: testdata/libvirt/tests/capabilityschemadata/caps-test2.xml: /capabilities[0]/host[0]/cpu[0]/microcode[0]: element in expected XML missing in actual XML FAIL exit status 1 FAIL _/usr<https://ci.centos.org/job/libvirt-go-xml-master-check/systems=libvirt-freebsd-10/ws/> 8.273s Build step 'Execute shell' marked build as failure

See <https://ci.centos.org/job/libvirt-go-xml-master-check/systems=libvirt-freebsd-10/415/display/redirect> ------------------------------------------ Started by upstream project "libvirt-go-xml-master-check" build number 415 originally caused by: Started by upstream project "libvirt-go-xml-master-build" build number 423 originally caused by: Started by upstream project "libvirt-master-build" build number 1473 originally caused by: Started by an SCM change [EnvInject] - Loading node environment variables. Building remotely on libvirt-freebsd-10 (libvirt) in workspace <https://ci.centos.org/job/libvirt-go-xml-master-check/systems=libvirt-freebsd-10/ws/> [libvirt-go-xml-master] $ /bin/sh -xe /tmp/jenkins8736566303409296978.sh + export 'TEST_ARGS=-tags xmlroundtrip' + go test -tags xmlroundtrip --- FAIL: TestRoundTrip (5.53s) xml_test.go:383: testdata/libvirt/tests/capabilityschemadata/caps-test2.xml: /capabilities[0]/host[0]/cpu[0]/microcode[0]: element in expected XML missing in actual XML FAIL exit status 1 FAIL _/usr<https://ci.centos.org/job/libvirt-go-xml-master-check/systems=libvirt-freebsd-10/ws/> 5.624s Build step 'Execute shell' marked build as failure

See <https://ci.centos.org/job/libvirt-go-xml-master-check/systems=libvirt-freebsd-10/416/display/redirect> ------------------------------------------ Started by upstream project "libvirt-go-xml-master-check" build number 416 originally caused by: Started by upstream project "libvirt-go-xml-master-build" build number 424 originally caused by: Started by upstream project "libvirt-master-build" build number 1474 originally caused by: Started by an SCM change Started by an SCM change Started by an SCM change [EnvInject] - Loading node environment variables. Building remotely on libvirt-freebsd-10 (libvirt) in workspace <https://ci.centos.org/job/libvirt-go-xml-master-check/systems=libvirt-freebsd-10/ws/> [libvirt-go-xml-master] $ /bin/sh -xe /tmp/jenkins1911469533245107734.sh + export 'TEST_ARGS=-tags xmlroundtrip' + go test -tags xmlroundtrip --- FAIL: TestRoundTrip (1.63s) xml_test.go:383: testdata/libvirt/tests/capabilityschemadata/caps-test2.xml: /capabilities[0]/host[0]/cpu[0]/microcode[0]: element in expected XML missing in actual XML FAIL exit status 1 FAIL _/usr<https://ci.centos.org/job/libvirt-go-xml-master-check/systems=libvirt-freebsd-10/ws/> 1.741s Build step 'Execute shell' marked build as failure

See <https://ci.centos.org/job/libvirt-go-xml-master-check/systems=libvirt-freebsd-10/417/display/redirect> ------------------------------------------ Started by upstream project "libvirt-go-xml-master-check" build number 417 originally caused by: Started by upstream project "libvirt-go-xml-master-build" build number 425 originally caused by: Started by upstream project "libvirt-master-build" build number 1475 originally caused by: Started by an SCM change [EnvInject] - Loading node environment variables. Building remotely on libvirt-freebsd-10 (libvirt) in workspace <https://ci.centos.org/job/libvirt-go-xml-master-check/systems=libvirt-freebsd-10/ws/> [libvirt-go-xml-master] $ /bin/sh -xe /tmp/jenkins3805951214142028357.sh + export 'TEST_ARGS=-tags xmlroundtrip' + go test -tags xmlroundtrip --- FAIL: TestRoundTrip (8.98s) xml_test.go:383: testdata/libvirt/tests/capabilityschemadata/caps-test2.xml: /capabilities[0]/host[0]/cpu[0]/microcode[0]: element in expected XML missing in actual XML FAIL exit status 1 FAIL _/usr<https://ci.centos.org/job/libvirt-go-xml-master-check/systems=libvirt-freebsd-10/ws/> 9.018s Build step 'Execute shell' marked build as failure

See <https://ci.centos.org/job/libvirt-go-xml-master-check/systems=libvirt-freebsd-10/418/display/redirect> ------------------------------------------ Started by upstream project "libvirt-go-xml-master-check" build number 418 originally caused by: Started by upstream project "libvirt-go-xml-master-build" build number 426 originally caused by: Started by upstream project "libvirt-master-build" build number 1476 originally caused by: Started by an SCM change [EnvInject] - Loading node environment variables. Building remotely on libvirt-freebsd-10 (libvirt) in workspace <https://ci.centos.org/job/libvirt-go-xml-master-check/systems=libvirt-freebsd-10/ws/> [libvirt-go-xml-master] $ /bin/sh -xe /tmp/jenkins2876205770651398635.sh + export 'TEST_ARGS=-tags xmlroundtrip' + go test -tags xmlroundtrip --- FAIL: TestRoundTrip (3.28s) xml_test.go:383: testdata/libvirt/tests/capabilityschemadata/caps-test2.xml: /capabilities[0]/host[0]/cpu[0]/microcode[0]: element in expected XML missing in actual XML FAIL exit status 1 FAIL _/usr<https://ci.centos.org/job/libvirt-go-xml-master-check/systems=libvirt-freebsd-10/ws/> 3.374s Build step 'Execute shell' marked build as failure

See <https://ci.centos.org/job/libvirt-go-xml-master-check/systems=libvirt-freebsd-10/419/display/redirect> ------------------------------------------ Started by upstream project "libvirt-go-xml-master-check" build number 419 originally caused by: Started by upstream project "libvirt-go-xml-master-build" build number 427 originally caused by: Started by upstream project "libvirt-master-build" build number 1477 originally caused by: Started by an SCM change Started by an SCM change Started by an SCM change [EnvInject] - Loading node environment variables. Building remotely on libvirt-freebsd-10 (libvirt) in workspace <https://ci.centos.org/job/libvirt-go-xml-master-check/systems=libvirt-freebsd-10/ws/> [libvirt-go-xml-master] $ /bin/sh -xe /tmp/jenkins902475337842664994.sh + export 'TEST_ARGS=-tags xmlroundtrip' + go test -tags xmlroundtrip --- FAIL: TestRoundTrip (2.62s) xml_test.go:383: testdata/libvirt/tests/capabilityschemadata/caps-test2.xml: /capabilities[0]/host[0]/cpu[0]/microcode[0]: element in expected XML missing in actual XML FAIL exit status 1 FAIL _/usr<https://ci.centos.org/job/libvirt-go-xml-master-check/systems=libvirt-freebsd-10/ws/> 2.739s Build step 'Execute shell' marked build as failure

See <https://ci.centos.org/job/libvirt-go-xml-master-check/systems=libvirt-freebsd-10/420/display/redirect> ------------------------------------------ Started by upstream project "libvirt-go-xml-master-check" build number 420 originally caused by: Started by upstream project "libvirt-go-xml-master-build" build number 428 originally caused by: Started by upstream project "libvirt-master-build" build number 1478 originally caused by: Started by an SCM change [EnvInject] - Loading node environment variables. Building remotely on libvirt-freebsd-10 (libvirt) in workspace <https://ci.centos.org/job/libvirt-go-xml-master-check/systems=libvirt-freebsd-10/ws/> [libvirt-go-xml-master] $ /bin/sh -xe /tmp/jenkins8302084991481938809.sh + export 'TEST_ARGS=-tags xmlroundtrip' + go test -tags xmlroundtrip --- FAIL: TestRoundTrip (3.65s) xml_test.go:383: testdata/libvirt/tests/capabilityschemadata/caps-test2.xml: /capabilities[0]/host[0]/cpu[0]/microcode[0]: element in expected XML missing in actual XML FAIL exit status 1 FAIL _/usr<https://ci.centos.org/job/libvirt-go-xml-master-check/systems=libvirt-freebsd-10/ws/> 3.782s Build step 'Execute shell' marked build as failure

See <https://ci.centos.org/job/libvirt-go-xml-master-check/systems=libvirt-freebsd-10/421/display/redirect> ------------------------------------------ Started by upstream project "libvirt-go-xml-master-check" build number 421 originally caused by: Started by upstream project "libvirt-go-xml-master-build" build number 429 originally caused by: Started by upstream project "libvirt-master-build" build number 1479 originally caused by: Started by an SCM change [EnvInject] - Loading node environment variables. Building remotely on libvirt-freebsd-10 (libvirt) in workspace <https://ci.centos.org/job/libvirt-go-xml-master-check/systems=libvirt-freebsd-10/ws/> [libvirt-go-xml-master] $ /bin/sh -xe /tmp/jenkins8997911381425453463.sh + export 'TEST_ARGS=-tags xmlroundtrip' + go test -tags xmlroundtrip --- FAIL: TestRoundTrip (2.20s) xml_test.go:383: testdata/libvirt/tests/capabilityschemadata/caps-test2.xml: /capabilities[0]/host[0]/cpu[0]/microcode[0]: element in expected XML missing in actual XML FAIL exit status 1 FAIL _/usr<https://ci.centos.org/job/libvirt-go-xml-master-check/systems=libvirt-freebsd-10/ws/> 2.273s Build step 'Execute shell' marked build as failure

See <https://ci.centos.org/job/libvirt-go-xml-master-check/systems=libvirt-freebsd-10/422/display/redirect> ------------------------------------------ Started by upstream project "libvirt-go-xml-master-check" build number 422 originally caused by: Started by upstream project "libvirt-go-xml-master-build" build number 430 originally caused by: Started by upstream project "libvirt-master-build" build number 1480 originally caused by: Started by an SCM change [EnvInject] - Loading node environment variables. Building remotely on libvirt-freebsd-10 (libvirt) in workspace <https://ci.centos.org/job/libvirt-go-xml-master-check/systems=libvirt-freebsd-10/ws/> [libvirt-go-xml-master] $ /bin/sh -xe /tmp/jenkins2596138137463773248.sh + export 'TEST_ARGS=-tags xmlroundtrip' + go test -tags xmlroundtrip --- FAIL: TestRoundTrip (20.10s) xml_test.go:383: testdata/libvirt/tests/capabilityschemadata/caps-test2.xml: /capabilities[0]/host[0]/cpu[0]/microcode[0]: element in expected XML missing in actual XML FAIL exit status 1 FAIL _/usr<https://ci.centos.org/job/libvirt-go-xml-master-check/systems=libvirt-freebsd-10/ws/> 20.263s Build step 'Execute shell' marked build as failure

See <https://ci.centos.org/job/libvirt-go-xml-master-check/systems=libvirt-freebsd-10/423/display/redirect> ------------------------------------------ Started by upstream project "libvirt-go-xml-master-check" build number 423 originally caused by: Started by upstream project "libvirt-go-xml-master-build" build number 431 originally caused by: Started by upstream project "libvirt-master-build" build number 1481 originally caused by: Started by an SCM change Started by an SCM change [EnvInject] - Loading node environment variables. Building remotely on libvirt-freebsd-10 (libvirt) in workspace <https://ci.centos.org/job/libvirt-go-xml-master-check/systems=libvirt-freebsd-10/ws/> [libvirt-go-xml-master] $ /bin/sh -xe /tmp/jenkins563837951549719460.sh + export 'TEST_ARGS=-tags xmlroundtrip' + go test -tags xmlroundtrip --- FAIL: TestRoundTrip (1.58s) xml_test.go:383: testdata/libvirt/tests/capabilityschemadata/caps-test2.xml: /capabilities[0]/host[0]/cpu[0]/microcode[0]: element in expected XML missing in actual XML FAIL exit status 1 FAIL _/usr<https://ci.centos.org/job/libvirt-go-xml-master-check/systems=libvirt-freebsd-10/ws/> 1.656s Build step 'Execute shell' marked build as failure

participants (1)
-
ci@centos.org