[Libvirt-ci] Build failed in Jenkins: libvirt-go-master-check » libvirt-fedora-27 #1109

See <https://ci.centos.org/job/libvirt-go-master-check/systems=libvirt-fedora-27/1109/display/redirect> ------------------------------------------ Started by upstream project "libvirt-go-master-check" build number 1109 originally caused by: Started by upstream project "libvirt-go-master-build" build number 1120 originally caused by: Started by upstream project "libvirt-master-build" build number 1519 originally caused by: Started by an SCM change Started by an SCM change [EnvInject] - Loading node environment variables. Building remotely on libvirt-fedora-27 (libvirt) in workspace <https://ci.centos.org/job/libvirt-go-master-check/systems=libvirt-fedora-27/ws/> [libvirt-go-master] $ /bin/sh -xe /tmp/jenkins9106255084725200104.sh + export 'TEST_ARGS=-tags api' + TEST_ARGS='-tags api' + go test -tags api Missing function 'virDomainGetLaunchSecurityInfo' Missing function 'virNodeGetSEVInfo' Missing macro 'VIR_DOMAIN_LAUNCH_SECURITY_SEV_MEASUREMENT' Missing macro 'VIR_NODE_SEV_CBITPOS' Missing macro 'VIR_NODE_SEV_CERT_CHAIN' Missing macro 'VIR_NODE_SEV_PDH' Missing macro 'VIR_NODE_SEV_REDUCED_PHYS_BITS' --- FAIL: TestAPICoverage (0.90s) panic: Missing symbols found [recovered] panic: Missing symbols found goroutine 5 [running]: testing.tRunner.func1(0xc4200980f0) /usr/lib/golang/src/testing/testing.go:711 +0x2d2 panic(0x5b60a0, 0x61a660) /usr/lib/golang/src/runtime/panic.go:491 +0x283 _<https://ci.centos.org/job/libvirt-go-master-check/systems=libvirt-fedora-27/ws/.TestAPICoverage(0xc4200980f0)> <https://ci.centos.org/job/libvirt-go-master-check/systems=libvirt-fedora-27/ws/api_test.go>:506 +0x5b1 testing.tRunner(0xc4200980f0, 0x604ea0) /usr/lib/golang/src/testing/testing.go:746 +0xd0 created by testing.(*T).Run /usr/lib/golang/src/testing/testing.go:789 +0x2de exit status 2 FAIL _<https://ci.centos.org/job/libvirt-go-master-check/systems=libvirt-fedora-27/ws/> 1.063s Build step 'Execute shell' marked build as failure

See <https://ci.centos.org/job/libvirt-go-master-check/systems=libvirt-fedora-27/1110/display/redirect> ------------------------------------------ Started by upstream project "libvirt-go-master-check" build number 1110 originally caused by: Started by upstream project "libvirt-go-master-build" build number 1121 originally caused by: Started by upstream project "libvirt-master-build" build number 1520 originally caused by: Started by an SCM change Started by an SCM change Started by an SCM change Started by an SCM change [EnvInject] - Loading node environment variables. Building remotely on libvirt-fedora-27 (libvirt) in workspace <https://ci.centos.org/job/libvirt-go-master-check/systems=libvirt-fedora-27/ws/> [libvirt-go-master] $ /bin/sh -xe /tmp/jenkins7843984588418408455.sh + export 'TEST_ARGS=-tags api' + TEST_ARGS='-tags api' + go test -tags api Missing function 'virDomainGetLaunchSecurityInfo' Missing function 'virNodeGetSEVInfo' Missing macro 'VIR_DOMAIN_LAUNCH_SECURITY_SEV_MEASUREMENT' Missing macro 'VIR_NODE_SEV_CBITPOS' Missing macro 'VIR_NODE_SEV_CERT_CHAIN' Missing macro 'VIR_NODE_SEV_PDH' Missing macro 'VIR_NODE_SEV_REDUCED_PHYS_BITS' --- FAIL: TestAPICoverage (0.39s) panic: Missing symbols found [recovered] panic: Missing symbols found goroutine 4 [running]: testing.tRunner.func1(0xc4200b20f0) /usr/lib/golang/src/testing/testing.go:711 +0x2d2 panic(0x5b60a0, 0x61a660) /usr/lib/golang/src/runtime/panic.go:491 +0x283 _<https://ci.centos.org/job/libvirt-go-master-check/systems=libvirt-fedora-27/ws/.TestAPICoverage(0xc4200b20f0)> <https://ci.centos.org/job/libvirt-go-master-check/systems=libvirt-fedora-27/ws/api_test.go>:506 +0x5b1 testing.tRunner(0xc4200b20f0, 0x604ea0) /usr/lib/golang/src/testing/testing.go:746 +0xd0 created by testing.(*T).Run /usr/lib/golang/src/testing/testing.go:789 +0x2de exit status 2 FAIL _<https://ci.centos.org/job/libvirt-go-master-check/systems=libvirt-fedora-27/ws/> 0.518s Build step 'Execute shell' marked build as failure

See <https://ci.centos.org/job/libvirt-go-master-check/systems=libvirt-fedora-27/1111/display/redirect> ------------------------------------------ Started by upstream project "libvirt-go-master-check" build number 1111 originally caused by: Started by upstream project "libvirt-go-master-build" build number 1122 originally caused by: Started by upstream project "libvirt-master-build" build number 1521 originally caused by: Started by an SCM change [EnvInject] - Loading node environment variables. Building remotely on libvirt-fedora-27 (libvirt) in workspace <https://ci.centos.org/job/libvirt-go-master-check/systems=libvirt-fedora-27/ws/> [libvirt-go-master] $ /bin/sh -xe /tmp/jenkins4326223086201550805.sh + export 'TEST_ARGS=-tags api' + TEST_ARGS='-tags api' + go test -tags api Missing function 'virDomainGetLaunchSecurityInfo' Missing function 'virNodeGetSEVInfo' Missing macro 'VIR_DOMAIN_LAUNCH_SECURITY_SEV_MEASUREMENT' Missing macro 'VIR_NODE_SEV_CBITPOS' Missing macro 'VIR_NODE_SEV_CERT_CHAIN' Missing macro 'VIR_NODE_SEV_PDH' Missing macro 'VIR_NODE_SEV_REDUCED_PHYS_BITS' --- FAIL: TestAPICoverage (1.06s) panic: Missing symbols found [recovered] panic: Missing symbols found goroutine 19 [running]: testing.tRunner.func1(0xc4200b00f0) /usr/lib/golang/src/testing/testing.go:711 +0x2d2 panic(0x5b60a0, 0x61a660) /usr/lib/golang/src/runtime/panic.go:491 +0x283 _<https://ci.centos.org/job/libvirt-go-master-check/systems=libvirt-fedora-27/ws/.TestAPICoverage(0xc4200b00f0)> <https://ci.centos.org/job/libvirt-go-master-check/systems=libvirt-fedora-27/ws/api_test.go>:506 +0x5b1 testing.tRunner(0xc4200b00f0, 0x604ea0) /usr/lib/golang/src/testing/testing.go:746 +0xd0 created by testing.(*T).Run /usr/lib/golang/src/testing/testing.go:789 +0x2de exit status 2 FAIL _<https://ci.centos.org/job/libvirt-go-master-check/systems=libvirt-fedora-27/ws/> 1.275s Build step 'Execute shell' marked build as failure

See <https://ci.centos.org/job/libvirt-go-master-check/systems=libvirt-fedora-27/1112/display/redirect> ------------------------------------------ Started by upstream project "libvirt-go-master-check" build number 1112 originally caused by: Started by upstream project "libvirt-go-master-build" build number 1123 originally caused by: Started by upstream project "libvirt-master-build" build number 1522 originally caused by: Started by an SCM change [EnvInject] - Loading node environment variables. Building remotely on libvirt-fedora-27 (libvirt) in workspace <https://ci.centos.org/job/libvirt-go-master-check/systems=libvirt-fedora-27/ws/> [libvirt-go-master] $ /bin/sh -xe /tmp/jenkins1478320619283743553.sh + export 'TEST_ARGS=-tags api' + TEST_ARGS='-tags api' + go test -tags api Missing function 'virDomainGetLaunchSecurityInfo' Missing function 'virNodeGetSEVInfo' Missing macro 'VIR_DOMAIN_LAUNCH_SECURITY_SEV_MEASUREMENT' Missing macro 'VIR_NODE_SEV_CBITPOS' Missing macro 'VIR_NODE_SEV_CERT_CHAIN' Missing macro 'VIR_NODE_SEV_PDH' Missing macro 'VIR_NODE_SEV_REDUCED_PHYS_BITS' --- FAIL: TestAPICoverage (1.04s) panic: Missing symbols found [recovered] panic: Missing symbols found goroutine 5 [running]: testing.tRunner.func1(0xc4200980f0) /usr/lib/golang/src/testing/testing.go:711 +0x2d2 panic(0x5b60a0, 0x61a660) /usr/lib/golang/src/runtime/panic.go:491 +0x283 _<https://ci.centos.org/job/libvirt-go-master-check/systems=libvirt-fedora-27/ws/.TestAPICoverage(0xc4200980f0)> <https://ci.centos.org/job/libvirt-go-master-check/systems=libvirt-fedora-27/ws/api_test.go>:506 +0x5b1 testing.tRunner(0xc4200980f0, 0x604ea0) /usr/lib/golang/src/testing/testing.go:746 +0xd0 created by testing.(*T).Run /usr/lib/golang/src/testing/testing.go:789 +0x2de exit status 2 FAIL _<https://ci.centos.org/job/libvirt-go-master-check/systems=libvirt-fedora-27/ws/> 1.298s Build step 'Execute shell' marked build as failure

See <https://ci.centos.org/job/libvirt-go-master-check/systems=libvirt-fedora-27/1113/display/redirect> ------------------------------------------ Started by upstream project "libvirt-go-master-check" build number 1113 originally caused by: Started by upstream project "libvirt-go-master-build" build number 1124 originally caused by: Started by upstream project "libvirt-master-build" build number 1523 originally caused by: Started by an SCM change [EnvInject] - Loading node environment variables. Building remotely on libvirt-fedora-27 (libvirt) in workspace <https://ci.centos.org/job/libvirt-go-master-check/systems=libvirt-fedora-27/ws/> [libvirt-go-master] $ /bin/sh -xe /tmp/jenkins7474974488115615149.sh + export 'TEST_ARGS=-tags api' + TEST_ARGS='-tags api' + go test -tags api Missing function 'virDomainGetLaunchSecurityInfo' Missing function 'virNodeGetSEVInfo' Missing macro 'VIR_DOMAIN_LAUNCH_SECURITY_SEV_MEASUREMENT' Missing macro 'VIR_NODE_SEV_CBITPOS' Missing macro 'VIR_NODE_SEV_CERT_CHAIN' Missing macro 'VIR_NODE_SEV_PDH' Missing macro 'VIR_NODE_SEV_REDUCED_PHYS_BITS' --- FAIL: TestAPICoverage (0.33s) panic: Missing symbols found [recovered] panic: Missing symbols found goroutine 5 [running]: testing.tRunner.func1(0xc4200980f0) /usr/lib/golang/src/testing/testing.go:711 +0x2d2 panic(0x5b60a0, 0x61a660) /usr/lib/golang/src/runtime/panic.go:491 +0x283 _<https://ci.centos.org/job/libvirt-go-master-check/systems=libvirt-fedora-27/ws/.TestAPICoverage(0xc4200980f0)> <https://ci.centos.org/job/libvirt-go-master-check/systems=libvirt-fedora-27/ws/api_test.go>:506 +0x5b1 testing.tRunner(0xc4200980f0, 0x604ea0) /usr/lib/golang/src/testing/testing.go:746 +0xd0 created by testing.(*T).Run /usr/lib/golang/src/testing/testing.go:789 +0x2de exit status 2 FAIL _<https://ci.centos.org/job/libvirt-go-master-check/systems=libvirt-fedora-27/ws/> 0.435s Build step 'Execute shell' marked build as failure

See <https://ci.centos.org/job/libvirt-go-master-check/systems=libvirt-fedora-27/1114/display/redirect> ------------------------------------------ Started by upstream project "libvirt-go-master-check" build number 1114 originally caused by: Started by upstream project "libvirt-go-master-build" build number 1125 originally caused by: Started by upstream project "libvirt-master-build" build number 1524 originally caused by: Started by an SCM change Started by an SCM change Started by an SCM change [EnvInject] - Loading node environment variables. Building remotely on libvirt-fedora-27 (libvirt) in workspace <https://ci.centos.org/job/libvirt-go-master-check/systems=libvirt-fedora-27/ws/> [libvirt-go-master] $ /bin/sh -xe /tmp/jenkins1937335267239598432.sh + export 'TEST_ARGS=-tags api' + TEST_ARGS='-tags api' + go test -tags api Missing function 'virDomainGetLaunchSecurityInfo' Missing function 'virNodeGetSEVInfo' Missing macro 'VIR_DOMAIN_LAUNCH_SECURITY_SEV_MEASUREMENT' Missing macro 'VIR_NODE_SEV_CBITPOS' Missing macro 'VIR_NODE_SEV_CERT_CHAIN' Missing macro 'VIR_NODE_SEV_PDH' Missing macro 'VIR_NODE_SEV_REDUCED_PHYS_BITS' --- FAIL: TestAPICoverage (0.56s) panic: Missing symbols found [recovered] panic: Missing symbols found goroutine 19 [running]: testing.tRunner.func1(0xc4200b00f0) /usr/lib/golang/src/testing/testing.go:711 +0x2d2 panic(0x5b60a0, 0x61a660) /usr/lib/golang/src/runtime/panic.go:491 +0x283 _<https://ci.centos.org/job/libvirt-go-master-check/systems=libvirt-fedora-27/ws/.TestAPICoverage(0xc4200b00f0)> <https://ci.centos.org/job/libvirt-go-master-check/systems=libvirt-fedora-27/ws/api_test.go>:506 +0x5b1 testing.tRunner(0xc4200b00f0, 0x604ea0) /usr/lib/golang/src/testing/testing.go:746 +0xd0 created by testing.(*T).Run /usr/lib/golang/src/testing/testing.go:789 +0x2de exit status 2 FAIL _<https://ci.centos.org/job/libvirt-go-master-check/systems=libvirt-fedora-27/ws/> 0.661s Build step 'Execute shell' marked build as failure

See <https://ci.centos.org/job/libvirt-go-master-check/systems=libvirt-fedora-27/1115/display/redirect> ------------------------------------------ Started by upstream project "libvirt-go-master-check" build number 1115 originally caused by: Started by upstream project "libvirt-go-master-build" build number 1126 originally caused by: Started by upstream project "libvirt-master-build" build number 1525 originally caused by: Started by an SCM change [EnvInject] - Loading node environment variables. Building remotely on libvirt-fedora-27 (libvirt) in workspace <https://ci.centos.org/job/libvirt-go-master-check/systems=libvirt-fedora-27/ws/> [libvirt-go-master] $ /bin/sh -xe /tmp/jenkins3225960533311308323.sh + export 'TEST_ARGS=-tags api' + TEST_ARGS='-tags api' + go test -tags api Missing function 'virDomainGetLaunchSecurityInfo' Missing function 'virNodeGetSEVInfo' Missing macro 'VIR_DOMAIN_LAUNCH_SECURITY_SEV_MEASUREMENT' Missing macro 'VIR_NODE_SEV_CBITPOS' Missing macro 'VIR_NODE_SEV_CERT_CHAIN' Missing macro 'VIR_NODE_SEV_PDH' Missing macro 'VIR_NODE_SEV_REDUCED_PHYS_BITS' --- FAIL: TestAPICoverage (1.03s) panic: Missing symbols found [recovered] panic: Missing symbols found goroutine 5 [running]: testing.tRunner.func1(0xc4200980f0) /usr/lib/golang/src/testing/testing.go:711 +0x2d2 panic(0x5b60a0, 0x61a660) /usr/lib/golang/src/runtime/panic.go:491 +0x283 _<https://ci.centos.org/job/libvirt-go-master-check/systems=libvirt-fedora-27/ws/.TestAPICoverage(0xc4200980f0)> <https://ci.centos.org/job/libvirt-go-master-check/systems=libvirt-fedora-27/ws/api_test.go>:506 +0x5b1 testing.tRunner(0xc4200980f0, 0x604ea0) /usr/lib/golang/src/testing/testing.go:746 +0xd0 created by testing.(*T).Run /usr/lib/golang/src/testing/testing.go:789 +0x2de exit status 2 FAIL _<https://ci.centos.org/job/libvirt-go-master-check/systems=libvirt-fedora-27/ws/> 1.159s Build step 'Execute shell' marked build as failure

See <https://ci.centos.org/job/libvirt-go-master-check/systems=libvirt-fedora-27/1116/display/redirect> ------------------------------------------ Started by upstream project "libvirt-go-master-check" build number 1116 originally caused by: Started by upstream project "libvirt-go-master-build" build number 1127 originally caused by: Started by upstream project "libvirt-master-build" build number 1526 originally caused by: Started by an SCM change [EnvInject] - Loading node environment variables. Building remotely on libvirt-fedora-27 (libvirt) in workspace <https://ci.centos.org/job/libvirt-go-master-check/systems=libvirt-fedora-27/ws/> [libvirt-go-master] $ /bin/sh -xe /tmp/jenkins6471968193669400749.sh + export 'TEST_ARGS=-tags api' + TEST_ARGS='-tags api' + go test -tags api Missing function 'virDomainGetLaunchSecurityInfo' Missing function 'virNodeGetSEVInfo' Missing macro 'VIR_DOMAIN_LAUNCH_SECURITY_SEV_MEASUREMENT' Missing macro 'VIR_NODE_SEV_CBITPOS' Missing macro 'VIR_NODE_SEV_CERT_CHAIN' Missing macro 'VIR_NODE_SEV_PDH' Missing macro 'VIR_NODE_SEV_REDUCED_PHYS_BITS' --- FAIL: TestAPICoverage (1.29s) panic: Missing symbols found [recovered] panic: Missing symbols found goroutine 5 [running]: testing.tRunner.func1(0xc4200980f0) /usr/lib/golang/src/testing/testing.go:711 +0x2d2 panic(0x5b60a0, 0x61a660) /usr/lib/golang/src/runtime/panic.go:491 +0x283 _<https://ci.centos.org/job/libvirt-go-master-check/systems=libvirt-fedora-27/ws/.TestAPICoverage(0xc4200980f0)> <https://ci.centos.org/job/libvirt-go-master-check/systems=libvirt-fedora-27/ws/api_test.go>:506 +0x5b1 testing.tRunner(0xc4200980f0, 0x604ea0) /usr/lib/golang/src/testing/testing.go:746 +0xd0 created by testing.(*T).Run /usr/lib/golang/src/testing/testing.go:789 +0x2de exit status 2 FAIL _<https://ci.centos.org/job/libvirt-go-master-check/systems=libvirt-fedora-27/ws/> 1.810s Build step 'Execute shell' marked build as failure

See <https://ci.centos.org/job/libvirt-go-master-check/systems=libvirt-fedora-27/1117/display/redirect> ------------------------------------------ Started by upstream project "libvirt-go-master-check" build number 1117 originally caused by: Started by upstream project "libvirt-go-master-build" build number 1128 originally caused by: Started by upstream project "libvirt-master-build" build number 1527 originally caused by: Started by an SCM change [EnvInject] - Loading node environment variables. Building remotely on libvirt-fedora-27 (libvirt) in workspace <https://ci.centos.org/job/libvirt-go-master-check/systems=libvirt-fedora-27/ws/> [libvirt-go-master] $ /bin/sh -xe /tmp/jenkins8560210510205398595.sh + export 'TEST_ARGS=-tags api' + TEST_ARGS='-tags api' + go test -tags api Missing function 'virDomainGetLaunchSecurityInfo' Missing function 'virNodeGetSEVInfo' Missing macro 'VIR_DOMAIN_LAUNCH_SECURITY_SEV_MEASUREMENT' Missing macro 'VIR_NODE_SEV_CBITPOS' Missing macro 'VIR_NODE_SEV_CERT_CHAIN' Missing macro 'VIR_NODE_SEV_PDH' Missing macro 'VIR_NODE_SEV_REDUCED_PHYS_BITS' --- FAIL: TestAPICoverage (0.40s) panic: Missing symbols found [recovered] panic: Missing symbols found goroutine 5 [running]: testing.tRunner.func1(0xc4200980f0) /usr/lib/golang/src/testing/testing.go:711 +0x2d2 panic(0x5b60a0, 0x61a660) /usr/lib/golang/src/runtime/panic.go:491 +0x283 _<https://ci.centos.org/job/libvirt-go-master-check/systems=libvirt-fedora-27/ws/.TestAPICoverage(0xc4200980f0)> <https://ci.centos.org/job/libvirt-go-master-check/systems=libvirt-fedora-27/ws/api_test.go>:506 +0x5b1 testing.tRunner(0xc4200980f0, 0x604ea0) /usr/lib/golang/src/testing/testing.go:746 +0xd0 created by testing.(*T).Run /usr/lib/golang/src/testing/testing.go:789 +0x2de exit status 2 FAIL _<https://ci.centos.org/job/libvirt-go-master-check/systems=libvirt-fedora-27/ws/> 0.483s Build step 'Execute shell' marked build as failure

See <https://ci.centos.org/job/libvirt-go-master-check/systems=libvirt-fedora-27/1118/display/redirect> ------------------------------------------ Started by upstream project "libvirt-go-master-check" build number 1118 originally caused by: Started by upstream project "libvirt-go-master-build" build number 1129 originally caused by: Started by upstream project "libvirt-master-build" build number 1528 originally caused by: Started by an SCM change [EnvInject] - Loading node environment variables. Building remotely on libvirt-fedora-27 (libvirt) in workspace <https://ci.centos.org/job/libvirt-go-master-check/systems=libvirt-fedora-27/ws/> [libvirt-go-master] $ /bin/sh -xe /tmp/jenkins650836190306069970.sh + export 'TEST_ARGS=-tags api' + TEST_ARGS='-tags api' + go test -tags api Missing function 'virDomainGetLaunchSecurityInfo' Missing function 'virNodeGetSEVInfo' Missing macro 'VIR_DOMAIN_LAUNCH_SECURITY_SEV_MEASUREMENT' Missing macro 'VIR_NODE_SEV_CBITPOS' Missing macro 'VIR_NODE_SEV_CERT_CHAIN' Missing macro 'VIR_NODE_SEV_PDH' Missing macro 'VIR_NODE_SEV_REDUCED_PHYS_BITS' --- FAIL: TestAPICoverage (0.54s) panic: Missing symbols found [recovered] panic: Missing symbols found goroutine 5 [running]: testing.tRunner.func1(0xc4200980f0) /usr/lib/golang/src/testing/testing.go:711 +0x2d2 panic(0x5b60a0, 0x61a660) /usr/lib/golang/src/runtime/panic.go:491 +0x283 _<https://ci.centos.org/job/libvirt-go-master-check/systems=libvirt-fedora-27/ws/.TestAPICoverage(0xc4200980f0)> <https://ci.centos.org/job/libvirt-go-master-check/systems=libvirt-fedora-27/ws/api_test.go>:506 +0x5b1 testing.tRunner(0xc4200980f0, 0x604ea0) /usr/lib/golang/src/testing/testing.go:746 +0xd0 created by testing.(*T).Run /usr/lib/golang/src/testing/testing.go:789 +0x2de exit status 2 FAIL _<https://ci.centos.org/job/libvirt-go-master-check/systems=libvirt-fedora-27/ws/> 0.696s Build step 'Execute shell' marked build as failure

See <https://ci.centos.org/job/libvirt-go-master-check/systems=libvirt-fedora-27/1119/display/redirect> ------------------------------------------ Started by upstream project "libvirt-go-master-check" build number 1119 originally caused by: Started by upstream project "libvirt-go-master-build" build number 1130 originally caused by: Started by upstream project "libvirt-master-build" build number 1529 originally caused by: Started by an SCM change Started by an SCM change Started by an SCM change [EnvInject] - Loading node environment variables. Building remotely on libvirt-fedora-27 (libvirt) in workspace <https://ci.centos.org/job/libvirt-go-master-check/systems=libvirt-fedora-27/ws/> [libvirt-go-master] $ /bin/sh -xe /tmp/jenkins5468674839255925263.sh + export 'TEST_ARGS=-tags api' + TEST_ARGS='-tags api' + go test -tags api Missing function 'virDomainGetLaunchSecurityInfo' Missing function 'virNodeGetSEVInfo' Missing macro 'VIR_DOMAIN_LAUNCH_SECURITY_SEV_MEASUREMENT' Missing macro 'VIR_NODE_SEV_CBITPOS' Missing macro 'VIR_NODE_SEV_CERT_CHAIN' Missing macro 'VIR_NODE_SEV_PDH' Missing macro 'VIR_NODE_SEV_REDUCED_PHYS_BITS' --- FAIL: TestAPICoverage (0.50s) panic: Missing symbols found [recovered] panic: Missing symbols found goroutine 5 [running]: testing.tRunner.func1(0xc4200980f0) /usr/lib/golang/src/testing/testing.go:711 +0x2d2 panic(0x5b60a0, 0x61a660) /usr/lib/golang/src/runtime/panic.go:491 +0x283 _<https://ci.centos.org/job/libvirt-go-master-check/systems=libvirt-fedora-27/ws/.TestAPICoverage(0xc4200980f0)> <https://ci.centos.org/job/libvirt-go-master-check/systems=libvirt-fedora-27/ws/api_test.go>:506 +0x5b1 testing.tRunner(0xc4200980f0, 0x604ea0) /usr/lib/golang/src/testing/testing.go:746 +0xd0 created by testing.(*T).Run /usr/lib/golang/src/testing/testing.go:789 +0x2de exit status 2 FAIL _<https://ci.centos.org/job/libvirt-go-master-check/systems=libvirt-fedora-27/ws/> 0.631s Build step 'Execute shell' marked build as failure

See <https://ci.centos.org/job/libvirt-go-master-check/systems=libvirt-fedora-27/1120/display/redirect> ------------------------------------------ Started by upstream project "libvirt-go-master-check" build number 1120 originally caused by: Started by upstream project "libvirt-go-master-build" build number 1131 originally caused by: Started by upstream project "libvirt-master-build" build number 1530 originally caused by: Started by an SCM change [EnvInject] - Loading node environment variables. Building remotely on libvirt-fedora-27 (libvirt) in workspace <https://ci.centos.org/job/libvirt-go-master-check/systems=libvirt-fedora-27/ws/> [libvirt-go-master] $ /bin/sh -xe /tmp/jenkins7640785205622389895.sh + export 'TEST_ARGS=-tags api' + TEST_ARGS='-tags api' + go test -tags api Missing function 'virDomainGetLaunchSecurityInfo' Missing function 'virNodeGetSEVInfo' Missing macro 'VIR_DOMAIN_LAUNCH_SECURITY_SEV_MEASUREMENT' Missing macro 'VIR_NODE_SEV_CBITPOS' Missing macro 'VIR_NODE_SEV_CERT_CHAIN' Missing macro 'VIR_NODE_SEV_PDH' Missing macro 'VIR_NODE_SEV_REDUCED_PHYS_BITS' --- FAIL: TestAPICoverage (0.55s) panic: Missing symbols found [recovered] panic: Missing symbols found goroutine 5 [running]: testing.tRunner.func1(0xc4200980f0) /usr/lib/golang/src/testing/testing.go:711 +0x2d2 panic(0x5b60a0, 0x61a660) /usr/lib/golang/src/runtime/panic.go:491 +0x283 _<https://ci.centos.org/job/libvirt-go-master-check/systems=libvirt-fedora-27/ws/.TestAPICoverage(0xc4200980f0)> <https://ci.centos.org/job/libvirt-go-master-check/systems=libvirt-fedora-27/ws/api_test.go>:506 +0x5b1 testing.tRunner(0xc4200980f0, 0x604ea0) /usr/lib/golang/src/testing/testing.go:746 +0xd0 created by testing.(*T).Run /usr/lib/golang/src/testing/testing.go:789 +0x2de exit status 2 FAIL _<https://ci.centos.org/job/libvirt-go-master-check/systems=libvirt-fedora-27/ws/> 0.641s Build step 'Execute shell' marked build as failure

See <https://ci.centos.org/job/libvirt-go-master-check/systems=libvirt-fedora-27/1121/display/redirect> ------------------------------------------ Started by upstream project "libvirt-go-master-check" build number 1121 originally caused by: Started by upstream project "libvirt-go-master-build" build number 1132 originally caused by: Started by upstream project "libvirt-master-build" build number 1531 originally caused by: Started by an SCM change [EnvInject] - Loading node environment variables. Building remotely on libvirt-fedora-27 (libvirt) in workspace <https://ci.centos.org/job/libvirt-go-master-check/systems=libvirt-fedora-27/ws/> [libvirt-go-master] $ /bin/sh -xe /tmp/jenkins5471453020917916216.sh + export 'TEST_ARGS=-tags api' + TEST_ARGS='-tags api' + go test -tags api Missing function 'virDomainGetLaunchSecurityInfo' Missing function 'virNodeGetSEVInfo' Missing macro 'VIR_DOMAIN_LAUNCH_SECURITY_SEV_MEASUREMENT' Missing macro 'VIR_NODE_SEV_CBITPOS' Missing macro 'VIR_NODE_SEV_CERT_CHAIN' Missing macro 'VIR_NODE_SEV_PDH' Missing macro 'VIR_NODE_SEV_REDUCED_PHYS_BITS' --- FAIL: TestAPICoverage (0.85s) panic: Missing symbols found [recovered] panic: Missing symbols found goroutine 5 [running]: testing.tRunner.func1(0xc4200980f0) /usr/lib/golang/src/testing/testing.go:711 +0x2d2 panic(0x5b60a0, 0x61a660) /usr/lib/golang/src/runtime/panic.go:491 +0x283 _<https://ci.centos.org/job/libvirt-go-master-check/systems=libvirt-fedora-27/ws/.TestAPICoverage(0xc4200980f0)> <https://ci.centos.org/job/libvirt-go-master-check/systems=libvirt-fedora-27/ws/api_test.go>:506 +0x5b1 testing.tRunner(0xc4200980f0, 0x604ea0) /usr/lib/golang/src/testing/testing.go:746 +0xd0 created by testing.(*T).Run /usr/lib/golang/src/testing/testing.go:789 +0x2de exit status 2 FAIL _<https://ci.centos.org/job/libvirt-go-master-check/systems=libvirt-fedora-27/ws/> 1.091s Build step 'Execute shell' marked build as failure

See <https://ci.centos.org/job/libvirt-go-master-check/systems=libvirt-fedora-27/1122/display/redirect> ------------------------------------------ Started by upstream project "libvirt-go-master-check" build number 1122 originally caused by: Started by upstream project "libvirt-go-master-build" build number 1133 originally caused by: Started by upstream project "libvirt-master-build" build number 1532 originally caused by: Started by an SCM change [EnvInject] - Loading node environment variables. Building remotely on libvirt-fedora-27 (libvirt) in workspace <https://ci.centos.org/job/libvirt-go-master-check/systems=libvirt-fedora-27/ws/> [libvirt-go-master] $ /bin/sh -xe /tmp/jenkins7698591284375764784.sh + export 'TEST_ARGS=-tags api' + TEST_ARGS='-tags api' + go test -tags api Missing function 'virDomainGetLaunchSecurityInfo' Missing function 'virNodeGetSEVInfo' Missing macro 'VIR_DOMAIN_LAUNCH_SECURITY_SEV_MEASUREMENT' Missing macro 'VIR_NODE_SEV_CBITPOS' Missing macro 'VIR_NODE_SEV_CERT_CHAIN' Missing macro 'VIR_NODE_SEV_PDH' Missing macro 'VIR_NODE_SEV_REDUCED_PHYS_BITS' --- FAIL: TestAPICoverage (1.08s) panic: Missing symbols found [recovered] panic: Missing symbols found goroutine 5 [running]: testing.tRunner.func1(0xc4200980f0) /usr/lib/golang/src/testing/testing.go:711 +0x2d2 panic(0x5b60a0, 0x61a660) /usr/lib/golang/src/runtime/panic.go:491 +0x283 _<https://ci.centos.org/job/libvirt-go-master-check/systems=libvirt-fedora-27/ws/.TestAPICoverage(0xc4200980f0)> <https://ci.centos.org/job/libvirt-go-master-check/systems=libvirt-fedora-27/ws/api_test.go>:506 +0x5b1 testing.tRunner(0xc4200980f0, 0x604ea0) /usr/lib/golang/src/testing/testing.go:746 +0xd0 created by testing.(*T).Run /usr/lib/golang/src/testing/testing.go:789 +0x2de exit status 2 FAIL _<https://ci.centos.org/job/libvirt-go-master-check/systems=libvirt-fedora-27/ws/> 1.369s Build step 'Execute shell' marked build as failure

See <https://ci.centos.org/job/libvirt-go-master-check/systems=libvirt-fedora-27/1123/display/redirect> ------------------------------------------ Started by upstream project "libvirt-go-master-check" build number 1123 originally caused by: Started by upstream project "libvirt-go-master-build" build number 1134 originally caused by: Started by upstream project "libvirt-master-build" build number 1533 originally caused by: Started by an SCM change [EnvInject] - Loading node environment variables. Building remotely on libvirt-fedora-27 (libvirt) in workspace <https://ci.centos.org/job/libvirt-go-master-check/systems=libvirt-fedora-27/ws/> [libvirt-go-master] $ /bin/sh -xe /tmp/jenkins6002261609783576772.sh + export 'TEST_ARGS=-tags api' + TEST_ARGS='-tags api' + go test -tags api Missing function 'virDomainGetLaunchSecurityInfo' Missing function 'virNodeGetSEVInfo' Missing macro 'VIR_DOMAIN_LAUNCH_SECURITY_SEV_MEASUREMENT' Missing macro 'VIR_NODE_SEV_CBITPOS' Missing macro 'VIR_NODE_SEV_CERT_CHAIN' Missing macro 'VIR_NODE_SEV_PDH' Missing macro 'VIR_NODE_SEV_REDUCED_PHYS_BITS' --- FAIL: TestAPICoverage (0.60s) panic: Missing symbols found [recovered] panic: Missing symbols found goroutine 5 [running]: testing.tRunner.func1(0xc4200980f0) /usr/lib/golang/src/testing/testing.go:711 +0x2d2 panic(0x5b60a0, 0x61a660) /usr/lib/golang/src/runtime/panic.go:491 +0x283 _<https://ci.centos.org/job/libvirt-go-master-check/systems=libvirt-fedora-27/ws/.TestAPICoverage(0xc4200980f0)> <https://ci.centos.org/job/libvirt-go-master-check/systems=libvirt-fedora-27/ws/api_test.go>:506 +0x5b1 testing.tRunner(0xc4200980f0, 0x604ea0) /usr/lib/golang/src/testing/testing.go:746 +0xd0 created by testing.(*T).Run /usr/lib/golang/src/testing/testing.go:789 +0x2de exit status 2 FAIL _<https://ci.centos.org/job/libvirt-go-master-check/systems=libvirt-fedora-27/ws/> 0.734s Build step 'Execute shell' marked build as failure

See <https://ci.centos.org/job/libvirt-go-master-check/systems=libvirt-fedora-27/1124/display/redirect> ------------------------------------------ Started by upstream project "libvirt-go-master-check" build number 1124 originally caused by: Started by upstream project "libvirt-go-master-build" build number 1135 originally caused by: Started by upstream project "libvirt-master-build" build number 1534 originally caused by: Started by an SCM change [EnvInject] - Loading node environment variables. Building remotely on libvirt-fedora-27 (libvirt) in workspace <https://ci.centos.org/job/libvirt-go-master-check/systems=libvirt-fedora-27/ws/> [libvirt-go-master] $ /bin/sh -xe /tmp/jenkins2725574486830928028.sh + export 'TEST_ARGS=-tags api' + TEST_ARGS='-tags api' + go test -tags api Missing function 'virDomainGetLaunchSecurityInfo' Missing function 'virNodeGetSEVInfo' Missing macro 'VIR_DOMAIN_LAUNCH_SECURITY_SEV_MEASUREMENT' Missing macro 'VIR_NODE_SEV_CBITPOS' Missing macro 'VIR_NODE_SEV_CERT_CHAIN' Missing macro 'VIR_NODE_SEV_PDH' Missing macro 'VIR_NODE_SEV_REDUCED_PHYS_BITS' --- FAIL: TestAPICoverage (0.62s) panic: Missing symbols found [recovered] panic: Missing symbols found goroutine 5 [running]: testing.tRunner.func1(0xc4200980f0) /usr/lib/golang/src/testing/testing.go:711 +0x2d2 panic(0x5b60a0, 0x61a660) /usr/lib/golang/src/runtime/panic.go:491 +0x283 _<https://ci.centos.org/job/libvirt-go-master-check/systems=libvirt-fedora-27/ws/.TestAPICoverage(0xc4200980f0)> <https://ci.centos.org/job/libvirt-go-master-check/systems=libvirt-fedora-27/ws/api_test.go>:506 +0x5b1 testing.tRunner(0xc4200980f0, 0x604ea0) /usr/lib/golang/src/testing/testing.go:746 +0xd0 created by testing.(*T).Run /usr/lib/golang/src/testing/testing.go:789 +0x2de exit status 2 FAIL _<https://ci.centos.org/job/libvirt-go-master-check/systems=libvirt-fedora-27/ws/> 0.823s Build step 'Execute shell' marked build as failure

See <https://ci.centos.org/job/libvirt-go-master-check/systems=libvirt-fedora-27/1125/display/redirect> ------------------------------------------ Started by upstream project "libvirt-go-master-check" build number 1125 originally caused by: Started by upstream project "libvirt-go-master-build" build number 1136 originally caused by: Started by upstream project "libvirt-master-build" build number 1535 originally caused by: Started by an SCM change [EnvInject] - Loading node environment variables. Building remotely on libvirt-fedora-27 (libvirt) in workspace <https://ci.centos.org/job/libvirt-go-master-check/systems=libvirt-fedora-27/ws/> [libvirt-go-master] $ /bin/sh -xe /tmp/jenkins8206797120645249850.sh + export 'TEST_ARGS=-tags api' + TEST_ARGS='-tags api' + go test -tags api Missing function 'virDomainGetLaunchSecurityInfo' Missing function 'virNodeGetSEVInfo' Missing macro 'VIR_DOMAIN_LAUNCH_SECURITY_SEV_MEASUREMENT' Missing macro 'VIR_NODE_SEV_CBITPOS' Missing macro 'VIR_NODE_SEV_CERT_CHAIN' Missing macro 'VIR_NODE_SEV_PDH' Missing macro 'VIR_NODE_SEV_REDUCED_PHYS_BITS' --- FAIL: TestAPICoverage (1.28s) panic: Missing symbols found [recovered] panic: Missing symbols found goroutine 19 [running]: testing.tRunner.func1(0xc4200b00f0) /usr/lib/golang/src/testing/testing.go:711 +0x2d2 panic(0x5b60a0, 0x61a660) /usr/lib/golang/src/runtime/panic.go:491 +0x283 _<https://ci.centos.org/job/libvirt-go-master-check/systems=libvirt-fedora-27/ws/.TestAPICoverage(0xc4200b00f0)> <https://ci.centos.org/job/libvirt-go-master-check/systems=libvirt-fedora-27/ws/api_test.go>:506 +0x5b1 testing.tRunner(0xc4200b00f0, 0x604ea0) /usr/lib/golang/src/testing/testing.go:746 +0xd0 created by testing.(*T).Run /usr/lib/golang/src/testing/testing.go:789 +0x2de exit status 2 FAIL _<https://ci.centos.org/job/libvirt-go-master-check/systems=libvirt-fedora-27/ws/> 1.589s Build step 'Execute shell' marked build as failure

See <https://ci.centos.org/job/libvirt-go-master-check/systems=libvirt-fedora-27/1126/display/redirect> ------------------------------------------ Started by upstream project "libvirt-go-master-check" build number 1126 originally caused by: Started by upstream project "libvirt-go-master-build" build number 1138 originally caused by: Started by upstream project "libvirt-master-build" build number 1537 originally caused by: Started by user Libvirt [EnvInject] - Loading node environment variables. Building remotely on libvirt-fedora-27 (libvirt) in workspace <https://ci.centos.org/job/libvirt-go-master-check/systems=libvirt-fedora-27/ws/> [libvirt-go-master] $ /bin/sh -xe /tmp/jenkins7543804211142810571.sh + export 'TEST_ARGS=-tags api' + TEST_ARGS='-tags api' + go test -tags api Missing function 'virConnectListAllNWFilterBindings' Missing function 'virNWFilterBindingCreateXML' Missing function 'virNWFilterBindingDelete' Missing function 'virNWFilterBindingFree' Missing function 'virNWFilterBindingGetFilterName' Missing function 'virNWFilterBindingGetPortDev' Missing function 'virNWFilterBindingGetXMLDesc' Missing function 'virNWFilterBindingLookupByPortDev' Missing function 'virNWFilterBindingRef' Missing enum 'VIR_CONNECT_GET_ALL_DOMAINS_STATS_NOWAIT' Missing enum 'VIR_ERR_INVALID_NWFILTER_BINDING' Missing enum 'VIR_ERR_NO_NWFILTER_BINDING' --- FAIL: TestAPICoverage (1.72s) panic: Missing symbols found [recovered] panic: Missing symbols found goroutine 5 [running]: testing.tRunner.func1(0xc4200980f0) /usr/lib/golang/src/testing/testing.go:711 +0x2d2 panic(0x5b6320, 0x61a900) /usr/lib/golang/src/runtime/panic.go:491 +0x283 _<https://ci.centos.org/job/libvirt-go-master-check/systems=libvirt-fedora-27/ws/.TestAPICoverage(0xc4200980f0)> <https://ci.centos.org/job/libvirt-go-master-check/systems=libvirt-fedora-27/ws/api_test.go>:506 +0x5b1 testing.tRunner(0xc4200980f0, 0x605130) /usr/lib/golang/src/testing/testing.go:746 +0xd0 created by testing.(*T).Run /usr/lib/golang/src/testing/testing.go:789 +0x2de exit status 2 FAIL _<https://ci.centos.org/job/libvirt-go-master-check/systems=libvirt-fedora-27/ws/> 2.249s Build step 'Execute shell' marked build as failure

See <https://ci.centos.org/job/libvirt-go-master-check/systems=libvirt-fedora-27/1127/display/redirect> ------------------------------------------ Started by upstream project "libvirt-go-master-check" build number 1127 originally caused by: Started by upstream project "libvirt-go-master-build" build number 1139 originally caused by: Started by upstream project "libvirt-master-build" build number 1538 originally caused by: Started by an SCM change Started by an SCM change [EnvInject] - Loading node environment variables. Building remotely on libvirt-fedora-27 (libvirt) in workspace <https://ci.centos.org/job/libvirt-go-master-check/systems=libvirt-fedora-27/ws/> [libvirt-go-master] $ /bin/sh -xe /tmp/jenkins8025762674150163132.sh + export 'TEST_ARGS=-tags api' + TEST_ARGS='-tags api' + go test -tags api Missing function 'virConnectListAllNWFilterBindings' Missing function 'virNWFilterBindingCreateXML' Missing function 'virNWFilterBindingDelete' Missing function 'virNWFilterBindingFree' Missing function 'virNWFilterBindingGetFilterName' Missing function 'virNWFilterBindingGetPortDev' Missing function 'virNWFilterBindingGetXMLDesc' Missing function 'virNWFilterBindingLookupByPortDev' Missing function 'virNWFilterBindingRef' Missing enum 'VIR_CONNECT_GET_ALL_DOMAINS_STATS_NOWAIT' Missing enum 'VIR_ERR_INVALID_NWFILTER_BINDING' Missing enum 'VIR_ERR_NO_NWFILTER_BINDING' --- FAIL: TestAPICoverage (0.47s) panic: Missing symbols found [recovered] panic: Missing symbols found goroutine 19 [running]: testing.tRunner.func1(0xc4200b00f0) /usr/lib/golang/src/testing/testing.go:711 +0x2d2 panic(0x5b6320, 0x61a900) /usr/lib/golang/src/runtime/panic.go:491 +0x283 _<https://ci.centos.org/job/libvirt-go-master-check/systems=libvirt-fedora-27/ws/.TestAPICoverage(0xc4200b00f0)> <https://ci.centos.org/job/libvirt-go-master-check/systems=libvirt-fedora-27/ws/api_test.go>:506 +0x5b1 testing.tRunner(0xc4200b00f0, 0x605130) /usr/lib/golang/src/testing/testing.go:746 +0xd0 created by testing.(*T).Run /usr/lib/golang/src/testing/testing.go:789 +0x2de exit status 2 FAIL _<https://ci.centos.org/job/libvirt-go-master-check/systems=libvirt-fedora-27/ws/> 0.538s Build step 'Execute shell' marked build as failure

See <https://ci.centos.org/job/libvirt-go-master-check/systems=libvirt-fedora-27/1128/display/redirect> ------------------------------------------ Started by upstream project "libvirt-go-master-check" build number 1128 originally caused by: Started by upstream project "libvirt-go-master-build" build number 1140 originally caused by: Started by upstream project "libvirt-master-build" build number 1539 originally caused by: Started by an SCM change Started by an SCM change Started by an SCM change [EnvInject] - Loading node environment variables. Building remotely on libvirt-fedora-27 (libvirt) in workspace <https://ci.centos.org/job/libvirt-go-master-check/systems=libvirt-fedora-27/ws/> [libvirt-go-master] $ /bin/sh -xe /tmp/jenkins4088612668545074223.sh + export 'TEST_ARGS=-tags api' + TEST_ARGS='-tags api' + go test -tags api Missing function 'virConnectListAllNWFilterBindings' Missing function 'virNWFilterBindingCreateXML' Missing function 'virNWFilterBindingDelete' Missing function 'virNWFilterBindingFree' Missing function 'virNWFilterBindingGetFilterName' Missing function 'virNWFilterBindingGetPortDev' Missing function 'virNWFilterBindingGetXMLDesc' Missing function 'virNWFilterBindingLookupByPortDev' Missing function 'virNWFilterBindingRef' Missing enum 'VIR_CONNECT_GET_ALL_DOMAINS_STATS_NOWAIT' Missing enum 'VIR_ERR_INVALID_NWFILTER_BINDING' Missing enum 'VIR_ERR_NO_NWFILTER_BINDING' --- FAIL: TestAPICoverage (0.21s) panic: Missing symbols found [recovered] panic: Missing symbols found goroutine 5 [running]: testing.tRunner.func1(0xc4200980f0) /usr/lib/golang/src/testing/testing.go:711 +0x2d2 panic(0x5b6320, 0x61a900) /usr/lib/golang/src/runtime/panic.go:491 +0x283 _<https://ci.centos.org/job/libvirt-go-master-check/systems=libvirt-fedora-27/ws/.TestAPICoverage(0xc4200980f0)> <https://ci.centos.org/job/libvirt-go-master-check/systems=libvirt-fedora-27/ws/api_test.go>:506 +0x5b1 testing.tRunner(0xc4200980f0, 0x605130) /usr/lib/golang/src/testing/testing.go:746 +0xd0 created by testing.(*T).Run /usr/lib/golang/src/testing/testing.go:789 +0x2de exit status 2 FAIL _<https://ci.centos.org/job/libvirt-go-master-check/systems=libvirt-fedora-27/ws/> 0.278s Build step 'Execute shell' marked build as failure

participants (1)
-
ci@centos.org