[Libvirt-ci] Build failed in Jenkins: libvirt-go-master-check » libvirt-fedora-rawhide #1109

See <https://ci.centos.org/job/libvirt-go-master-check/systems=libvirt-fedora-rawhide/1109/display/redirect> ------------------------------------------ Started by upstream project "libvirt-go-master-check" build number 1109 originally caused by: Started by upstream project "libvirt-go-master-build" build number 1120 originally caused by: Started by upstream project "libvirt-master-build" build number 1519 originally caused by: Started by an SCM change Started by an SCM change [EnvInject] - Loading node environment variables. Building remotely on libvirt-fedora-rawhide (libvirt) in workspace <https://ci.centos.org/job/libvirt-go-master-check/systems=libvirt-fedora-rawhide/ws/> [libvirt-go-master] $ /bin/sh -xe /tmp/jenkins2544617683860955289.sh + export 'TEST_ARGS=-tags api' + TEST_ARGS='-tags api' + go test -tags api Missing function 'virDomainGetLaunchSecurityInfo' Missing function 'virNodeGetSEVInfo' Missing macro 'VIR_DOMAIN_LAUNCH_SECURITY_SEV_MEASUREMENT' Missing macro 'VIR_NODE_SEV_CBITPOS' Missing macro 'VIR_NODE_SEV_CERT_CHAIN' Missing macro 'VIR_NODE_SEV_PDH' Missing macro 'VIR_NODE_SEV_REDUCED_PHYS_BITS' --- FAIL: TestAPICoverage (0.83s) panic: Missing symbols found [recovered] panic: Missing symbols found goroutine 18 [running]: testing.tRunner.func1(0xc4200b60f0) /usr/lib/golang/src/testing/testing.go:742 +0x29d panic(0x5ad880, 0x611c10) /usr/lib/golang/src/runtime/panic.go:502 +0x229 _<https://ci.centos.org/job/libvirt-go-master-check/systems=libvirt-fedora-rawhide/ws/.TestAPICoverage(0xc4200b60f0)> <https://ci.centos.org/job/libvirt-go-master-check/systems=libvirt-fedora-rawhide/ws/api_test.go>:506 +0x548 testing.tRunner(0xc4200b60f0, 0x5fccf0) /usr/lib/golang/src/testing/testing.go:777 +0xd0 created by testing.(*T).Run /usr/lib/golang/src/testing/testing.go:824 +0x2e0 exit status 2 FAIL _<https://ci.centos.org/job/libvirt-go-master-check/systems=libvirt-fedora-rawhide/ws/> 1.046s Build step 'Execute shell' marked build as failure

See <https://ci.centos.org/job/libvirt-go-master-check/systems=libvirt-fedora-rawhide/1110/display/redirect> ------------------------------------------ Started by upstream project "libvirt-go-master-check" build number 1110 originally caused by: Started by upstream project "libvirt-go-master-build" build number 1121 originally caused by: Started by upstream project "libvirt-master-build" build number 1520 originally caused by: Started by an SCM change Started by an SCM change Started by an SCM change Started by an SCM change [EnvInject] - Loading node environment variables. Building remotely on libvirt-fedora-rawhide (libvirt) in workspace <https://ci.centos.org/job/libvirt-go-master-check/systems=libvirt-fedora-rawhide/ws/> [libvirt-go-master] $ /bin/sh -xe /tmp/jenkins8264487222817980998.sh + export 'TEST_ARGS=-tags api' + TEST_ARGS='-tags api' + go test -tags api Missing function 'virDomainGetLaunchSecurityInfo' Missing function 'virNodeGetSEVInfo' Missing macro 'VIR_DOMAIN_LAUNCH_SECURITY_SEV_MEASUREMENT' Missing macro 'VIR_NODE_SEV_CBITPOS' Missing macro 'VIR_NODE_SEV_CERT_CHAIN' Missing macro 'VIR_NODE_SEV_PDH' Missing macro 'VIR_NODE_SEV_REDUCED_PHYS_BITS' --- FAIL: TestAPICoverage (0.82s) panic: Missing symbols found [recovered] panic: Missing symbols found goroutine 19 [running]: testing.tRunner.func1(0xc4200d60f0) /usr/lib/golang/src/testing/testing.go:742 +0x29d panic(0x5ad880, 0x611c10) /usr/lib/golang/src/runtime/panic.go:502 +0x229 _<https://ci.centos.org/job/libvirt-go-master-check/systems=libvirt-fedora-rawhide/ws/.TestAPICoverage(0xc4200d60f0)> <https://ci.centos.org/job/libvirt-go-master-check/systems=libvirt-fedora-rawhide/ws/api_test.go>:506 +0x548 testing.tRunner(0xc4200d60f0, 0x5fccf0) /usr/lib/golang/src/testing/testing.go:777 +0xd0 created by testing.(*T).Run /usr/lib/golang/src/testing/testing.go:824 +0x2e0 exit status 2 FAIL _<https://ci.centos.org/job/libvirt-go-master-check/systems=libvirt-fedora-rawhide/ws/> 1.137s Build step 'Execute shell' marked build as failure

See <https://ci.centos.org/job/libvirt-go-master-check/systems=libvirt-fedora-rawhide/1111/display/redirect> ------------------------------------------ Started by upstream project "libvirt-go-master-check" build number 1111 originally caused by: Started by upstream project "libvirt-go-master-build" build number 1122 originally caused by: Started by upstream project "libvirt-master-build" build number 1521 originally caused by: Started by an SCM change [EnvInject] - Loading node environment variables. Building remotely on libvirt-fedora-rawhide (libvirt) in workspace <https://ci.centos.org/job/libvirt-go-master-check/systems=libvirt-fedora-rawhide/ws/> [libvirt-go-master] $ /bin/sh -xe /tmp/jenkins1554480957955231179.sh + export 'TEST_ARGS=-tags api' + TEST_ARGS='-tags api' + go test -tags api Missing function 'virDomainGetLaunchSecurityInfo' Missing function 'virNodeGetSEVInfo' Missing macro 'VIR_DOMAIN_LAUNCH_SECURITY_SEV_MEASUREMENT' Missing macro 'VIR_NODE_SEV_CBITPOS' Missing macro 'VIR_NODE_SEV_CERT_CHAIN' Missing macro 'VIR_NODE_SEV_PDH' Missing macro 'VIR_NODE_SEV_REDUCED_PHYS_BITS' --- FAIL: TestAPICoverage (1.09s) panic: Missing symbols found [recovered] panic: Missing symbols found goroutine 19 [running]: testing.tRunner.func1(0xc4200d00f0) /usr/lib/golang/src/testing/testing.go:742 +0x29d panic(0x5ad880, 0x611c10) /usr/lib/golang/src/runtime/panic.go:502 +0x229 _<https://ci.centos.org/job/libvirt-go-master-check/systems=libvirt-fedora-rawhide/ws/.TestAPICoverage(0xc4200d00f0)> <https://ci.centos.org/job/libvirt-go-master-check/systems=libvirt-fedora-rawhide/ws/api_test.go>:506 +0x548 testing.tRunner(0xc4200d00f0, 0x5fccf0) /usr/lib/golang/src/testing/testing.go:777 +0xd0 created by testing.(*T).Run /usr/lib/golang/src/testing/testing.go:824 +0x2e0 exit status 2 FAIL _<https://ci.centos.org/job/libvirt-go-master-check/systems=libvirt-fedora-rawhide/ws/> 1.329s Build step 'Execute shell' marked build as failure

See <https://ci.centos.org/job/libvirt-go-master-check/systems=libvirt-fedora-rawhide/1112/display/redirect> ------------------------------------------ Started by upstream project "libvirt-go-master-check" build number 1112 originally caused by: Started by upstream project "libvirt-go-master-build" build number 1123 originally caused by: Started by upstream project "libvirt-master-build" build number 1522 originally caused by: Started by an SCM change [EnvInject] - Loading node environment variables. Building remotely on libvirt-fedora-rawhide (libvirt) in workspace <https://ci.centos.org/job/libvirt-go-master-check/systems=libvirt-fedora-rawhide/ws/> [libvirt-go-master] $ /bin/sh -xe /tmp/jenkins7428419354076284094.sh + export 'TEST_ARGS=-tags api' + TEST_ARGS='-tags api' + go test -tags api Missing function 'virDomainGetLaunchSecurityInfo' Missing function 'virNodeGetSEVInfo' Missing macro 'VIR_DOMAIN_LAUNCH_SECURITY_SEV_MEASUREMENT' Missing macro 'VIR_NODE_SEV_CBITPOS' Missing macro 'VIR_NODE_SEV_CERT_CHAIN' Missing macro 'VIR_NODE_SEV_PDH' Missing macro 'VIR_NODE_SEV_REDUCED_PHYS_BITS' --- FAIL: TestAPICoverage (0.26s) panic: Missing symbols found [recovered] panic: Missing symbols found goroutine 19 [running]: testing.tRunner.func1(0xc4200d00f0) /usr/lib/golang/src/testing/testing.go:742 +0x29d panic(0x5ad880, 0x611c10) /usr/lib/golang/src/runtime/panic.go:502 +0x229 _<https://ci.centos.org/job/libvirt-go-master-check/systems=libvirt-fedora-rawhide/ws/.TestAPICoverage(0xc4200d00f0)> <https://ci.centos.org/job/libvirt-go-master-check/systems=libvirt-fedora-rawhide/ws/api_test.go>:506 +0x548 testing.tRunner(0xc4200d00f0, 0x5fccf0) /usr/lib/golang/src/testing/testing.go:777 +0xd0 created by testing.(*T).Run /usr/lib/golang/src/testing/testing.go:824 +0x2e0 exit status 2 FAIL _<https://ci.centos.org/job/libvirt-go-master-check/systems=libvirt-fedora-rawhide/ws/> 0.309s Build step 'Execute shell' marked build as failure

See <https://ci.centos.org/job/libvirt-go-master-check/systems=libvirt-fedora-rawhide/1113/display/redirect> ------------------------------------------ Started by upstream project "libvirt-go-master-check" build number 1113 originally caused by: Started by upstream project "libvirt-go-master-build" build number 1124 originally caused by: Started by upstream project "libvirt-master-build" build number 1523 originally caused by: Started by an SCM change [EnvInject] - Loading node environment variables. Building remotely on libvirt-fedora-rawhide (libvirt) in workspace <https://ci.centos.org/job/libvirt-go-master-check/systems=libvirt-fedora-rawhide/ws/> [libvirt-go-master] $ /bin/sh -xe /tmp/jenkins244635665710792198.sh + export 'TEST_ARGS=-tags api' + TEST_ARGS='-tags api' + go test -tags api Missing function 'virDomainGetLaunchSecurityInfo' Missing function 'virNodeGetSEVInfo' Missing macro 'VIR_DOMAIN_LAUNCH_SECURITY_SEV_MEASUREMENT' Missing macro 'VIR_NODE_SEV_CBITPOS' Missing macro 'VIR_NODE_SEV_CERT_CHAIN' Missing macro 'VIR_NODE_SEV_PDH' Missing macro 'VIR_NODE_SEV_REDUCED_PHYS_BITS' --- FAIL: TestAPICoverage (0.90s) panic: Missing symbols found [recovered] panic: Missing symbols found goroutine 4 [running]: testing.tRunner.func1(0xc4200d20f0) /usr/lib/golang/src/testing/testing.go:742 +0x29d panic(0x5ad880, 0x611c10) /usr/lib/golang/src/runtime/panic.go:502 +0x229 _<https://ci.centos.org/job/libvirt-go-master-check/systems=libvirt-fedora-rawhide/ws/.TestAPICoverage(0xc4200d20f0)> <https://ci.centos.org/job/libvirt-go-master-check/systems=libvirt-fedora-rawhide/ws/api_test.go>:506 +0x548 testing.tRunner(0xc4200d20f0, 0x5fccf0) /usr/lib/golang/src/testing/testing.go:777 +0xd0 created by testing.(*T).Run /usr/lib/golang/src/testing/testing.go:824 +0x2e0 exit status 2 FAIL _<https://ci.centos.org/job/libvirt-go-master-check/systems=libvirt-fedora-rawhide/ws/> 1.081s Build step 'Execute shell' marked build as failure

See <https://ci.centos.org/job/libvirt-go-master-check/systems=libvirt-fedora-rawhide/1114/display/redirect> ------------------------------------------ Started by upstream project "libvirt-go-master-check" build number 1114 originally caused by: Started by upstream project "libvirt-go-master-build" build number 1125 originally caused by: Started by upstream project "libvirt-master-build" build number 1524 originally caused by: Started by an SCM change Started by an SCM change Started by an SCM change [EnvInject] - Loading node environment variables. Building remotely on libvirt-fedora-rawhide (libvirt) in workspace <https://ci.centos.org/job/libvirt-go-master-check/systems=libvirt-fedora-rawhide/ws/> [libvirt-go-master] $ /bin/sh -xe /tmp/jenkins4607463939195613681.sh + export 'TEST_ARGS=-tags api' + TEST_ARGS='-tags api' + go test -tags api Missing function 'virDomainGetLaunchSecurityInfo' Missing function 'virNodeGetSEVInfo' Missing macro 'VIR_DOMAIN_LAUNCH_SECURITY_SEV_MEASUREMENT' Missing macro 'VIR_NODE_SEV_CBITPOS' Missing macro 'VIR_NODE_SEV_CERT_CHAIN' Missing macro 'VIR_NODE_SEV_PDH' Missing macro 'VIR_NODE_SEV_REDUCED_PHYS_BITS' --- FAIL: TestAPICoverage (0.68s) panic: Missing symbols found [recovered] panic: Missing symbols found goroutine 19 [running]: testing.tRunner.func1(0xc4200de0f0) /usr/lib/golang/src/testing/testing.go:742 +0x29d panic(0x5ad880, 0x611c10) /usr/lib/golang/src/runtime/panic.go:502 +0x229 _<https://ci.centos.org/job/libvirt-go-master-check/systems=libvirt-fedora-rawhide/ws/.TestAPICoverage(0xc4200de0f0)> <https://ci.centos.org/job/libvirt-go-master-check/systems=libvirt-fedora-rawhide/ws/api_test.go>:506 +0x548 testing.tRunner(0xc4200de0f0, 0x5fccf0) /usr/lib/golang/src/testing/testing.go:777 +0xd0 created by testing.(*T).Run /usr/lib/golang/src/testing/testing.go:824 +0x2e0 exit status 2 FAIL _<https://ci.centos.org/job/libvirt-go-master-check/systems=libvirt-fedora-rawhide/ws/> 0.800s Build step 'Execute shell' marked build as failure

See <https://ci.centos.org/job/libvirt-go-master-check/systems=libvirt-fedora-rawhide/1115/display/redirect> ------------------------------------------ Started by upstream project "libvirt-go-master-check" build number 1115 originally caused by: Started by upstream project "libvirt-go-master-build" build number 1126 originally caused by: Started by upstream project "libvirt-master-build" build number 1525 originally caused by: Started by an SCM change [EnvInject] - Loading node environment variables. Building remotely on libvirt-fedora-rawhide (libvirt) in workspace <https://ci.centos.org/job/libvirt-go-master-check/systems=libvirt-fedora-rawhide/ws/> [libvirt-go-master] $ /bin/sh -xe /tmp/jenkins5034560967655154795.sh + export 'TEST_ARGS=-tags api' + TEST_ARGS='-tags api' + go test -tags api Missing function 'virDomainGetLaunchSecurityInfo' Missing function 'virNodeGetSEVInfo' Missing macro 'VIR_DOMAIN_LAUNCH_SECURITY_SEV_MEASUREMENT' Missing macro 'VIR_NODE_SEV_CBITPOS' Missing macro 'VIR_NODE_SEV_CERT_CHAIN' Missing macro 'VIR_NODE_SEV_PDH' Missing macro 'VIR_NODE_SEV_REDUCED_PHYS_BITS' --- FAIL: TestAPICoverage (0.78s) panic: Missing symbols found [recovered] panic: Missing symbols found goroutine 5 [running]: testing.tRunner.func1(0xc4200aa0f0) /usr/lib/golang/src/testing/testing.go:742 +0x29d panic(0x5ad880, 0x611c10) /usr/lib/golang/src/runtime/panic.go:502 +0x229 _<https://ci.centos.org/job/libvirt-go-master-check/systems=libvirt-fedora-rawhide/ws/.TestAPICoverage(0xc4200aa0f0)> <https://ci.centos.org/job/libvirt-go-master-check/systems=libvirt-fedora-rawhide/ws/api_test.go>:506 +0x548 testing.tRunner(0xc4200aa0f0, 0x5fccf0) /usr/lib/golang/src/testing/testing.go:777 +0xd0 created by testing.(*T).Run /usr/lib/golang/src/testing/testing.go:824 +0x2e0 exit status 2 FAIL _<https://ci.centos.org/job/libvirt-go-master-check/systems=libvirt-fedora-rawhide/ws/> 1.010s Build step 'Execute shell' marked build as failure

See <https://ci.centos.org/job/libvirt-go-master-check/systems=libvirt-fedora-rawhide/1116/display/redirect> ------------------------------------------ Started by upstream project "libvirt-go-master-check" build number 1116 originally caused by: Started by upstream project "libvirt-go-master-build" build number 1127 originally caused by: Started by upstream project "libvirt-master-build" build number 1526 originally caused by: Started by an SCM change [EnvInject] - Loading node environment variables. Building remotely on libvirt-fedora-rawhide (libvirt) in workspace <https://ci.centos.org/job/libvirt-go-master-check/systems=libvirt-fedora-rawhide/ws/> [libvirt-go-master] $ /bin/sh -xe /tmp/jenkins3974981467709744706.sh + export 'TEST_ARGS=-tags api' + TEST_ARGS='-tags api' + go test -tags api Missing function 'virDomainGetLaunchSecurityInfo' Missing function 'virNodeGetSEVInfo' Missing macro 'VIR_DOMAIN_LAUNCH_SECURITY_SEV_MEASUREMENT' Missing macro 'VIR_NODE_SEV_CBITPOS' Missing macro 'VIR_NODE_SEV_CERT_CHAIN' Missing macro 'VIR_NODE_SEV_PDH' Missing macro 'VIR_NODE_SEV_REDUCED_PHYS_BITS' --- FAIL: TestAPICoverage (1.25s) panic: Missing symbols found [recovered] panic: Missing symbols found goroutine 20 [running]: testing.tRunner.func1(0xc4200ce0f0) /usr/lib/golang/src/testing/testing.go:742 +0x29d panic(0x5ad880, 0x611c10) /usr/lib/golang/src/runtime/panic.go:502 +0x229 _<https://ci.centos.org/job/libvirt-go-master-check/systems=libvirt-fedora-rawhide/ws/.TestAPICoverage(0xc4200ce0f0)> <https://ci.centos.org/job/libvirt-go-master-check/systems=libvirt-fedora-rawhide/ws/api_test.go>:506 +0x548 testing.tRunner(0xc4200ce0f0, 0x5fccf0) /usr/lib/golang/src/testing/testing.go:777 +0xd0 created by testing.(*T).Run /usr/lib/golang/src/testing/testing.go:824 +0x2e0 exit status 2 FAIL _<https://ci.centos.org/job/libvirt-go-master-check/systems=libvirt-fedora-rawhide/ws/> 1.611s Build step 'Execute shell' marked build as failure

See <https://ci.centos.org/job/libvirt-go-master-check/systems=libvirt-fedora-rawhide/1117/display/redirect> ------------------------------------------ Started by upstream project "libvirt-go-master-check" build number 1117 originally caused by: Started by upstream project "libvirt-go-master-build" build number 1128 originally caused by: Started by upstream project "libvirt-master-build" build number 1527 originally caused by: Started by an SCM change [EnvInject] - Loading node environment variables. Building remotely on libvirt-fedora-rawhide (libvirt) in workspace <https://ci.centos.org/job/libvirt-go-master-check/systems=libvirt-fedora-rawhide/ws/> [libvirt-go-master] $ /bin/sh -xe /tmp/jenkins4828363030667206595.sh + export 'TEST_ARGS=-tags api' + TEST_ARGS='-tags api' + go test -tags api Missing function 'virDomainGetLaunchSecurityInfo' Missing function 'virNodeGetSEVInfo' Missing macro 'VIR_DOMAIN_LAUNCH_SECURITY_SEV_MEASUREMENT' Missing macro 'VIR_NODE_SEV_CBITPOS' Missing macro 'VIR_NODE_SEV_CERT_CHAIN' Missing macro 'VIR_NODE_SEV_PDH' Missing macro 'VIR_NODE_SEV_REDUCED_PHYS_BITS' --- FAIL: TestAPICoverage (1.18s) panic: Missing symbols found [recovered] panic: Missing symbols found goroutine 19 [running]: testing.tRunner.func1(0xc4200d00f0) /usr/lib/golang/src/testing/testing.go:742 +0x29d panic(0x5ad880, 0x611c10) /usr/lib/golang/src/runtime/panic.go:502 +0x229 _<https://ci.centos.org/job/libvirt-go-master-check/systems=libvirt-fedora-rawhide/ws/.TestAPICoverage(0xc4200d00f0)> <https://ci.centos.org/job/libvirt-go-master-check/systems=libvirt-fedora-rawhide/ws/api_test.go>:506 +0x548 testing.tRunner(0xc4200d00f0, 0x5fccf0) /usr/lib/golang/src/testing/testing.go:777 +0xd0 created by testing.(*T).Run /usr/lib/golang/src/testing/testing.go:824 +0x2e0 exit status 2 FAIL _<https://ci.centos.org/job/libvirt-go-master-check/systems=libvirt-fedora-rawhide/ws/> 1.407s Build step 'Execute shell' marked build as failure

See <https://ci.centos.org/job/libvirt-go-master-check/systems=libvirt-fedora-rawhide/1118/display/redirect> ------------------------------------------ Started by upstream project "libvirt-go-master-check" build number 1118 originally caused by: Started by upstream project "libvirt-go-master-build" build number 1129 originally caused by: Started by upstream project "libvirt-master-build" build number 1528 originally caused by: Started by an SCM change [EnvInject] - Loading node environment variables. Building remotely on libvirt-fedora-rawhide (libvirt) in workspace <https://ci.centos.org/job/libvirt-go-master-check/systems=libvirt-fedora-rawhide/ws/> [libvirt-go-master] $ /bin/sh -xe /tmp/jenkins2608470304112191976.sh + export 'TEST_ARGS=-tags api' + TEST_ARGS='-tags api' + go test -tags api Missing function 'virDomainGetLaunchSecurityInfo' Missing function 'virNodeGetSEVInfo' Missing macro 'VIR_DOMAIN_LAUNCH_SECURITY_SEV_MEASUREMENT' Missing macro 'VIR_NODE_SEV_CBITPOS' Missing macro 'VIR_NODE_SEV_CERT_CHAIN' Missing macro 'VIR_NODE_SEV_PDH' Missing macro 'VIR_NODE_SEV_REDUCED_PHYS_BITS' --- FAIL: TestAPICoverage (1.28s) panic: Missing symbols found [recovered] panic: Missing symbols found goroutine 4 [running]: testing.tRunner.func1(0xc4200d20f0) /usr/lib/golang/src/testing/testing.go:742 +0x29d panic(0x5ad880, 0x611c10) /usr/lib/golang/src/runtime/panic.go:502 +0x229 _<https://ci.centos.org/job/libvirt-go-master-check/systems=libvirt-fedora-rawhide/ws/.TestAPICoverage(0xc4200d20f0)> <https://ci.centos.org/job/libvirt-go-master-check/systems=libvirt-fedora-rawhide/ws/api_test.go>:506 +0x548 testing.tRunner(0xc4200d20f0, 0x5fccf0) /usr/lib/golang/src/testing/testing.go:777 +0xd0 created by testing.(*T).Run /usr/lib/golang/src/testing/testing.go:824 +0x2e0 exit status 2 FAIL _<https://ci.centos.org/job/libvirt-go-master-check/systems=libvirt-fedora-rawhide/ws/> 2.776s Build step 'Execute shell' marked build as failure

See <https://ci.centos.org/job/libvirt-go-master-check/systems=libvirt-fedora-rawhide/1119/display/redirect> ------------------------------------------ Started by upstream project "libvirt-go-master-check" build number 1119 originally caused by: Started by upstream project "libvirt-go-master-build" build number 1130 originally caused by: Started by upstream project "libvirt-master-build" build number 1529 originally caused by: Started by an SCM change Started by an SCM change Started by an SCM change [EnvInject] - Loading node environment variables. Building remotely on libvirt-fedora-rawhide (libvirt) in workspace <https://ci.centos.org/job/libvirt-go-master-check/systems=libvirt-fedora-rawhide/ws/> [libvirt-go-master] $ /bin/sh -xe /tmp/jenkins4225375798513155006.sh + export 'TEST_ARGS=-tags api' + TEST_ARGS='-tags api' + go test -tags api Missing function 'virDomainGetLaunchSecurityInfo' Missing function 'virNodeGetSEVInfo' Missing macro 'VIR_DOMAIN_LAUNCH_SECURITY_SEV_MEASUREMENT' Missing macro 'VIR_NODE_SEV_CBITPOS' Missing macro 'VIR_NODE_SEV_CERT_CHAIN' Missing macro 'VIR_NODE_SEV_PDH' Missing macro 'VIR_NODE_SEV_REDUCED_PHYS_BITS' --- FAIL: TestAPICoverage (0.95s) panic: Missing symbols found [recovered] panic: Missing symbols found goroutine 19 [running]: testing.tRunner.func1(0xc4200d00f0) /usr/lib/golang/src/testing/testing.go:742 +0x29d panic(0x5ad880, 0x611c10) /usr/lib/golang/src/runtime/panic.go:502 +0x229 _<https://ci.centos.org/job/libvirt-go-master-check/systems=libvirt-fedora-rawhide/ws/.TestAPICoverage(0xc4200d00f0)> <https://ci.centos.org/job/libvirt-go-master-check/systems=libvirt-fedora-rawhide/ws/api_test.go>:506 +0x548 testing.tRunner(0xc4200d00f0, 0x5fccf0) /usr/lib/golang/src/testing/testing.go:777 +0xd0 created by testing.(*T).Run /usr/lib/golang/src/testing/testing.go:824 +0x2e0 exit status 2 FAIL _<https://ci.centos.org/job/libvirt-go-master-check/systems=libvirt-fedora-rawhide/ws/> 1.207s Build step 'Execute shell' marked build as failure

See <https://ci.centos.org/job/libvirt-go-master-check/systems=libvirt-fedora-rawhide/1120/display/redirect> ------------------------------------------ Started by upstream project "libvirt-go-master-check" build number 1120 originally caused by: Started by upstream project "libvirt-go-master-build" build number 1131 originally caused by: Started by upstream project "libvirt-master-build" build number 1530 originally caused by: Started by an SCM change [EnvInject] - Loading node environment variables. Building remotely on libvirt-fedora-rawhide (libvirt) in workspace <https://ci.centos.org/job/libvirt-go-master-check/systems=libvirt-fedora-rawhide/ws/> [libvirt-go-master] $ /bin/sh -xe /tmp/jenkins1584490140312189865.sh + export 'TEST_ARGS=-tags api' + TEST_ARGS='-tags api' + go test -tags api Missing function 'virDomainGetLaunchSecurityInfo' Missing function 'virNodeGetSEVInfo' Missing macro 'VIR_DOMAIN_LAUNCH_SECURITY_SEV_MEASUREMENT' Missing macro 'VIR_NODE_SEV_CBITPOS' Missing macro 'VIR_NODE_SEV_CERT_CHAIN' Missing macro 'VIR_NODE_SEV_PDH' Missing macro 'VIR_NODE_SEV_REDUCED_PHYS_BITS' --- FAIL: TestAPICoverage (0.54s) panic: Missing symbols found [recovered] panic: Missing symbols found goroutine 19 [running]: testing.tRunner.func1(0xc4200d00f0) /usr/lib/golang/src/testing/testing.go:742 +0x29d panic(0x5ad880, 0x611c10) /usr/lib/golang/src/runtime/panic.go:502 +0x229 _<https://ci.centos.org/job/libvirt-go-master-check/systems=libvirt-fedora-rawhide/ws/.TestAPICoverage(0xc4200d00f0)> <https://ci.centos.org/job/libvirt-go-master-check/systems=libvirt-fedora-rawhide/ws/api_test.go>:506 +0x548 testing.tRunner(0xc4200d00f0, 0x5fccf0) /usr/lib/golang/src/testing/testing.go:777 +0xd0 created by testing.(*T).Run /usr/lib/golang/src/testing/testing.go:824 +0x2e0 exit status 2 FAIL _<https://ci.centos.org/job/libvirt-go-master-check/systems=libvirt-fedora-rawhide/ws/> 0.811s Build step 'Execute shell' marked build as failure

See <https://ci.centos.org/job/libvirt-go-master-check/systems=libvirt-fedora-rawhide/1121/display/redirect> ------------------------------------------ Started by upstream project "libvirt-go-master-check" build number 1121 originally caused by: Started by upstream project "libvirt-go-master-build" build number 1132 originally caused by: Started by upstream project "libvirt-master-build" build number 1531 originally caused by: Started by an SCM change [EnvInject] - Loading node environment variables. Building remotely on libvirt-fedora-rawhide (libvirt) in workspace <https://ci.centos.org/job/libvirt-go-master-check/systems=libvirt-fedora-rawhide/ws/> [libvirt-go-master] $ /bin/sh -xe /tmp/jenkins4081911597315765966.sh + export 'TEST_ARGS=-tags api' + TEST_ARGS='-tags api' + go test -tags api Missing function 'virDomainGetLaunchSecurityInfo' Missing function 'virNodeGetSEVInfo' Missing macro 'VIR_DOMAIN_LAUNCH_SECURITY_SEV_MEASUREMENT' Missing macro 'VIR_NODE_SEV_CBITPOS' Missing macro 'VIR_NODE_SEV_CERT_CHAIN' Missing macro 'VIR_NODE_SEV_PDH' Missing macro 'VIR_NODE_SEV_REDUCED_PHYS_BITS' --- FAIL: TestAPICoverage (1.07s) panic: Missing symbols found [recovered] panic: Missing symbols found goroutine 19 [running]: testing.tRunner.func1(0xc4200d00f0) /usr/lib/golang/src/testing/testing.go:742 +0x29d panic(0x5ad880, 0x611c10) /usr/lib/golang/src/runtime/panic.go:502 +0x229 _<https://ci.centos.org/job/libvirt-go-master-check/systems=libvirt-fedora-rawhide/ws/.TestAPICoverage(0xc4200d00f0)> <https://ci.centos.org/job/libvirt-go-master-check/systems=libvirt-fedora-rawhide/ws/api_test.go>:506 +0x548 testing.tRunner(0xc4200d00f0, 0x5fccf0) /usr/lib/golang/src/testing/testing.go:777 +0xd0 created by testing.(*T).Run /usr/lib/golang/src/testing/testing.go:824 +0x2e0 exit status 2 FAIL _<https://ci.centos.org/job/libvirt-go-master-check/systems=libvirt-fedora-rawhide/ws/> 1.288s Build step 'Execute shell' marked build as failure

See <https://ci.centos.org/job/libvirt-go-master-check/systems=libvirt-fedora-rawhide/1122/display/redirect> ------------------------------------------ Started by upstream project "libvirt-go-master-check" build number 1122 originally caused by: Started by upstream project "libvirt-go-master-build" build number 1133 originally caused by: Started by upstream project "libvirt-master-build" build number 1532 originally caused by: Started by an SCM change [EnvInject] - Loading node environment variables. Building remotely on libvirt-fedora-rawhide (libvirt) in workspace <https://ci.centos.org/job/libvirt-go-master-check/systems=libvirt-fedora-rawhide/ws/> [libvirt-go-master] $ /bin/sh -xe /tmp/jenkins8216054550137158017.sh + export 'TEST_ARGS=-tags api' + TEST_ARGS='-tags api' + go test -tags api Missing function 'virDomainGetLaunchSecurityInfo' Missing function 'virNodeGetSEVInfo' Missing macro 'VIR_DOMAIN_LAUNCH_SECURITY_SEV_MEASUREMENT' Missing macro 'VIR_NODE_SEV_CBITPOS' Missing macro 'VIR_NODE_SEV_CERT_CHAIN' Missing macro 'VIR_NODE_SEV_PDH' Missing macro 'VIR_NODE_SEV_REDUCED_PHYS_BITS' --- FAIL: TestAPICoverage (0.23s) panic: Missing symbols found [recovered] panic: Missing symbols found goroutine 5 [running]: testing.tRunner.func1(0xc4200aa0f0) /usr/lib/golang/src/testing/testing.go:742 +0x29d panic(0x5ad880, 0x611c10) /usr/lib/golang/src/runtime/panic.go:502 +0x229 _<https://ci.centos.org/job/libvirt-go-master-check/systems=libvirt-fedora-rawhide/ws/.TestAPICoverage(0xc4200aa0f0)> <https://ci.centos.org/job/libvirt-go-master-check/systems=libvirt-fedora-rawhide/ws/api_test.go>:506 +0x548 testing.tRunner(0xc4200aa0f0, 0x5fccf0) /usr/lib/golang/src/testing/testing.go:777 +0xd0 created by testing.(*T).Run /usr/lib/golang/src/testing/testing.go:824 +0x2e0 exit status 2 FAIL _<https://ci.centos.org/job/libvirt-go-master-check/systems=libvirt-fedora-rawhide/ws/> 0.303s Build step 'Execute shell' marked build as failure

See <https://ci.centos.org/job/libvirt-go-master-check/systems=libvirt-fedora-rawhide/1123/display/redirect> ------------------------------------------ Started by upstream project "libvirt-go-master-check" build number 1123 originally caused by: Started by upstream project "libvirt-go-master-build" build number 1134 originally caused by: Started by upstream project "libvirt-master-build" build number 1533 originally caused by: Started by an SCM change [EnvInject] - Loading node environment variables. Building remotely on libvirt-fedora-rawhide (libvirt) in workspace <https://ci.centos.org/job/libvirt-go-master-check/systems=libvirt-fedora-rawhide/ws/> [libvirt-go-master] $ /bin/sh -xe /tmp/jenkins5456604035436775677.sh + export 'TEST_ARGS=-tags api' + TEST_ARGS='-tags api' + go test -tags api Missing function 'virDomainGetLaunchSecurityInfo' Missing function 'virNodeGetSEVInfo' Missing macro 'VIR_DOMAIN_LAUNCH_SECURITY_SEV_MEASUREMENT' Missing macro 'VIR_NODE_SEV_CBITPOS' Missing macro 'VIR_NODE_SEV_CERT_CHAIN' Missing macro 'VIR_NODE_SEV_PDH' Missing macro 'VIR_NODE_SEV_REDUCED_PHYS_BITS' --- FAIL: TestAPICoverage (1.21s) panic: Missing symbols found [recovered] panic: Missing symbols found goroutine 5 [running]: testing.tRunner.func1(0xc4200aa0f0) /usr/lib/golang/src/testing/testing.go:742 +0x29d panic(0x5ad880, 0x611c10) /usr/lib/golang/src/runtime/panic.go:502 +0x229 _<https://ci.centos.org/job/libvirt-go-master-check/systems=libvirt-fedora-rawhide/ws/.TestAPICoverage(0xc4200aa0f0)> <https://ci.centos.org/job/libvirt-go-master-check/systems=libvirt-fedora-rawhide/ws/api_test.go>:506 +0x548 testing.tRunner(0xc4200aa0f0, 0x5fccf0) /usr/lib/golang/src/testing/testing.go:777 +0xd0 created by testing.(*T).Run /usr/lib/golang/src/testing/testing.go:824 +0x2e0 exit status 2 FAIL _<https://ci.centos.org/job/libvirt-go-master-check/systems=libvirt-fedora-rawhide/ws/> 2.484s Build step 'Execute shell' marked build as failure

See <https://ci.centos.org/job/libvirt-go-master-check/systems=libvirt-fedora-rawhide/1124/display/redirect> ------------------------------------------ Started by upstream project "libvirt-go-master-check" build number 1124 originally caused by: Started by upstream project "libvirt-go-master-build" build number 1135 originally caused by: Started by upstream project "libvirt-master-build" build number 1534 originally caused by: Started by an SCM change [EnvInject] - Loading node environment variables. Building remotely on libvirt-fedora-rawhide (libvirt) in workspace <https://ci.centos.org/job/libvirt-go-master-check/systems=libvirt-fedora-rawhide/ws/> [libvirt-go-master] $ /bin/sh -xe /tmp/jenkins8415397459852366085.sh + export 'TEST_ARGS=-tags api' + TEST_ARGS='-tags api' + go test -tags api Missing function 'virDomainGetLaunchSecurityInfo' Missing function 'virNodeGetSEVInfo' Missing macro 'VIR_DOMAIN_LAUNCH_SECURITY_SEV_MEASUREMENT' Missing macro 'VIR_NODE_SEV_CBITPOS' Missing macro 'VIR_NODE_SEV_CERT_CHAIN' Missing macro 'VIR_NODE_SEV_PDH' Missing macro 'VIR_NODE_SEV_REDUCED_PHYS_BITS' --- FAIL: TestAPICoverage (0.95s) panic: Missing symbols found [recovered] panic: Missing symbols found goroutine 5 [running]: testing.tRunner.func1(0xc4200aa0f0) /usr/lib/golang/src/testing/testing.go:742 +0x29d panic(0x5ad880, 0x611c10) /usr/lib/golang/src/runtime/panic.go:502 +0x229 _<https://ci.centos.org/job/libvirt-go-master-check/systems=libvirt-fedora-rawhide/ws/.TestAPICoverage(0xc4200aa0f0)> <https://ci.centos.org/job/libvirt-go-master-check/systems=libvirt-fedora-rawhide/ws/api_test.go>:506 +0x548 testing.tRunner(0xc4200aa0f0, 0x5fccf0) /usr/lib/golang/src/testing/testing.go:777 +0xd0 created by testing.(*T).Run /usr/lib/golang/src/testing/testing.go:824 +0x2e0 exit status 2 FAIL _<https://ci.centos.org/job/libvirt-go-master-check/systems=libvirt-fedora-rawhide/ws/> 1.586s Build step 'Execute shell' marked build as failure

See <https://ci.centos.org/job/libvirt-go-master-check/systems=libvirt-fedora-rawhide/1125/display/redirect> ------------------------------------------ Started by upstream project "libvirt-go-master-check" build number 1125 originally caused by: Started by upstream project "libvirt-go-master-build" build number 1136 originally caused by: Started by upstream project "libvirt-master-build" build number 1535 originally caused by: Started by an SCM change [EnvInject] - Loading node environment variables. Building remotely on libvirt-fedora-rawhide (libvirt) in workspace <https://ci.centos.org/job/libvirt-go-master-check/systems=libvirt-fedora-rawhide/ws/> [libvirt-go-master] $ /bin/sh -xe /tmp/jenkins7652027927336454026.sh + export 'TEST_ARGS=-tags api' + TEST_ARGS='-tags api' + go test -tags api Missing function 'virDomainGetLaunchSecurityInfo' Missing function 'virNodeGetSEVInfo' Missing macro 'VIR_DOMAIN_LAUNCH_SECURITY_SEV_MEASUREMENT' Missing macro 'VIR_NODE_SEV_CBITPOS' Missing macro 'VIR_NODE_SEV_CERT_CHAIN' Missing macro 'VIR_NODE_SEV_PDH' Missing macro 'VIR_NODE_SEV_REDUCED_PHYS_BITS' --- FAIL: TestAPICoverage (0.22s) panic: Missing symbols found [recovered] panic: Missing symbols found goroutine 19 [running]: testing.tRunner.func1(0xc4200d00f0) /usr/lib/golang/src/testing/testing.go:742 +0x29d panic(0x5ad880, 0x611c10) /usr/lib/golang/src/runtime/panic.go:502 +0x229 _<https://ci.centos.org/job/libvirt-go-master-check/systems=libvirt-fedora-rawhide/ws/.TestAPICoverage(0xc4200d00f0)> <https://ci.centos.org/job/libvirt-go-master-check/systems=libvirt-fedora-rawhide/ws/api_test.go>:506 +0x548 testing.tRunner(0xc4200d00f0, 0x5fccf0) /usr/lib/golang/src/testing/testing.go:777 +0xd0 created by testing.(*T).Run /usr/lib/golang/src/testing/testing.go:824 +0x2e0 exit status 2 FAIL _<https://ci.centos.org/job/libvirt-go-master-check/systems=libvirt-fedora-rawhide/ws/> 0.286s Build step 'Execute shell' marked build as failure

See <https://ci.centos.org/job/libvirt-go-master-check/systems=libvirt-fedora-rawhide/1126/display/redirect> ------------------------------------------ Started by upstream project "libvirt-go-master-check" build number 1126 originally caused by: Started by upstream project "libvirt-go-master-build" build number 1138 originally caused by: Started by upstream project "libvirt-master-build" build number 1537 originally caused by: Started by user Libvirt [EnvInject] - Loading node environment variables. Building remotely on libvirt-fedora-rawhide (libvirt) in workspace <https://ci.centos.org/job/libvirt-go-master-check/systems=libvirt-fedora-rawhide/ws/> [libvirt-go-master] $ /bin/sh -xe /tmp/jenkins4367792815016325892.sh + export 'TEST_ARGS=-tags api' + TEST_ARGS='-tags api' + go test -tags api Missing function 'virConnectListAllNWFilterBindings' Missing function 'virNWFilterBindingCreateXML' Missing function 'virNWFilterBindingDelete' Missing function 'virNWFilterBindingFree' Missing function 'virNWFilterBindingGetFilterName' Missing function 'virNWFilterBindingGetPortDev' Missing function 'virNWFilterBindingGetXMLDesc' Missing function 'virNWFilterBindingLookupByPortDev' Missing function 'virNWFilterBindingRef' Missing enum 'VIR_CONNECT_GET_ALL_DOMAINS_STATS_NOWAIT' Missing enum 'VIR_ERR_INVALID_NWFILTER_BINDING' Missing enum 'VIR_ERR_NO_NWFILTER_BINDING' --- FAIL: TestAPICoverage (1.27s) panic: Missing symbols found [recovered] panic: Missing symbols found goroutine 5 [running]: testing.tRunner.func1(0xc4200aa0f0) /usr/lib/golang/src/testing/testing.go:742 +0x29d panic(0x5adac0, 0x611e70) /usr/lib/golang/src/runtime/panic.go:502 +0x229 _<https://ci.centos.org/job/libvirt-go-master-check/systems=libvirt-fedora-rawhide/ws/.TestAPICoverage(0xc4200aa0f0)> <https://ci.centos.org/job/libvirt-go-master-check/systems=libvirt-fedora-rawhide/ws/api_test.go>:506 +0x548 testing.tRunner(0xc4200aa0f0, 0x5fcf40) /usr/lib/golang/src/testing/testing.go:777 +0xd0 created by testing.(*T).Run /usr/lib/golang/src/testing/testing.go:824 +0x2e0 exit status 2 FAIL _<https://ci.centos.org/job/libvirt-go-master-check/systems=libvirt-fedora-rawhide/ws/> 1.930s Build step 'Execute shell' marked build as failure

See <https://ci.centos.org/job/libvirt-go-master-check/systems=libvirt-fedora-rawhide/1127/display/redirect> ------------------------------------------ Started by upstream project "libvirt-go-master-check" build number 1127 originally caused by: Started by upstream project "libvirt-go-master-build" build number 1139 originally caused by: Started by upstream project "libvirt-master-build" build number 1538 originally caused by: Started by an SCM change Started by an SCM change [EnvInject] - Loading node environment variables. Building remotely on libvirt-fedora-rawhide (libvirt) in workspace <https://ci.centos.org/job/libvirt-go-master-check/systems=libvirt-fedora-rawhide/ws/> [libvirt-go-master] $ /bin/sh -xe /tmp/jenkins3335650002662466840.sh + export 'TEST_ARGS=-tags api' + TEST_ARGS='-tags api' + go test -tags api Missing function 'virConnectListAllNWFilterBindings' Missing function 'virNWFilterBindingCreateXML' Missing function 'virNWFilterBindingDelete' Missing function 'virNWFilterBindingFree' Missing function 'virNWFilterBindingGetFilterName' Missing function 'virNWFilterBindingGetPortDev' Missing function 'virNWFilterBindingGetXMLDesc' Missing function 'virNWFilterBindingLookupByPortDev' Missing function 'virNWFilterBindingRef' Missing enum 'VIR_CONNECT_GET_ALL_DOMAINS_STATS_NOWAIT' Missing enum 'VIR_ERR_INVALID_NWFILTER_BINDING' Missing enum 'VIR_ERR_NO_NWFILTER_BINDING' --- FAIL: TestAPICoverage (0.62s) panic: Missing symbols found [recovered] panic: Missing symbols found goroutine 19 [running]: testing.tRunner.func1(0xc4200c80f0) /usr/lib/golang/src/testing/testing.go:742 +0x29d panic(0x5adac0, 0x611e70) /usr/lib/golang/src/runtime/panic.go:502 +0x229 _<https://ci.centos.org/job/libvirt-go-master-check/systems=libvirt-fedora-rawhide/ws/.TestAPICoverage(0xc4200c80f0)> <https://ci.centos.org/job/libvirt-go-master-check/systems=libvirt-fedora-rawhide/ws/api_test.go>:506 +0x548 testing.tRunner(0xc4200c80f0, 0x5fcf40) /usr/lib/golang/src/testing/testing.go:777 +0xd0 created by testing.(*T).Run /usr/lib/golang/src/testing/testing.go:824 +0x2e0 exit status 2 FAIL _<https://ci.centos.org/job/libvirt-go-master-check/systems=libvirt-fedora-rawhide/ws/> 0.791s Build step 'Execute shell' marked build as failure

See <https://ci.centos.org/job/libvirt-go-master-check/systems=libvirt-fedora-rawhide/1128/display/redirect> ------------------------------------------ Started by upstream project "libvirt-go-master-check" build number 1128 originally caused by: Started by upstream project "libvirt-go-master-build" build number 1140 originally caused by: Started by upstream project "libvirt-master-build" build number 1539 originally caused by: Started by an SCM change Started by an SCM change Started by an SCM change [EnvInject] - Loading node environment variables. Building remotely on libvirt-fedora-rawhide (libvirt) in workspace <https://ci.centos.org/job/libvirt-go-master-check/systems=libvirt-fedora-rawhide/ws/> [libvirt-go-master] $ /bin/sh -xe /tmp/jenkins3037709393306281652.sh + export 'TEST_ARGS=-tags api' + TEST_ARGS='-tags api' + go test -tags api Missing function 'virConnectListAllNWFilterBindings' Missing function 'virNWFilterBindingCreateXML' Missing function 'virNWFilterBindingDelete' Missing function 'virNWFilterBindingFree' Missing function 'virNWFilterBindingGetFilterName' Missing function 'virNWFilterBindingGetPortDev' Missing function 'virNWFilterBindingGetXMLDesc' Missing function 'virNWFilterBindingLookupByPortDev' Missing function 'virNWFilterBindingRef' Missing enum 'VIR_CONNECT_GET_ALL_DOMAINS_STATS_NOWAIT' Missing enum 'VIR_ERR_INVALID_NWFILTER_BINDING' Missing enum 'VIR_ERR_NO_NWFILTER_BINDING' --- FAIL: TestAPICoverage (0.23s) panic: Missing symbols found [recovered] panic: Missing symbols found goroutine 5 [running]: testing.tRunner.func1(0xc4200aa0f0) /usr/lib/golang/src/testing/testing.go:742 +0x29d panic(0x5adac0, 0x611e70) /usr/lib/golang/src/runtime/panic.go:502 +0x229 _<https://ci.centos.org/job/libvirt-go-master-check/systems=libvirt-fedora-rawhide/ws/.TestAPICoverage(0xc4200aa0f0)> <https://ci.centos.org/job/libvirt-go-master-check/systems=libvirt-fedora-rawhide/ws/api_test.go>:506 +0x548 testing.tRunner(0xc4200aa0f0, 0x5fcf40) /usr/lib/golang/src/testing/testing.go:777 +0xd0 created by testing.(*T).Run /usr/lib/golang/src/testing/testing.go:824 +0x2e0 exit status 2 FAIL _<https://ci.centos.org/job/libvirt-go-master-check/systems=libvirt-fedora-rawhide/ws/> 0.293s Build step 'Execute shell' marked build as failure

participants (1)
-
ci@centos.org