[Libvirt-ci] Build failed in Jenkins: libvirt-go-xml-check » libvirt-debian-8 #271

See <https://ci.centos.org/job/libvirt-go-xml-check/systems=libvirt-debian-8/271/display/redirect> ------------------------------------------ Started by upstream project "libvirt-go-xml-check" build number 271 originally caused by: Started by upstream project "libvirt-go-xml-build" build number 271 originally caused by: Started by upstream project "libvirt-build" build number 333 originally caused by: Started by an SCM change [EnvInject] - Loading node environment variables. Building remotely on libvirt-debian-8 (libvirt) in workspace <https://ci.centos.org/job/libvirt-go-xml-check/systems=libvirt-debian-8/ws/> [libvirt-go-xml] $ /bin/sh -xe /tmp/jenkins59097929318135214.sh + export TEST_ARGS=-tags xmlroundtrip + go test -tags xmlroundtrip --- FAIL: TestRoundTrip (8.74s) xml_test.go:400: testdata/libvirt/tests/bhyvexml2argvdata/bhyvexml2argv-msrs.xml: /domain[0]/features[0]/msrs[0]: element in expected XML missing in actual XML FAIL exit status 1 FAIL _<https://ci.centos.org/job/libvirt-go-xml-check/systems=libvirt-debian-8/ws/> 8.818s Build step 'Execute shell' marked build as failure

See <https://ci.centos.org/job/libvirt-go-xml-check/systems=libvirt-debian-8/272/display/redirect> ------------------------------------------ Started by upstream project "libvirt-go-xml-check" build number 272 originally caused by: Started by upstream project "libvirt-go-xml-build" build number 272 originally caused by: Started by upstream project "libvirt-build" build number 334 originally caused by: Started by an SCM change [EnvInject] - Loading node environment variables. Building remotely on libvirt-debian-8 (libvirt) in workspace <https://ci.centos.org/job/libvirt-go-xml-check/systems=libvirt-debian-8/ws/> [libvirt-go-xml] $ /bin/sh -xe /tmp/jenkins5223872834791864513.sh + export TEST_ARGS=-tags xmlroundtrip + go test -tags xmlroundtrip --- FAIL: TestRoundTrip (5.29s) xml_test.go:400: testdata/libvirt/tests/bhyvexml2argvdata/bhyvexml2argv-msrs.xml: /domain[0]/features[0]/msrs[0]: element in expected XML missing in actual XML FAIL exit status 1 FAIL _<https://ci.centos.org/job/libvirt-go-xml-check/systems=libvirt-debian-8/ws/> 5.372s Build step 'Execute shell' marked build as failure

See <https://ci.centos.org/job/libvirt-go-xml-check/systems=libvirt-debian-8/273/display/redirect> ------------------------------------------ Started by upstream project "libvirt-go-xml-check" build number 273 originally caused by: Started by upstream project "libvirt-go-xml-build" build number 273 originally caused by: Started by upstream project "libvirt-build" build number 335 originally caused by: Started by an SCM change [EnvInject] - Loading node environment variables. Building remotely on libvirt-debian-8 (libvirt) in workspace <https://ci.centos.org/job/libvirt-go-xml-check/systems=libvirt-debian-8/ws/> [libvirt-go-xml] $ /bin/sh -xe /tmp/jenkins7114513432459530444.sh + export TEST_ARGS=-tags xmlroundtrip + go test -tags xmlroundtrip --- FAIL: TestRoundTrip (5.30s) xml_test.go:400: testdata/libvirt/tests/bhyvexml2argvdata/bhyvexml2argv-msrs.xml: /domain[0]/features[0]/msrs[0]: element in expected XML missing in actual XML FAIL exit status 1 FAIL _<https://ci.centos.org/job/libvirt-go-xml-check/systems=libvirt-debian-8/ws/> 5.385s Build step 'Execute shell' marked build as failure

participants (1)
-
ci@centos.org