[Libvirt-ci] Build failed in Jenkins: libvirt-go-master-check » libvirt-freebsd-11 #1057

See <https://ci.centos.org/job/libvirt-go-master-check/systems=libvirt-freebsd-11/1057/display/redirect> ------------------------------------------ Started by upstream project "libvirt-go-master-check" build number 1057 originally caused by: Started by upstream project "libvirt-go-master-build" build number 1068 originally caused by: Started by upstream project "libvirt-master-build" build number 1465 originally caused by: Started by an SCM change [EnvInject] - Loading node environment variables. Building remotely on libvirt-freebsd-11 (libvirt) in workspace <https://ci.centos.org/job/libvirt-go-master-check/systems=libvirt-freebsd-11/ws/> [libvirt-go-master] $ /bin/sh -xe /tmp/jenkins6554865660812795189.sh + export 'TEST_ARGS=-tags api' + go test -tags api 2018-05-28 12:25:54.127+0000: 34498240512: info : libvirt version: 4.4.0 2018-05-28 12:25:54.127+0000: 34498240512: info : hostname: libvirt-freebsd-11 2018-05-28 12:25:54.127+0000: 34498240512: warning : virEventRegisterImpl:245 : Ignoring attempt to replace registered event loop 2018-05-28 12:25:54.137+0000: 34498240512: warning : virEventRegisterImpl:245 : Ignoring attempt to replace registered event loop 2018-05-28 12:25:54.138+0000: 34498240512: warning : virEventRegisterImpl:245 : Ignoring attempt to replace registered event loop Missing function 'virDomainDetachDeviceAlias' --- FAIL: TestAPICoverage (0.48s) panic: Missing symbols found [recovered] panic: Missing symbols found goroutine 5 [running]: testing.tRunner.func1(0xc4200b60f0) /usr/local/go/src/testing/testing.go:742 +0x29d panic(0x5ae1e0, 0x611730) /usr/local/go/src/runtime/panic.go:505 +0x229 _/usr<https://ci.centos.org/job/libvirt-go-master-check/systems=libvirt-freebsd-11/ws/.TestAPICoverage(0xc4200b60f0)> /usr<https://ci.centos.org/job/libvirt-go-master-check/systems=libvirt-freebsd-11/ws/api_test.go>:504 +0x548 testing.tRunner(0xc4200b60f0, 0x5fc7b0) /usr/local/go/src/testing/testing.go:777 +0xd0 created by testing.(*T).Run /usr/local/go/src/testing/testing.go:824 +0x2e0 exit status 2 FAIL _/usr<https://ci.centos.org/job/libvirt-go-master-check/systems=libvirt-freebsd-11/ws/> 0.590s Build step 'Execute shell' marked build as failure

See <https://ci.centos.org/job/libvirt-go-master-check/systems=libvirt-freebsd-11/1058/display/redirect> ------------------------------------------ Started by upstream project "libvirt-go-master-check" build number 1058 originally caused by: Started by upstream project "libvirt-go-master-build" build number 1069 originally caused by: Started by upstream project "libvirt-master-build" build number 1466 originally caused by: Started by an SCM change [EnvInject] - Loading node environment variables. Building remotely on libvirt-freebsd-11 (libvirt) in workspace <https://ci.centos.org/job/libvirt-go-master-check/systems=libvirt-freebsd-11/ws/> [libvirt-go-master] $ /bin/sh -xe /tmp/jenkins2409526579258346116.sh + export 'TEST_ARGS=-tags api' + go test -tags api 2018-05-28 15:26:14.328+0000: 34498240512: info : libvirt version: 4.4.0 2018-05-28 15:26:14.328+0000: 34498240512: info : hostname: libvirt-freebsd-11 2018-05-28 15:26:14.328+0000: 34498240512: warning : virEventRegisterImpl:245 : Ignoring attempt to replace registered event loop 2018-05-28 15:26:14.328+0000: 34498240512: warning : virEventRegisterImpl:245 : Ignoring attempt to replace registered event loop 2018-05-28 15:26:14.328+0000: 34498240512: warning : virEventRegisterImpl:245 : Ignoring attempt to replace registered event loop Missing function 'virConnectBaselineHypervisorCPU' Missing function 'virConnectCompareHypervisorCPU' Missing function 'virDomainDetachDeviceAlias' --- FAIL: TestAPICoverage (0.37s) panic: Missing symbols found [recovered] panic: Missing symbols found goroutine 19 [running]: testing.tRunner.func1(0xc4200cc0f0) /usr/local/go/src/testing/testing.go:742 +0x29d panic(0x5ae1e0, 0x611730) /usr/local/go/src/runtime/panic.go:505 +0x229 _/usr<https://ci.centos.org/job/libvirt-go-master-check/systems=libvirt-freebsd-11/ws/.TestAPICoverage(0xc4200cc0f0)> /usr<https://ci.centos.org/job/libvirt-go-master-check/systems=libvirt-freebsd-11/ws/api_test.go>:504 +0x548 testing.tRunner(0xc4200cc0f0, 0x5fc7b0) /usr/local/go/src/testing/testing.go:777 +0xd0 created by testing.(*T).Run /usr/local/go/src/testing/testing.go:824 +0x2e0 exit status 2 FAIL _/usr<https://ci.centos.org/job/libvirt-go-master-check/systems=libvirt-freebsd-11/ws/> 0.447s Build step 'Execute shell' marked build as failure

See <https://ci.centos.org/job/libvirt-go-master-check/systems=libvirt-freebsd-11/1059/display/redirect> ------------------------------------------ Started by upstream project "libvirt-go-master-check" build number 1059 originally caused by: Started by upstream project "libvirt-go-master-build" build number 1070 originally caused by: Started by upstream project "libvirt-master-build" build number 1467 originally caused by: Started by an SCM change Started by an SCM change [EnvInject] - Loading node environment variables. Building remotely on libvirt-freebsd-11 (libvirt) in workspace <https://ci.centos.org/job/libvirt-go-master-check/systems=libvirt-freebsd-11/ws/> [libvirt-go-master] $ /bin/sh -xe /tmp/jenkins4264348239162847566.sh + export 'TEST_ARGS=-tags api' + go test -tags api 2018-05-28 16:50:30.704+0000: 34498240512: info : libvirt version: 4.4.0 2018-05-28 16:50:30.704+0000: 34498240512: info : hostname: libvirt-freebsd-11 2018-05-28 16:50:30.704+0000: 34498240512: warning : virEventRegisterImpl:245 : Ignoring attempt to replace registered event loop 2018-05-28 16:50:30.705+0000: 34498240512: warning : virEventRegisterImpl:245 : Ignoring attempt to replace registered event loop 2018-05-28 16:50:30.705+0000: 34498240512: warning : virEventRegisterImpl:245 : Ignoring attempt to replace registered event loop Missing function 'virConnectBaselineHypervisorCPU' Missing function 'virConnectCompareHypervisorCPU' Missing function 'virDomainDetachDeviceAlias' --- FAIL: TestAPICoverage (0.33s) panic: Missing symbols found [recovered] panic: Missing symbols found goroutine 20 [running]: testing.tRunner.func1(0xc4200ca0f0) /usr/local/go/src/testing/testing.go:742 +0x29d panic(0x5ae1e0, 0x611730) /usr/local/go/src/runtime/panic.go:505 +0x229 _/usr<https://ci.centos.org/job/libvirt-go-master-check/systems=libvirt-freebsd-11/ws/.TestAPICoverage(0xc4200ca0f0)> /usr<https://ci.centos.org/job/libvirt-go-master-check/systems=libvirt-freebsd-11/ws/api_test.go>:504 +0x548 testing.tRunner(0xc4200ca0f0, 0x5fc7b0) /usr/local/go/src/testing/testing.go:777 +0xd0 created by testing.(*T).Run /usr/local/go/src/testing/testing.go:824 +0x2e0 exit status 2 FAIL _/usr<https://ci.centos.org/job/libvirt-go-master-check/systems=libvirt-freebsd-11/ws/> 0.495s Build step 'Execute shell' marked build as failure

See <https://ci.centos.org/job/libvirt-go-master-check/systems=libvirt-freebsd-11/1060/display/redirect> ------------------------------------------ Started by upstream project "libvirt-go-master-check" build number 1060 originally caused by: Started by upstream project "libvirt-go-master-build" build number 1071 originally caused by: Started by upstream project "libvirt-master-build" build number 1468 originally caused by: Started by an SCM change [EnvInject] - Loading node environment variables. Building remotely on libvirt-freebsd-11 (libvirt) in workspace <https://ci.centos.org/job/libvirt-go-master-check/systems=libvirt-freebsd-11/ws/> [libvirt-go-master] $ /bin/sh -xe /tmp/jenkins99627949042219844.sh + export 'TEST_ARGS=-tags api' + go test -tags api 2018-05-29 09:47:32.407+0000: 34498240512: info : libvirt version: 4.4.0 2018-05-29 09:47:32.407+0000: 34498240512: info : hostname: libvirt-freebsd-11 2018-05-29 09:47:32.407+0000: 34498240512: warning : virEventRegisterImpl:245 : Ignoring attempt to replace registered event loop 2018-05-29 09:47:32.407+0000: 34498240512: warning : virEventRegisterImpl:245 : Ignoring attempt to replace registered event loop 2018-05-29 09:47:32.408+0000: 34498240512: warning : virEventRegisterImpl:245 : Ignoring attempt to replace registered event loop Missing function 'virConnectBaselineHypervisorCPU' Missing function 'virConnectCompareHypervisorCPU' Missing function 'virDomainDetachDeviceAlias' --- FAIL: TestAPICoverage (1.11s) panic: Missing symbols found [recovered] panic: Missing symbols found goroutine 20 [running]: testing.tRunner.func1(0xc4200ca0f0) /usr/local/go/src/testing/testing.go:742 +0x29d panic(0x5ae1e0, 0x611730) /usr/local/go/src/runtime/panic.go:505 +0x229 _/usr<https://ci.centos.org/job/libvirt-go-master-check/systems=libvirt-freebsd-11/ws/.TestAPICoverage(0xc4200ca0f0)> /usr<https://ci.centos.org/job/libvirt-go-master-check/systems=libvirt-freebsd-11/ws/api_test.go>:504 +0x548 testing.tRunner(0xc4200ca0f0, 0x5fc7b0) /usr/local/go/src/testing/testing.go:777 +0xd0 created by testing.(*T).Run /usr/local/go/src/testing/testing.go:824 +0x2e0 exit status 2 FAIL _/usr<https://ci.centos.org/job/libvirt-go-master-check/systems=libvirt-freebsd-11/ws/> 1.473s Build step 'Execute shell' marked build as failure

See <https://ci.centos.org/job/libvirt-go-master-check/systems=libvirt-freebsd-11/1061/display/redirect> ------------------------------------------ Started by upstream project "libvirt-go-master-check" build number 1061 originally caused by: Started by upstream project "libvirt-go-master-build" build number 1072 originally caused by: Started by upstream project "libvirt-master-build" build number 1469 originally caused by: Started by an SCM change [EnvInject] - Loading node environment variables. Building remotely on libvirt-freebsd-11 (libvirt) in workspace <https://ci.centos.org/job/libvirt-go-master-check/systems=libvirt-freebsd-11/ws/> [libvirt-go-master] $ /bin/sh -xe /tmp/jenkins8666846174200794552.sh + export 'TEST_ARGS=-tags api' + go test -tags api 2018-05-29 13:29:08.137+0000: 34498240512: info : libvirt version: 4.4.0 2018-05-29 13:29:08.137+0000: 34498240512: info : hostname: libvirt-freebsd-11 2018-05-29 13:29:08.137+0000: 34498240512: warning : virEventRegisterImpl:245 : Ignoring attempt to replace registered event loop 2018-05-29 13:29:08.139+0000: 34498240512: warning : virEventRegisterImpl:245 : Ignoring attempt to replace registered event loop 2018-05-29 13:29:08.141+0000: 34498240512: warning : virEventRegisterImpl:245 : Ignoring attempt to replace registered event loop Missing function 'virConnectBaselineHypervisorCPU' Missing function 'virConnectCompareHypervisorCPU' Missing function 'virDomainDetachDeviceAlias' --- FAIL: TestAPICoverage (0.24s) panic: Missing symbols found [recovered] panic: Missing symbols found goroutine 19 [running]: testing.tRunner.func1(0xc4200cc0f0) /usr/local/go/src/testing/testing.go:742 +0x29d panic(0x5ae1e0, 0x611730) /usr/local/go/src/runtime/panic.go:505 +0x229 _/usr<https://ci.centos.org/job/libvirt-go-master-check/systems=libvirt-freebsd-11/ws/.TestAPICoverage(0xc4200cc0f0)> /usr<https://ci.centos.org/job/libvirt-go-master-check/systems=libvirt-freebsd-11/ws/api_test.go>:504 +0x548 testing.tRunner(0xc4200cc0f0, 0x5fc7b0) /usr/local/go/src/testing/testing.go:777 +0xd0 created by testing.(*T).Run /usr/local/go/src/testing/testing.go:824 +0x2e0 exit status 2 FAIL _/usr<https://ci.centos.org/job/libvirt-go-master-check/systems=libvirt-freebsd-11/ws/> 0.344s Build step 'Execute shell' marked build as failure

See <https://ci.centos.org/job/libvirt-go-master-check/systems=libvirt-freebsd-11/1062/display/redirect> ------------------------------------------ Started by upstream project "libvirt-go-master-check" build number 1062 originally caused by: Started by upstream project "libvirt-go-master-build" build number 1073 originally caused by: Started by upstream project "libvirt-master-build" build number 1470 originally caused by: Started by an SCM change [EnvInject] - Loading node environment variables. Building remotely on libvirt-freebsd-11 (libvirt) in workspace <https://ci.centos.org/job/libvirt-go-master-check/systems=libvirt-freebsd-11/ws/> [libvirt-go-master] $ /bin/sh -xe /tmp/jenkins9026776204073934330.sh + export 'TEST_ARGS=-tags api' + go test -tags api 2018-05-29 15:13:19.502+0000: 34498240512: info : libvirt version: 4.4.0 2018-05-29 15:13:19.502+0000: 34498240512: info : hostname: libvirt-freebsd-11 2018-05-29 15:13:19.502+0000: 34498240512: warning : virEventRegisterImpl:245 : Ignoring attempt to replace registered event loop 2018-05-29 15:13:19.502+0000: 34498240512: warning : virEventRegisterImpl:245 : Ignoring attempt to replace registered event loop 2018-05-29 15:13:19.503+0000: 34498240512: warning : virEventRegisterImpl:245 : Ignoring attempt to replace registered event loop Missing function 'virConnectBaselineHypervisorCPU' Missing function 'virConnectCompareHypervisorCPU' Missing function 'virDomainDetachDeviceAlias' --- FAIL: TestAPICoverage (0.36s) panic: Missing symbols found [recovered] panic: Missing symbols found goroutine 4 [running]: testing.tRunner.func1(0xc4200b40f0) /usr/local/go/src/testing/testing.go:742 +0x29d panic(0x5ae1e0, 0x611730) /usr/local/go/src/runtime/panic.go:505 +0x229 _/usr<https://ci.centos.org/job/libvirt-go-master-check/systems=libvirt-freebsd-11/ws/.TestAPICoverage(0xc4200b40f0)> /usr<https://ci.centos.org/job/libvirt-go-master-check/systems=libvirt-freebsd-11/ws/api_test.go>:504 +0x548 testing.tRunner(0xc4200b40f0, 0x5fc7b0) /usr/local/go/src/testing/testing.go:777 +0xd0 created by testing.(*T).Run /usr/local/go/src/testing/testing.go:824 +0x2e0 exit status 2 FAIL _/usr<https://ci.centos.org/job/libvirt-go-master-check/systems=libvirt-freebsd-11/ws/> 0.473s Build step 'Execute shell' marked build as failure

See <https://ci.centos.org/job/libvirt-go-master-check/systems=libvirt-freebsd-11/1063/display/redirect> ------------------------------------------ Started by upstream project "libvirt-go-master-check" build number 1063 originally caused by: Started by upstream project "libvirt-go-master-build" build number 1074 originally caused by: Started by upstream project "libvirt-master-build" build number 1471 originally caused by: Started by an SCM change Started by an SCM change [EnvInject] - Loading node environment variables. Building remotely on libvirt-freebsd-11 (libvirt) in workspace <https://ci.centos.org/job/libvirt-go-master-check/systems=libvirt-freebsd-11/ws/> [libvirt-go-master] $ /bin/sh -xe /tmp/jenkins966769733541327202.sh + export 'TEST_ARGS=-tags api' + go test -tags api 2018-05-29 16:09:25.713+0000: 34498240512: info : libvirt version: 4.4.0 2018-05-29 16:09:25.713+0000: 34498240512: info : hostname: libvirt-freebsd-11 2018-05-29 16:09:25.713+0000: 34498240512: warning : virEventRegisterImpl:245 : Ignoring attempt to replace registered event loop 2018-05-29 16:09:25.713+0000: 34498240512: warning : virEventRegisterImpl:245 : Ignoring attempt to replace registered event loop 2018-05-29 16:09:25.714+0000: 34498240512: warning : virEventRegisterImpl:245 : Ignoring attempt to replace registered event loop Missing function 'virConnectBaselineHypervisorCPU' Missing function 'virConnectCompareHypervisorCPU' Missing function 'virDomainDetachDeviceAlias' --- FAIL: TestAPICoverage (0.73s) panic: Missing symbols found [recovered] panic: Missing symbols found goroutine 5 [running]: testing.tRunner.func1(0xc4200b60f0) /usr/local/go/src/testing/testing.go:742 +0x29d panic(0x5ae1e0, 0x611730) /usr/local/go/src/runtime/panic.go:505 +0x229 _/usr<https://ci.centos.org/job/libvirt-go-master-check/systems=libvirt-freebsd-11/ws/.TestAPICoverage(0xc4200b60f0)> /usr<https://ci.centos.org/job/libvirt-go-master-check/systems=libvirt-freebsd-11/ws/api_test.go>:504 +0x548 testing.tRunner(0xc4200b60f0, 0x5fc7b0) /usr/local/go/src/testing/testing.go:777 +0xd0 created by testing.(*T).Run /usr/local/go/src/testing/testing.go:824 +0x2e0 exit status 2 FAIL _/usr<https://ci.centos.org/job/libvirt-go-master-check/systems=libvirt-freebsd-11/ws/> 1.064s Build step 'Execute shell' marked build as failure

See <https://ci.centos.org/job/libvirt-go-master-check/systems=libvirt-freebsd-11/1064/display/redirect> ------------------------------------------ Started by upstream project "libvirt-go-master-check" build number 1064 originally caused by: Started by upstream project "libvirt-go-master-build" build number 1075 originally caused by: Started by upstream project "libvirt-master-build" build number 1472 originally caused by: Started by an SCM change [EnvInject] - Loading node environment variables. Building remotely on libvirt-freebsd-11 (libvirt) in workspace <https://ci.centos.org/job/libvirt-go-master-check/systems=libvirt-freebsd-11/ws/> [libvirt-go-master] $ /bin/sh -xe /tmp/jenkins1128464173759292991.sh + export 'TEST_ARGS=-tags api' + go test -tags api 2018-05-30 10:19:16.253+0000: 34498240512: info : libvirt version: 4.4.0 2018-05-30 10:19:16.253+0000: 34498240512: info : hostname: libvirt-freebsd-11 2018-05-30 10:19:16.253+0000: 34498240512: warning : virEventRegisterImpl:245 : Ignoring attempt to replace registered event loop 2018-05-30 10:19:16.261+0000: 34498240512: warning : virEventRegisterImpl:245 : Ignoring attempt to replace registered event loop 2018-05-30 10:19:16.261+0000: 34498240512: warning : virEventRegisterImpl:245 : Ignoring attempt to replace registered event loop Missing function 'virConnectBaselineHypervisorCPU' Missing function 'virConnectCompareHypervisorCPU' Missing function 'virDomainDetachDeviceAlias' --- FAIL: TestAPICoverage (0.74s) panic: Missing symbols found [recovered] panic: Missing symbols found goroutine 19 [running]: testing.tRunner.func1(0xc4200cc0f0) /usr/local/go/src/testing/testing.go:742 +0x29d panic(0x5ae1e0, 0x611730) /usr/local/go/src/runtime/panic.go:505 +0x229 _/usr<https://ci.centos.org/job/libvirt-go-master-check/systems=libvirt-freebsd-11/ws/.TestAPICoverage(0xc4200cc0f0)> /usr<https://ci.centos.org/job/libvirt-go-master-check/systems=libvirt-freebsd-11/ws/api_test.go>:504 +0x548 testing.tRunner(0xc4200cc0f0, 0x5fc7b0) /usr/local/go/src/testing/testing.go:777 +0xd0 created by testing.(*T).Run /usr/local/go/src/testing/testing.go:824 +0x2e0 exit status 2 FAIL _/usr<https://ci.centos.org/job/libvirt-go-master-check/systems=libvirt-freebsd-11/ws/> 0.904s Build step 'Execute shell' marked build as failure

See <https://ci.centos.org/job/libvirt-go-master-check/systems=libvirt-freebsd-11/1065/display/redirect> ------------------------------------------ Started by upstream project "libvirt-go-master-check" build number 1065 originally caused by: Started by upstream project "libvirt-go-master-build" build number 1076 originally caused by: Started by upstream project "libvirt-master-build" build number 1473 originally caused by: Started by an SCM change [EnvInject] - Loading node environment variables. Building remotely on libvirt-freebsd-11 (libvirt) in workspace <https://ci.centos.org/job/libvirt-go-master-check/systems=libvirt-freebsd-11/ws/> [libvirt-go-master] $ /bin/sh -xe /tmp/jenkins6294762898500297059.sh + export 'TEST_ARGS=-tags api' + go test -tags api 2018-05-30 14:50:15.959+0000: 34498240512: info : libvirt version: 4.4.0 2018-05-30 14:50:15.959+0000: 34498240512: info : hostname: libvirt-freebsd-11 2018-05-30 14:50:15.959+0000: 34498240512: warning : virEventRegisterImpl:245 : Ignoring attempt to replace registered event loop 2018-05-30 14:50:15.961+0000: 34498240512: warning : virEventRegisterImpl:245 : Ignoring attempt to replace registered event loop 2018-05-30 14:50:15.961+0000: 34498240512: warning : virEventRegisterImpl:245 : Ignoring attempt to replace registered event loop Missing function 'virConnectBaselineHypervisorCPU' Missing function 'virConnectCompareHypervisorCPU' Missing function 'virDomainDetachDeviceAlias' --- FAIL: TestAPICoverage (0.51s) panic: Missing symbols found [recovered] panic: Missing symbols found goroutine 18 [running]: testing.tRunner.func1(0xc4200d20f0) /usr/local/go/src/testing/testing.go:742 +0x29d panic(0x5ae1e0, 0x611730) /usr/local/go/src/runtime/panic.go:505 +0x229 _/usr<https://ci.centos.org/job/libvirt-go-master-check/systems=libvirt-freebsd-11/ws/.TestAPICoverage(0xc4200d20f0)> /usr<https://ci.centos.org/job/libvirt-go-master-check/systems=libvirt-freebsd-11/ws/api_test.go>:504 +0x548 testing.tRunner(0xc4200d20f0, 0x5fc7b0) /usr/local/go/src/testing/testing.go:777 +0xd0 created by testing.(*T).Run /usr/local/go/src/testing/testing.go:824 +0x2e0 exit status 2 FAIL _/usr<https://ci.centos.org/job/libvirt-go-master-check/systems=libvirt-freebsd-11/ws/> 0.621s Build step 'Execute shell' marked build as failure

See <https://ci.centos.org/job/libvirt-go-master-check/systems=libvirt-freebsd-11/1066/display/redirect> ------------------------------------------ Started by upstream project "libvirt-go-master-check" build number 1066 originally caused by: Started by upstream project "libvirt-go-master-build" build number 1077 originally caused by: Started by upstream project "libvirt-master-build" build number 1474 originally caused by: Started by an SCM change Started by an SCM change Started by an SCM change [EnvInject] - Loading node environment variables. Building remotely on libvirt-freebsd-11 (libvirt) in workspace <https://ci.centos.org/job/libvirt-go-master-check/systems=libvirt-freebsd-11/ws/> [libvirt-go-master] $ /bin/sh -xe /tmp/jenkins7317653744405051652.sh + export 'TEST_ARGS=-tags api' + go test -tags api 2018-05-30 15:56:59.404+0000: 34498240512: info : libvirt version: 4.4.0 2018-05-30 15:56:59.404+0000: 34498240512: info : hostname: libvirt-freebsd-11 2018-05-30 15:56:59.404+0000: 34498240512: warning : virEventRegisterImpl:245 : Ignoring attempt to replace registered event loop 2018-05-30 15:56:59.412+0000: 34498240512: warning : virEventRegisterImpl:245 : Ignoring attempt to replace registered event loop 2018-05-30 15:56:59.412+0000: 34498240512: warning : virEventRegisterImpl:245 : Ignoring attempt to replace registered event loop Missing function 'virConnectBaselineHypervisorCPU' Missing function 'virConnectCompareHypervisorCPU' Missing function 'virDomainDetachDeviceAlias' --- FAIL: TestAPICoverage (0.43s) panic: Missing symbols found [recovered] panic: Missing symbols found goroutine 19 [running]: testing.tRunner.func1(0xc4200cc0f0) /usr/local/go/src/testing/testing.go:742 +0x29d panic(0x5ae1e0, 0x611730) /usr/local/go/src/runtime/panic.go:505 +0x229 _/usr<https://ci.centos.org/job/libvirt-go-master-check/systems=libvirt-freebsd-11/ws/.TestAPICoverage(0xc4200cc0f0)> /usr<https://ci.centos.org/job/libvirt-go-master-check/systems=libvirt-freebsd-11/ws/api_test.go>:504 +0x548 testing.tRunner(0xc4200cc0f0, 0x5fc7b0) /usr/local/go/src/testing/testing.go:777 +0xd0 created by testing.(*T).Run /usr/local/go/src/testing/testing.go:824 +0x2e0 exit status 2 FAIL _/usr<https://ci.centos.org/job/libvirt-go-master-check/systems=libvirt-freebsd-11/ws/> 0.517s Build step 'Execute shell' marked build as failure

See <https://ci.centos.org/job/libvirt-go-master-check/systems=libvirt-freebsd-11/1067/display/redirect> ------------------------------------------ Started by upstream project "libvirt-go-master-check" build number 1067 originally caused by: Started by upstream project "libvirt-go-master-build" build number 1078 originally caused by: Started by upstream project "libvirt-master-build" build number 1475 originally caused by: Started by an SCM change [EnvInject] - Loading node environment variables. Building remotely on libvirt-freebsd-11 (libvirt) in workspace <https://ci.centos.org/job/libvirt-go-master-check/systems=libvirt-freebsd-11/ws/> [libvirt-go-master] $ /bin/sh -xe /tmp/jenkins3941528620285992203.sh + export 'TEST_ARGS=-tags api' + go test -tags api 2018-05-31 08:27:00.427+0000: 34498240512: info : libvirt version: 4.4.0 2018-05-31 08:27:00.427+0000: 34498240512: info : hostname: libvirt-freebsd-11 2018-05-31 08:27:00.427+0000: 34498240512: warning : virEventRegisterImpl:245 : Ignoring attempt to replace registered event loop 2018-05-31 08:27:00.428+0000: 34498240512: warning : virEventRegisterImpl:245 : Ignoring attempt to replace registered event loop 2018-05-31 08:27:00.428+0000: 34498240512: warning : virEventRegisterImpl:245 : Ignoring attempt to replace registered event loop Missing function 'virConnectBaselineHypervisorCPU' Missing function 'virConnectCompareHypervisorCPU' Missing function 'virDomainDetachDeviceAlias' --- FAIL: TestAPICoverage (1.88s) panic: Missing symbols found [recovered] panic: Missing symbols found goroutine 18 [running]: testing.tRunner.func1(0xc4200d00f0) /usr/local/go/src/testing/testing.go:742 +0x29d panic(0x5ae1e0, 0x611730) /usr/local/go/src/runtime/panic.go:505 +0x229 _/usr<https://ci.centos.org/job/libvirt-go-master-check/systems=libvirt-freebsd-11/ws/.TestAPICoverage(0xc4200d00f0)> /usr<https://ci.centos.org/job/libvirt-go-master-check/systems=libvirt-freebsd-11/ws/api_test.go>:504 +0x548 testing.tRunner(0xc4200d00f0, 0x5fc7b0) /usr/local/go/src/testing/testing.go:777 +0xd0 created by testing.(*T).Run /usr/local/go/src/testing/testing.go:824 +0x2e0 exit status 2 FAIL _/usr<https://ci.centos.org/job/libvirt-go-master-check/systems=libvirt-freebsd-11/ws/> 2.462s Build step 'Execute shell' marked build as failure

See <https://ci.centos.org/job/libvirt-go-master-check/systems=libvirt-freebsd-11/1068/display/redirect> ------------------------------------------ Started by upstream project "libvirt-go-master-check" build number 1068 originally caused by: Started by upstream project "libvirt-go-master-build" build number 1079 originally caused by: Started by upstream project "libvirt-master-build" build number 1476 originally caused by: Started by an SCM change [EnvInject] - Loading node environment variables. Building remotely on libvirt-freebsd-11 (libvirt) in workspace <https://ci.centos.org/job/libvirt-go-master-check/systems=libvirt-freebsd-11/ws/> [libvirt-go-master] $ /bin/sh -xe /tmp/jenkins5724879607701708336.sh + export 'TEST_ARGS=-tags api' + go test -tags api 2018-05-31 10:28:30.333+0000: 34498240512: info : libvirt version: 4.4.0 2018-05-31 10:28:30.333+0000: 34498240512: info : hostname: libvirt-freebsd-11 2018-05-31 10:28:30.333+0000: 34498240512: warning : virEventRegisterImpl:245 : Ignoring attempt to replace registered event loop 2018-05-31 10:28:30.334+0000: 34498240512: warning : virEventRegisterImpl:245 : Ignoring attempt to replace registered event loop 2018-05-31 10:28:30.334+0000: 34498240512: warning : virEventRegisterImpl:245 : Ignoring attempt to replace registered event loop Missing function 'virConnectBaselineHypervisorCPU' Missing function 'virConnectCompareHypervisorCPU' Missing function 'virDomainDetachDeviceAlias' --- FAIL: TestAPICoverage (0.69s) panic: Missing symbols found [recovered] panic: Missing symbols found goroutine 4 [running]: testing.tRunner.func1(0xc4200b40f0) /usr/local/go/src/testing/testing.go:742 +0x29d panic(0x5ae1e0, 0x611730) /usr/local/go/src/runtime/panic.go:505 +0x229 _/usr<https://ci.centos.org/job/libvirt-go-master-check/systems=libvirt-freebsd-11/ws/.TestAPICoverage(0xc4200b40f0)> /usr<https://ci.centos.org/job/libvirt-go-master-check/systems=libvirt-freebsd-11/ws/api_test.go>:504 +0x548 testing.tRunner(0xc4200b40f0, 0x5fc7b0) /usr/local/go/src/testing/testing.go:777 +0xd0 created by testing.(*T).Run /usr/local/go/src/testing/testing.go:824 +0x2e0 exit status 2 FAIL _/usr<https://ci.centos.org/job/libvirt-go-master-check/systems=libvirt-freebsd-11/ws/> 0.911s Build step 'Execute shell' marked build as failure

See <https://ci.centos.org/job/libvirt-go-master-check/systems=libvirt-freebsd-11/1069/display/redirect> ------------------------------------------ Started by upstream project "libvirt-go-master-check" build number 1069 originally caused by: Started by upstream project "libvirt-go-master-build" build number 1080 originally caused by: Started by upstream project "libvirt-master-build" build number 1477 originally caused by: Started by an SCM change Started by an SCM change Started by an SCM change [EnvInject] - Loading node environment variables. Building remotely on libvirt-freebsd-11 (libvirt) in workspace <https://ci.centos.org/job/libvirt-go-master-check/systems=libvirt-freebsd-11/ws/> [libvirt-go-master] $ /bin/sh -xe /tmp/jenkins5572430087095528548.sh + export 'TEST_ARGS=-tags api' + go test -tags api 2018-05-31 11:48:12.399+0000: 34498240512: info : libvirt version: 4.4.0 2018-05-31 11:48:12.399+0000: 34498240512: info : hostname: libvirt-freebsd-11 2018-05-31 11:48:12.399+0000: 34498240512: warning : virEventRegisterImpl:245 : Ignoring attempt to replace registered event loop 2018-05-31 11:48:12.418+0000: 34498240512: warning : virEventRegisterImpl:245 : Ignoring attempt to replace registered event loop 2018-05-31 11:48:12.419+0000: 34498240512: warning : virEventRegisterImpl:245 : Ignoring attempt to replace registered event loop Missing function 'virConnectBaselineHypervisorCPU' Missing function 'virConnectCompareHypervisorCPU' Missing function 'virDomainDetachDeviceAlias' --- FAIL: TestAPICoverage (0.97s) panic: Missing symbols found [recovered] panic: Missing symbols found goroutine 5 [running]: testing.tRunner.func1(0xc4200ae0f0) /usr/local/go/src/testing/testing.go:742 +0x29d panic(0x5ae1e0, 0x611730) /usr/local/go/src/runtime/panic.go:505 +0x229 _/usr<https://ci.centos.org/job/libvirt-go-master-check/systems=libvirt-freebsd-11/ws/.TestAPICoverage(0xc4200ae0f0)> /usr<https://ci.centos.org/job/libvirt-go-master-check/systems=libvirt-freebsd-11/ws/api_test.go>:504 +0x548 testing.tRunner(0xc4200ae0f0, 0x5fc7b0) /usr/local/go/src/testing/testing.go:777 +0xd0 created by testing.(*T).Run /usr/local/go/src/testing/testing.go:824 +0x2e0 exit status 2 FAIL _/usr<https://ci.centos.org/job/libvirt-go-master-check/systems=libvirt-freebsd-11/ws/> 1.142s Build step 'Execute shell' marked build as failure

See <https://ci.centos.org/job/libvirt-go-master-check/systems=libvirt-freebsd-11/1070/display/redirect> ------------------------------------------ Started by upstream project "libvirt-go-master-check" build number 1070 originally caused by: Started by upstream project "libvirt-go-master-build" build number 1081 originally caused by: Started by upstream project "libvirt-master-build" build number 1478 originally caused by: Started by an SCM change [EnvInject] - Loading node environment variables. Building remotely on libvirt-freebsd-11 (libvirt) in workspace <https://ci.centos.org/job/libvirt-go-master-check/systems=libvirt-freebsd-11/ws/> [libvirt-go-master] $ /bin/sh -xe /tmp/jenkins3390875512157590714.sh + export 'TEST_ARGS=-tags api' + go test -tags api 2018-05-31 14:18:36.242+0000: 34498240512: info : libvirt version: 4.4.0 2018-05-31 14:18:36.242+0000: 34498240512: info : hostname: libvirt-freebsd-11 2018-05-31 14:18:36.242+0000: 34498240512: warning : virEventRegisterImpl:245 : Ignoring attempt to replace registered event loop 2018-05-31 14:18:36.243+0000: 34498240512: warning : virEventRegisterImpl:245 : Ignoring attempt to replace registered event loop 2018-05-31 14:18:36.243+0000: 34498240512: warning : virEventRegisterImpl:245 : Ignoring attempt to replace registered event loop Missing function 'virConnectBaselineHypervisorCPU' Missing function 'virConnectCompareHypervisorCPU' Missing function 'virDomainDetachDeviceAlias' --- FAIL: TestAPICoverage (0.96s) panic: Missing symbols found [recovered] panic: Missing symbols found goroutine 5 [running]: testing.tRunner.func1(0xc4200ae0f0) /usr/local/go/src/testing/testing.go:742 +0x29d panic(0x5ae1e0, 0x611730) /usr/local/go/src/runtime/panic.go:505 +0x229 _/usr<https://ci.centos.org/job/libvirt-go-master-check/systems=libvirt-freebsd-11/ws/.TestAPICoverage(0xc4200ae0f0)> /usr<https://ci.centos.org/job/libvirt-go-master-check/systems=libvirt-freebsd-11/ws/api_test.go>:504 +0x548 testing.tRunner(0xc4200ae0f0, 0x5fc7b0) /usr/local/go/src/testing/testing.go:777 +0xd0 created by testing.(*T).Run /usr/local/go/src/testing/testing.go:824 +0x2e0 exit status 2 FAIL _/usr<https://ci.centos.org/job/libvirt-go-master-check/systems=libvirt-freebsd-11/ws/> 1.095s Build step 'Execute shell' marked build as failure

See <https://ci.centos.org/job/libvirt-go-master-check/systems=libvirt-freebsd-11/1071/display/redirect> ------------------------------------------ Started by upstream project "libvirt-go-master-check" build number 1071 originally caused by: Started by upstream project "libvirt-go-master-build" build number 1082 originally caused by: Started by upstream project "libvirt-master-build" build number 1479 originally caused by: Started by an SCM change [EnvInject] - Loading node environment variables. Building remotely on libvirt-freebsd-11 (libvirt) in workspace <https://ci.centos.org/job/libvirt-go-master-check/systems=libvirt-freebsd-11/ws/> [libvirt-go-master] $ /bin/sh -xe /tmp/jenkins3477186564620659941.sh + export 'TEST_ARGS=-tags api' + go test -tags api 2018-05-31 15:45:30.070+0000: 34498240512: info : libvirt version: 4.4.0 2018-05-31 15:45:30.070+0000: 34498240512: info : hostname: libvirt-freebsd-11 2018-05-31 15:45:30.070+0000: 34498240512: warning : virEventRegisterImpl:245 : Ignoring attempt to replace registered event loop 2018-05-31 15:45:30.077+0000: 34498240512: warning : virEventRegisterImpl:245 : Ignoring attempt to replace registered event loop 2018-05-31 15:45:30.077+0000: 34498240512: warning : virEventRegisterImpl:245 : Ignoring attempt to replace registered event loop Missing function 'virConnectBaselineHypervisorCPU' Missing function 'virConnectCompareHypervisorCPU' Missing function 'virDomainDetachDeviceAlias' --- FAIL: TestAPICoverage (1.84s) panic: Missing symbols found [recovered] panic: Missing symbols found goroutine 19 [running]: testing.tRunner.func1(0xc4200c80f0) /usr/local/go/src/testing/testing.go:742 +0x29d panic(0x5ae1e0, 0x611730) /usr/local/go/src/runtime/panic.go:505 +0x229 _/usr<https://ci.centos.org/job/libvirt-go-master-check/systems=libvirt-freebsd-11/ws/.TestAPICoverage(0xc4200c80f0)> /usr<https://ci.centos.org/job/libvirt-go-master-check/systems=libvirt-freebsd-11/ws/api_test.go>:504 +0x548 testing.tRunner(0xc4200c80f0, 0x5fc7b0) /usr/local/go/src/testing/testing.go:777 +0xd0 created by testing.(*T).Run /usr/local/go/src/testing/testing.go:824 +0x2e0 exit status 2 FAIL _/usr<https://ci.centos.org/job/libvirt-go-master-check/systems=libvirt-freebsd-11/ws/> 1.927s Build step 'Execute shell' marked build as failure

See <https://ci.centos.org/job/libvirt-go-master-check/systems=libvirt-freebsd-11/1072/display/redirect> ------------------------------------------ Started by upstream project "libvirt-go-master-check" build number 1072 originally caused by: Started by upstream project "libvirt-go-master-build" build number 1083 originally caused by: Started by upstream project "libvirt-master-build" build number 1480 originally caused by: Started by an SCM change [EnvInject] - Loading node environment variables. Building remotely on libvirt-freebsd-11 (libvirt) in workspace <https://ci.centos.org/job/libvirt-go-master-check/systems=libvirt-freebsd-11/ws/> [libvirt-go-master] $ /bin/sh -xe /tmp/jenkins5400628755535531841.sh + export 'TEST_ARGS=-tags api' + go test -tags api 2018-06-01 12:39:11.253+0000: 34498240512: info : libvirt version: 4.4.0 2018-06-01 12:39:11.253+0000: 34498240512: info : hostname: libvirt-freebsd-11 2018-06-01 12:39:11.253+0000: 34498240512: warning : virEventRegisterImpl:245 : Ignoring attempt to replace registered event loop 2018-06-01 12:39:11.253+0000: 34498240512: warning : virEventRegisterImpl:245 : Ignoring attempt to replace registered event loop 2018-06-01 12:39:11.254+0000: 34498240512: warning : virEventRegisterImpl:245 : Ignoring attempt to replace registered event loop Missing function 'virConnectBaselineHypervisorCPU' Missing function 'virConnectCompareHypervisorCPU' Missing function 'virDomainDetachDeviceAlias' --- FAIL: TestAPICoverage (0.55s) panic: Missing symbols found [recovered] panic: Missing symbols found goroutine 19 [running]: testing.tRunner.func1(0xc4200cc0f0) /usr/local/go/src/testing/testing.go:742 +0x29d panic(0x5ad7a0, 0x6109d0) /usr/local/go/src/runtime/panic.go:502 +0x229 _/usr<https://ci.centos.org/job/libvirt-go-master-check/systems=libvirt-freebsd-11/ws/.TestAPICoverage(0xc4200cc0f0)> /usr<https://ci.centos.org/job/libvirt-go-master-check/systems=libvirt-freebsd-11/ws/api_test.go>:504 +0x548 testing.tRunner(0xc4200cc0f0, 0x5fbc28) /usr/local/go/src/testing/testing.go:777 +0xd0 created by testing.(*T).Run /usr/local/go/src/testing/testing.go:824 +0x2e0 exit status 2 FAIL _/usr<https://ci.centos.org/job/libvirt-go-master-check/systems=libvirt-freebsd-11/ws/> 0.632s Build step 'Execute shell' marked build as failure

See <https://ci.centos.org/job/libvirt-go-master-check/systems=libvirt-freebsd-11/1073/display/redirect> ------------------------------------------ Started by upstream project "libvirt-go-master-check" build number 1073 originally caused by: Started by upstream project "libvirt-go-master-build" build number 1084 originally caused by: Started by upstream project "libvirt-master-build" build number 1481 originally caused by: Started by an SCM change Started by an SCM change [EnvInject] - Loading node environment variables. Building remotely on libvirt-freebsd-11 (libvirt) in workspace <https://ci.centos.org/job/libvirt-go-master-check/systems=libvirt-freebsd-11/ws/> [libvirt-go-master] $ /bin/sh -xe /tmp/jenkins2229693154750806622.sh + export 'TEST_ARGS=-tags api' + go test -tags api 2018-06-01 13:58:03.913+0000: 34498240512: info : libvirt version: 4.4.0 2018-06-01 13:58:03.913+0000: 34498240512: info : hostname: libvirt-freebsd-11 2018-06-01 13:58:03.913+0000: 34498240512: warning : virEventRegisterImpl:245 : Ignoring attempt to replace registered event loop 2018-06-01 13:58:03.915+0000: 34498240512: warning : virEventRegisterImpl:245 : Ignoring attempt to replace registered event loop 2018-06-01 13:58:03.915+0000: 34498240512: warning : virEventRegisterImpl:245 : Ignoring attempt to replace registered event loop Missing function 'virConnectBaselineHypervisorCPU' Missing function 'virConnectCompareHypervisorCPU' Missing function 'virDomainDetachDeviceAlias' --- FAIL: TestAPICoverage (0.26s) panic: Missing symbols found [recovered] panic: Missing symbols found goroutine 5 [running]: testing.tRunner.func1(0xc4200b60f0) /usr/local/go/src/testing/testing.go:742 +0x29d panic(0x5ad7a0, 0x6109d0) /usr/local/go/src/runtime/panic.go:502 +0x229 _/usr<https://ci.centos.org/job/libvirt-go-master-check/systems=libvirt-freebsd-11/ws/.TestAPICoverage(0xc4200b60f0)> /usr<https://ci.centos.org/job/libvirt-go-master-check/systems=libvirt-freebsd-11/ws/api_test.go>:504 +0x548 testing.tRunner(0xc4200b60f0, 0x5fbc28) /usr/local/go/src/testing/testing.go:777 +0xd0 created by testing.(*T).Run /usr/local/go/src/testing/testing.go:824 +0x2e0 exit status 2 FAIL _/usr<https://ci.centos.org/job/libvirt-go-master-check/systems=libvirt-freebsd-11/ws/> 0.353s Build step 'Execute shell' marked build as failure

See <https://ci.centos.org/job/libvirt-go-master-check/systems=libvirt-freebsd-11/1074/display/redirect> ------------------------------------------ Started by upstream project "libvirt-go-master-check" build number 1074 originally caused by: Started by upstream project "libvirt-go-master-build" build number 1085 originally caused by: Started by upstream project "libvirt-master-build" build number 1482 originally caused by: Started by an SCM change [EnvInject] - Loading node environment variables. Building remotely on libvirt-freebsd-11 (libvirt) in workspace <https://ci.centos.org/job/libvirt-go-master-check/systems=libvirt-freebsd-11/ws/> [libvirt-go-master] $ /bin/sh -xe /tmp/jenkins4638731013379392359.sh + export 'TEST_ARGS=-tags api' + go test -tags api 2018-06-01 16:29:41.382+0000: 34498240512: info : libvirt version: 4.4.0 2018-06-01 16:29:41.382+0000: 34498240512: info : hostname: libvirt-freebsd-11 2018-06-01 16:29:41.382+0000: 34498240512: warning : virEventRegisterImpl:245 : Ignoring attempt to replace registered event loop 2018-06-01 16:29:41.382+0000: 34498240512: warning : virEventRegisterImpl:245 : Ignoring attempt to replace registered event loop 2018-06-01 16:29:41.382+0000: 34498240512: warning : virEventRegisterImpl:245 : Ignoring attempt to replace registered event loop Missing function 'virConnectBaselineHypervisorCPU' Missing function 'virConnectCompareHypervisorCPU' Missing function 'virDomainDetachDeviceAlias' --- FAIL: TestAPICoverage (0.68s) panic: Missing symbols found [recovered] panic: Missing symbols found goroutine 19 [running]: testing.tRunner.func1(0xc4200cc0f0) /usr/local/go/src/testing/testing.go:742 +0x29d panic(0x5ad7a0, 0x6109d0) /usr/local/go/src/runtime/panic.go:502 +0x229 _/usr<https://ci.centos.org/job/libvirt-go-master-check/systems=libvirt-freebsd-11/ws/.TestAPICoverage(0xc4200cc0f0)> /usr<https://ci.centos.org/job/libvirt-go-master-check/systems=libvirt-freebsd-11/ws/api_test.go>:504 +0x548 testing.tRunner(0xc4200cc0f0, 0x5fbc28) /usr/local/go/src/testing/testing.go:777 +0xd0 created by testing.(*T).Run /usr/local/go/src/testing/testing.go:824 +0x2e0 exit status 2 FAIL _/usr<https://ci.centos.org/job/libvirt-go-master-check/systems=libvirt-freebsd-11/ws/> 0.778s Build step 'Execute shell' marked build as failure

participants (1)
-
ci@centos.org