libvirt-go-xml | Pipeline #166217535 has failed for master | 3d7a35d3

Your pipeline has failed. Project: libvirt-go-xml ( https://gitlab.com/libvirt/libvirt-go-xml ) Branch: master ( https://gitlab.com/libvirt/libvirt-go-xml/-/commits/master ) Commit: 3d7a35d3 ( https://gitlab.com/libvirt/libvirt-go-xml/-/commit/3d7a35d32e28306f77f5a1c41... ) Commit Message: README: Convert to reStructuredText This is th... Commit Author: Andrea Bolognani ( https://gitlab.com/abologna ) Pipeline #166217535 ( https://gitlab.com/libvirt/libvirt-go-xml/-/pipelines/166217535 ) triggered by Daniel Berrange ( https://gitlab.com/berrange ) had 5 failed builds. Job #636998723 ( https://gitlab.com/libvirt/libvirt-go-xml/-/jobs/636998723/raw ) Stage: build Name: go_1_10 Job #636998788 ( https://gitlab.com/libvirt/libvirt-go-xml/-/jobs/636998788/raw ) Stage: build Name: go_1_12 Trace: [32;1mFetching changes...[0;m Initialized empty Git repository in /builds/libvirt/libvirt-go-xml/.git/ [32;1mCreated fresh repository.[0;m [32;1mChecking out 3d7a35d3 as master...[0;m [32;1mSkipping Git submodules setup[0;m section_end:1594695966:get_sources [0Ksection_start:1594695966:step_script [0K[0K[36;1mExecuting "step_script" stage of the job script[0;m [0;m[32;1m$ go test -timeout 10m -tags xmlroundtrip -v[0;m === RUN TestDomainSnapshot --- PASS: TestDomainSnapshot (0.00s) === RUN TestDomain --- PASS: TestDomain (0.01s) === RUN TestNetwork --- PASS: TestNetwork (0.00s) === RUN TestNodeDevice --- PASS: TestNodeDevice (0.00s) === RUN TestSecret --- PASS: TestSecret (0.00s) === RUN TestStoragePool --- PASS: TestStoragePool (0.00s) === RUN TestStorageVolume --- PASS: TestStorageVolume (0.00s) === RUN TestRoundTrip --- FAIL: TestRoundTrip (5.59s) xml_test.go:374: testdata/libvirt/tests/xml2vmxdata/xml2vmx-ethernet-mac-type.xml: /domain[0]/devices[0]/interface[1]/mac[0]/@type: attribute 'static' in expected XML missing in actual XML FAIL exit status 1 FAIL _/builds/libvirt/libvirt-go-xml 5.606s section_end:1594695979:step_script [0K[31;1mERROR: Job failed: exit code 1 [0;m Job #636998745 ( https://gitlab.com/libvirt/libvirt-go-xml/-/jobs/636998745/raw ) Stage: build Name: go_1_11 Trace: [32;1mFetching changes...[0;m Initialized empty Git repository in /builds/libvirt/libvirt-go-xml/.git/ [32;1mCreated fresh repository.[0;m [32;1mChecking out 3d7a35d3 as master...[0;m [32;1mSkipping Git submodules setup[0;m section_end:1594695965:get_sources [0Ksection_start:1594695965:step_script [0K[0K[36;1mExecuting "step_script" stage of the job script[0;m [0;m[32;1m$ go test -timeout 10m -tags xmlroundtrip -v[0;m === RUN TestDomainSnapshot --- PASS: TestDomainSnapshot (0.00s) === RUN TestDomain --- PASS: TestDomain (0.01s) === RUN TestNetwork --- PASS: TestNetwork (0.00s) === RUN TestNodeDevice --- PASS: TestNodeDevice (0.00s) === RUN TestSecret --- PASS: TestSecret (0.00s) === RUN TestStoragePool --- PASS: TestStoragePool (0.00s) === RUN TestStorageVolume --- PASS: TestStorageVolume (0.00s) === RUN TestRoundTrip --- FAIL: TestRoundTrip (5.69s) xml_test.go:374: testdata/libvirt/tests/xml2vmxdata/xml2vmx-ethernet-mac-type.xml: /domain[0]/devices[0]/interface[1]/mac[0]/@type: attribute 'static' in expected XML missing in actual XML FAIL exit status 1 FAIL _/builds/libvirt/libvirt-go-xml 5.703s section_end:1594695977:step_script [0K[31;1mERROR: Job failed: exit code 1 [0;m Job #636998813 ( https://gitlab.com/libvirt/libvirt-go-xml/-/jobs/636998813/raw ) Stage: build Name: go_1_13 Trace: [32;1mFetching changes...[0;m Initialized empty Git repository in /builds/libvirt/libvirt-go-xml/.git/ [32;1mCreated fresh repository.[0;m [32;1mChecking out 3d7a35d3 as master...[0;m [32;1mSkipping Git submodules setup[0;m section_end:1594695964:get_sources [0Ksection_start:1594695964:step_script [0K[0K[36;1mExecuting "step_script" stage of the job script[0;m [0;m[32;1m$ go test -timeout 10m -tags xmlroundtrip -v[0;m === RUN TestDomainSnapshot --- PASS: TestDomainSnapshot (0.00s) === RUN TestDomain --- PASS: TestDomain (0.01s) === RUN TestNetwork --- PASS: TestNetwork (0.00s) === RUN TestNodeDevice --- PASS: TestNodeDevice (0.00s) === RUN TestSecret --- PASS: TestSecret (0.00s) === RUN TestStoragePool --- PASS: TestStoragePool (0.00s) === RUN TestStorageVolume --- PASS: TestStorageVolume (0.00s) === RUN TestRoundTrip --- FAIL: TestRoundTrip (5.83s) xml_test.go:374: testdata/libvirt/tests/xml2vmxdata/xml2vmx-ethernet-mac-type.xml: /domain[0]/devices[0]/interface[1]/mac[0]/@type: attribute 'static' in expected XML missing in actual XML FAIL exit status 1 FAIL _/builds/libvirt/libvirt-go-xml 5.846s section_end:1594695976:step_script [0K[31;1mERROR: Job failed: exit code 1 [0;m Job #636998836 ( https://gitlab.com/libvirt/libvirt-go-xml/-/jobs/636998836/raw ) Stage: build Name: go_1_14 Trace: [32;1mFetching changes...[0;m Initialized empty Git repository in /builds/libvirt/libvirt-go-xml/.git/ [32;1mCreated fresh repository.[0;m [32;1mChecking out 3d7a35d3 as master...[0;m [32;1mSkipping Git submodules setup[0;m section_end:1594695963:get_sources [0Ksection_start:1594695963:step_script [0K[0K[36;1mExecuting "step_script" stage of the job script[0;m [0;m[32;1m$ go test -timeout 10m -tags xmlroundtrip -v[0;m === RUN TestDomainSnapshot --- PASS: TestDomainSnapshot (0.00s) === RUN TestDomain --- PASS: TestDomain (0.01s) === RUN TestNetwork --- PASS: TestNetwork (0.00s) === RUN TestNodeDevice --- PASS: TestNodeDevice (0.00s) === RUN TestSecret --- PASS: TestSecret (0.00s) === RUN TestStoragePool --- PASS: TestStoragePool (0.00s) === RUN TestStorageVolume --- PASS: TestStorageVolume (0.00s) === RUN TestRoundTrip TestRoundTrip: xml_test.go:374: testdata/libvirt/tests/xml2vmxdata/xml2vmx-ethernet-mac-type.xml: /domain[0]/devices[0]/interface[1]/mac[0]/@type: attribute 'static' in expected XML missing in actual XML --- FAIL: TestRoundTrip (5.45s) FAIL exit status 1 FAIL _/builds/libvirt/libvirt-go-xml 5.464s section_end:1594695976:step_script [0K[31;1mERROR: Job failed: exit code 1 [0;m -- You're receiving this email because of your account on gitlab.com.
participants (1)
-
GitLab