[Libvirt-ci] Build failed in Jenkins: libvirt-dbus-check » libvirt-freebsd-11 #55

See <https://ci.centos.org/job/libvirt-dbus-check/systems=libvirt-freebsd-11/55/display/redirect> ------------------------------------------ Started by upstream project "libvirt-dbus-check" build number 55 originally caused by: Started by upstream project "libvirt-dbus-syntax-check" build number 55 originally caused by: Started by upstream project "libvirt-dbus-build" build number 55 originally caused by: Started by upstream project "libvirt-glib-build" build number 55 originally caused by: Started by upstream project "libvirt-build" build number 78 originally caused by: Started by an SCM change [EnvInject] - Loading node environment variables. Building remotely on libvirt-freebsd-11 (libvirt) in workspace <https://ci.centos.org/job/libvirt-dbus-check/systems=libvirt-freebsd-11/ws/> [libvirt-dbus] $ /bin/sh -xe /tmp/jenkins7549932638741533089.sh + cd build + /usr/local/bin/gmake check Making check in data gmake[1]: Entering directory '/usr<https://ci.centos.org/job/libvirt-dbus-check/systems=libvirt-freebsd-11/ws/build/data'> gmake[1]: Nothing to be done for 'check'. gmake[1]: Leaving directory '/usr<https://ci.centos.org/job/libvirt-dbus-check/systems=libvirt-freebsd-11/ws/build/data'> Making check in docs gmake[1]: Entering directory '/usr<https://ci.centos.org/job/libvirt-dbus-check/systems=libvirt-freebsd-11/ws/build/docs'> gmake[1]: Nothing to be done for 'check'. gmake[1]: Leaving directory '/usr<https://ci.centos.org/job/libvirt-dbus-check/systems=libvirt-freebsd-11/ws/build/docs'> Making check in src gmake[1]: Entering directory '/usr<https://ci.centos.org/job/libvirt-dbus-check/systems=libvirt-freebsd-11/ws/build/src'> gmake[1]: Nothing to be done for 'check'. gmake[1]: Leaving directory '/usr<https://ci.centos.org/job/libvirt-dbus-check/systems=libvirt-freebsd-11/ws/build/src'> Making check in tests gmake[1]: Entering directory '/usr<https://ci.centos.org/job/libvirt-dbus-check/systems=libvirt-freebsd-11/ws/build/tests'> /usr/local/bin/gmake test_util gmake[2]: Entering directory '/usr<https://ci.centos.org/job/libvirt-dbus-check/systems=libvirt-freebsd-11/ws/build/tests'> CC test_util-test_util.o CCLD test_util gmake[2]: Leaving directory '/usr<https://ci.centos.org/job/libvirt-dbus-check/systems=libvirt-freebsd-11/ws/build/tests'> /usr/local/bin/gmake check-TESTS gmake[2]: Entering directory '/usr<https://ci.centos.org/job/libvirt-dbus-check/systems=libvirt-freebsd-11/ws/build/tests'> gmake[3]: Entering directory '/usr<https://ci.centos.org/job/libvirt-dbus-check/systems=libvirt-freebsd-11/ws/build/tests'> PASS: test_util PASS: test_interface.py PASS: test_domain.py PASS: test_network.py FAIL: test_nodedev.py PASS: test_connect.py PASS: test_storage.py ============================================================================ Testsuite summary for libvirt-dbus 1.3.0 ============================================================================ # TOTAL: 7 # PASS: 6 # SKIP: 0 # XFAIL: 0 # FAIL: 1 # XPASS: 0 # ERROR: 0 ============================================================================ See tests/test-suite.log Please report to libvir-list@redhat.com ============================================================================ gmake[3]: *** [Makefile:766: test-suite.log] Error 1 gmake[3]: Leaving directory '/usr<https://ci.centos.org/job/libvirt-dbus-check/systems=libvirt-freebsd-11/ws/build/tests'> gmake[2]: *** [Makefile:874: check-TESTS] Error 2 gmake[2]: Leaving directory '/usr<https://ci.centos.org/job/libvirt-dbus-check/systems=libvirt-freebsd-11/ws/build/tests'> gmake[1]: *** [Makefile:990: check-am] Error 2 gmake[1]: Leaving directory '/usr<https://ci.centos.org/job/libvirt-dbus-check/systems=libvirt-freebsd-11/ws/build/tests'> gmake: *** [Makefile:460: check-recursive] Error 1 + cat tests/test-suite.log ============================================== libvirt-dbus 1.3.0: tests/test-suite.log ============================================== # TOTAL: 7 # PASS: 6 # SKIP: 0 # XFAIL: 0 # FAIL: 1 # XPASS: 0 # ERROR: 0 .. contents:: :depth: 2 FAIL: test_nodedev.py ===================== ============================= test session starts ============================== platform freebsd11 -- Python 3.6.5, pytest-3.4.2, py-1.5.3, pluggy-0.6.0 rootdir: /usr<https://ci.centos.org/job/libvirt-dbus-check/systems=libvirt-freebsd-11/ws/,> inifile: collected 4 items ../../tests/test_nodedev.py ..E. [100%] ==================================== ERRORS ==================================== _________ ERROR at setup of TestNodeDevice.test_node_device_list_caps __________ self = <test_nodedev.TestNodeDevice object at 0x80941b2e8> request = <SubRequest 'libvirt_dbus_setup' for <Function 'test_node_device_list_caps'>> @pytest.fixture(autouse=True) def libvirt_dbus_setup(self, request): """Start libvirt-dbus for each test function """ os.environ['LIBVIRT_DEBUG'] = '3' self.libvirt_dbus = subprocess.Popen([exe, '--session']) self.bus = dbus.SessionBus() for i in range(10): if self.bus.name_has_owner('org.libvirt'): break time.sleep(0.1) else:
raise TimeoutError('error starting libvirt-dbus')
E TimeoutError: error starting libvirt-dbus ../../tests/libvirttest.py:44: TimeoutError ====================== 3 passed, 1 error in 5.88 seconds ======================= FAIL test_nodedev.py (exit status: 1) + exit 1 Build step 'Execute shell' marked build as failure

participants (1)
-
ci@centos.org