[Libvirt-ci] Build failed in Jenkins: libvirt-go-xml-check » libvirt-debian-9 #491

See <https://ci.centos.org/job/libvirt-go-xml-check/systems=libvirt-debian-9/491/display/redirect> ------------------------------------------ Started by upstream project "libvirt-go-xml-check" build number 491 originally caused by: Started by upstream project "libvirt-go-xml-build" build number 493 originally caused by: Started by upstream project "libvirt-build" build number 580 originally caused by: Started by an SCM change [EnvInject] - Loading node environment variables. Building remotely on libvirt-debian-9 (libvirt) in workspace <https://ci.centos.org/job/libvirt-go-xml-check/systems=libvirt-debian-9/ws/> [libvirt-go-xml] $ /bin/sh -xe /tmp/jenkins7322083235633449040.sh + export TEST_ARGS=-tags xmlroundtrip + go test -tags xmlroundtrip --- FAIL: TestRoundTrip (32.36s) xml_test.go:394: testdata/libvirt/tests/qemuxml2argvdata/net-virtio-network-portgroup.xml: /domain[0]/devices[0]/interface[0]/source[0]/@portid: attribute '873be5a0-6b8a-4a0b-a1df-ef3659cd64bc' in expected XML missing in actual XML FAIL exit status 1 FAIL _<https://ci.centos.org/job/libvirt-go-xml-check/systems=libvirt-debian-9/ws/> 32.438s Build step 'Execute shell' marked build as failure

See <https://ci.centos.org/job/libvirt-go-xml-check/systems=libvirt-debian-9/492/display/redirect> ------------------------------------------ Started by upstream project "libvirt-go-xml-check" build number 492 originally caused by: Started by upstream project "libvirt-go-xml-build" build number 494 originally caused by: Started by upstream project "libvirt-build" build number 581 originally caused by: Started by an SCM change Started by an SCM change Started by an SCM change Started by an SCM change Started by an SCM change Started by an SCM change Started by an SCM change [EnvInject] - Loading node environment variables. Building remotely on libvirt-debian-9 (libvirt) in workspace <https://ci.centos.org/job/libvirt-go-xml-check/systems=libvirt-debian-9/ws/> [libvirt-go-xml] $ /bin/sh -xe /tmp/jenkins6282224077360641176.sh + export TEST_ARGS=-tags xmlroundtrip + go test -tags xmlroundtrip --- FAIL: TestRoundTrip (12.17s) xml_test.go:394: testdata/libvirt/tests/qemuxml2argvdata/net-virtio-network-portgroup.xml: /domain[0]/devices[0]/interface[0]/source[0]/@portid: attribute '873be5a0-6b8a-4a0b-a1df-ef3659cd64bc' in expected XML missing in actual XML FAIL exit status 1 FAIL _<https://ci.centos.org/job/libvirt-go-xml-check/systems=libvirt-debian-9/ws/> 12.355s Build step 'Execute shell' marked build as failure

See <https://ci.centos.org/job/libvirt-go-xml-check/systems=libvirt-debian-9/493/display/redirect> ------------------------------------------ Started by upstream project "libvirt-go-xml-check" build number 493 originally caused by: Started by upstream project "libvirt-go-xml-build" build number 495 originally caused by: Started by upstream project "libvirt-build" build number 582 originally caused by: Started by an SCM change [EnvInject] - Loading node environment variables. Building remotely on libvirt-debian-9 (libvirt) in workspace <https://ci.centos.org/job/libvirt-go-xml-check/systems=libvirt-debian-9/ws/> [libvirt-go-xml] $ /bin/sh -xe /tmp/jenkins4602256561776693422.sh + export TEST_ARGS=-tags xmlroundtrip + go test -tags xmlroundtrip --- FAIL: TestRoundTrip (30.51s) xml_test.go:394: testdata/libvirt/tests/qemuxml2argvdata/net-virtio-network-portgroup.xml: /domain[0]/devices[0]/interface[0]/source[0]/@portid: attribute '873be5a0-6b8a-4a0b-a1df-ef3659cd64bc' in expected XML missing in actual XML FAIL exit status 1 FAIL _<https://ci.centos.org/job/libvirt-go-xml-check/systems=libvirt-debian-9/ws/> 30.592s Build step 'Execute shell' marked build as failure

See <https://ci.centos.org/job/libvirt-go-xml-check/systems=libvirt-debian-9/494/display/redirect> ------------------------------------------ Started by upstream project "libvirt-go-xml-check" build number 494 originally caused by: Started by upstream project "libvirt-go-xml-build" build number 496 originally caused by: Started by upstream project "libvirt-build" build number 583 originally caused by: Started by an SCM change [EnvInject] - Loading node environment variables. Building remotely on libvirt-debian-9 (libvirt) in workspace <https://ci.centos.org/job/libvirt-go-xml-check/systems=libvirt-debian-9/ws/> [libvirt-go-xml] $ /bin/sh -xe /tmp/jenkins8334400194691019667.sh + export TEST_ARGS=-tags xmlroundtrip + go test -tags xmlroundtrip --- FAIL: TestRoundTrip (20.78s) xml_test.go:394: testdata/libvirt/tests/qemuxml2argvdata/net-virtio-network-portgroup.xml: /domain[0]/devices[0]/interface[0]/source[0]/@portid: attribute '873be5a0-6b8a-4a0b-a1df-ef3659cd64bc' in expected XML missing in actual XML FAIL exit status 1 FAIL _<https://ci.centos.org/job/libvirt-go-xml-check/systems=libvirt-debian-9/ws/> 21.232s Build step 'Execute shell' marked build as failure

See <https://ci.centos.org/job/libvirt-go-xml-check/systems=libvirt-debian-9/495/display/redirect> ------------------------------------------ Started by upstream project "libvirt-go-xml-check" build number 495 originally caused by: Started by upstream project "libvirt-go-xml-build" build number 497 originally caused by: Started by upstream project "libvirt-build" build number 584 originally caused by: Started by an SCM change [EnvInject] - Loading node environment variables. Building remotely on libvirt-debian-9 (libvirt) in workspace <https://ci.centos.org/job/libvirt-go-xml-check/systems=libvirt-debian-9/ws/> [libvirt-go-xml] $ /bin/sh -xe /tmp/jenkins8080267723453479261.sh + export TEST_ARGS=-tags xmlroundtrip + go test -tags xmlroundtrip --- FAIL: TestRoundTrip (26.16s) xml_test.go:394: testdata/libvirt/tests/qemuxml2argvdata/net-virtio-network-portgroup.xml: /domain[0]/devices[0]/interface[0]/source[0]/@portid: attribute '873be5a0-6b8a-4a0b-a1df-ef3659cd64bc' in expected XML missing in actual XML FAIL exit status 1 FAIL _<https://ci.centos.org/job/libvirt-go-xml-check/systems=libvirt-debian-9/ws/> 26.296s Build step 'Execute shell' marked build as failure

See <https://ci.centos.org/job/libvirt-go-xml-check/systems=libvirt-debian-9/496/display/redirect> ------------------------------------------ Started by upstream project "libvirt-go-xml-check" build number 496 originally caused by: Started by upstream project "libvirt-go-xml-build" build number 498 originally caused by: Started by upstream project "libvirt-build" build number 586 originally caused by: Started by an SCM change [EnvInject] - Loading node environment variables. Building remotely on libvirt-debian-9 (libvirt) in workspace <https://ci.centos.org/job/libvirt-go-xml-check/systems=libvirt-debian-9/ws/> [libvirt-go-xml] $ /bin/sh -xe /tmp/jenkins8264249802241942802.sh + export TEST_ARGS=-tags xmlroundtrip + go test -tags xmlroundtrip --- FAIL: TestRoundTrip (20.56s) xml_test.go:394: testdata/libvirt/tests/qemuxml2argvdata/net-virtio-network-portgroup.xml: /domain[0]/devices[0]/interface[0]/source[0]/@portid: attribute '873be5a0-6b8a-4a0b-a1df-ef3659cd64bc' in expected XML missing in actual XML FAIL exit status 1 FAIL _<https://ci.centos.org/job/libvirt-go-xml-check/systems=libvirt-debian-9/ws/> 20.749s Build step 'Execute shell' marked build as failure

See <https://ci.centos.org/job/libvirt-go-xml-check/systems=libvirt-debian-9/497/display/redirect> ------------------------------------------ Started by upstream project "libvirt-go-xml-check" build number 497 originally caused by: Started by upstream project "libvirt-go-xml-build" build number 499 originally caused by: Started by upstream project "libvirt-build" build number 587 originally caused by: Started by an SCM change Started by an SCM change Started by an SCM change Started by an SCM change Started by an SCM change [EnvInject] - Loading node environment variables. Building remotely on libvirt-debian-9 (libvirt) in workspace <https://ci.centos.org/job/libvirt-go-xml-check/systems=libvirt-debian-9/ws/> [libvirt-go-xml] $ /bin/sh -xe /tmp/jenkins2043941738320886369.sh + export TEST_ARGS=-tags xmlroundtrip + go test -tags xmlroundtrip --- FAIL: TestRoundTrip (7.71s) xml_test.go:394: testdata/libvirt/tests/qemuxml2argvdata/net-virtio-network-portgroup.xml: /domain[0]/devices[0]/interface[0]/source[0]/@portid: attribute '873be5a0-6b8a-4a0b-a1df-ef3659cd64bc' in expected XML missing in actual XML FAIL exit status 1 FAIL _<https://ci.centos.org/job/libvirt-go-xml-check/systems=libvirt-debian-9/ws/> 7.748s Build step 'Execute shell' marked build as failure

See <https://ci.centos.org/job/libvirt-go-xml-check/systems=libvirt-debian-9/498/display/redirect> ------------------------------------------ Started by upstream project "libvirt-go-xml-check" build number 498 originally caused by: Started by upstream project "libvirt-go-xml-build" build number 500 originally caused by: Started by upstream project "libvirt-build" build number 588 originally caused by: Started by an SCM change Started by an SCM change Started by an SCM change Started by an SCM change Started by an SCM change Started by an SCM change Started by an SCM change Started by an SCM change [EnvInject] - Loading node environment variables. Building remotely on libvirt-debian-9 (libvirt) in workspace <https://ci.centos.org/job/libvirt-go-xml-check/systems=libvirt-debian-9/ws/> [libvirt-go-xml] $ /bin/sh -xe /tmp/jenkins355572665341277732.sh + export TEST_ARGS=-tags xmlroundtrip + go test -tags xmlroundtrip --- FAIL: TestRoundTrip (21.07s) xml_test.go:394: testdata/libvirt/tests/qemuxml2argvdata/net-virtio-network-portgroup.xml: /domain[0]/devices[0]/interface[0]/source[0]/@portid: attribute '873be5a0-6b8a-4a0b-a1df-ef3659cd64bc' in expected XML missing in actual XML FAIL exit status 1 FAIL _<https://ci.centos.org/job/libvirt-go-xml-check/systems=libvirt-debian-9/ws/> 21.113s Build step 'Execute shell' marked build as failure

See <https://ci.centos.org/job/libvirt-go-xml-check/systems=libvirt-debian-9/499/display/redirect> ------------------------------------------ Started by upstream project "libvirt-go-xml-check" build number 499 originally caused by: Started by upstream project "libvirt-go-xml-build" build number 501 originally caused by: Started by upstream project "libvirt-build" build number 589 originally caused by: Started by an SCM change Started by an SCM change Started by an SCM change Started by an SCM change Started by an SCM change Started by an SCM change Started by an SCM change Started by an SCM change [EnvInject] - Loading node environment variables. Building remotely on libvirt-debian-9 (libvirt) in workspace <https://ci.centos.org/job/libvirt-go-xml-check/systems=libvirt-debian-9/ws/> [libvirt-go-xml] $ /bin/sh -xe /tmp/jenkins3036521491702216333.sh + export TEST_ARGS=-tags xmlroundtrip + go test -tags xmlroundtrip --- FAIL: TestRoundTrip (24.99s) xml_test.go:394: testdata/libvirt/tests/qemuxml2argvdata/net-virtio-network-portgroup.xml: /domain[0]/devices[0]/interface[0]/source[0]/@portid: attribute '873be5a0-6b8a-4a0b-a1df-ef3659cd64bc' in expected XML missing in actual XML FAIL exit status 1 FAIL _<https://ci.centos.org/job/libvirt-go-xml-check/systems=libvirt-debian-9/ws/> 25.126s Build step 'Execute shell' marked build as failure

See <https://ci.centos.org/job/libvirt-go-xml-check/systems=libvirt-debian-9/500/display/redirect> ------------------------------------------ Started by upstream project "libvirt-go-xml-check" build number 500 originally caused by: Started by upstream project "libvirt-go-xml-build" build number 502 originally caused by: Started by upstream project "libvirt-build" build number 590 originally caused by: Started by an SCM change [EnvInject] - Loading node environment variables. Building remotely on libvirt-debian-9 (libvirt) in workspace <https://ci.centos.org/job/libvirt-go-xml-check/systems=libvirt-debian-9/ws/> [libvirt-go-xml] $ /bin/sh -xe /tmp/jenkins6640808390195774374.sh + export TEST_ARGS=-tags xmlroundtrip + go test -tags xmlroundtrip --- FAIL: TestRoundTrip (26.29s) xml_test.go:394: testdata/libvirt/tests/qemuxml2argvdata/net-virtio-network-portgroup.xml: /domain[0]/devices[0]/interface[0]/source[0]/@portid: attribute '873be5a0-6b8a-4a0b-a1df-ef3659cd64bc' in expected XML missing in actual XML FAIL exit status 1 FAIL _<https://ci.centos.org/job/libvirt-go-xml-check/systems=libvirt-debian-9/ws/> 26.328s Build step 'Execute shell' marked build as failure

See <https://ci.centos.org/job/libvirt-go-xml-check/systems=libvirt-debian-9/501/display/redirect> ------------------------------------------ Started by upstream project "libvirt-go-xml-check" build number 501 originally caused by: Started by upstream project "libvirt-go-xml-build" build number 503 originally caused by: Started by upstream project "libvirt-build" build number 591 originally caused by: Started by an SCM change [EnvInject] - Loading node environment variables. Building remotely on libvirt-debian-9 (libvirt) in workspace <https://ci.centos.org/job/libvirt-go-xml-check/systems=libvirt-debian-9/ws/> [libvirt-go-xml] $ /bin/sh -xe /tmp/jenkins8098963057481411684.sh + export TEST_ARGS=-tags xmlroundtrip + go test -tags xmlroundtrip --- FAIL: TestRoundTrip (10.12s) xml_test.go:394: testdata/libvirt/tests/qemuxml2argvdata/net-virtio-network-portgroup.xml: /domain[0]/devices[0]/interface[0]/source[0]/@portid: attribute '873be5a0-6b8a-4a0b-a1df-ef3659cd64bc' in expected XML missing in actual XML FAIL exit status 1 FAIL _<https://ci.centos.org/job/libvirt-go-xml-check/systems=libvirt-debian-9/ws/> 10.163s Build step 'Execute shell' marked build as failure

See <https://ci.centos.org/job/libvirt-go-xml-check/systems=libvirt-debian-9/502/display/redirect> ------------------------------------------ Started by upstream project "libvirt-go-xml-check" build number 502 originally caused by: Started by upstream project "libvirt-go-xml-build" build number 504 originally caused by: Started by upstream project "libvirt-build" build number 592 originally caused by: Started by an SCM change Started by an SCM change Started by an SCM change Started by an SCM change Started by an SCM change Started by an SCM change [EnvInject] - Loading node environment variables. Building remotely on libvirt-debian-9 (libvirt) in workspace <https://ci.centos.org/job/libvirt-go-xml-check/systems=libvirt-debian-9/ws/> [libvirt-go-xml] $ /bin/sh -xe /tmp/jenkins942269123706768093.sh + export TEST_ARGS=-tags xmlroundtrip + go test -tags xmlroundtrip --- FAIL: TestRoundTrip (20.63s) xml_test.go:433: open testdata/libvirt/tests/qemuargv2xmldata: no such file or directory FAIL exit status 1 FAIL _<https://ci.centos.org/job/libvirt-go-xml-check/systems=libvirt-debian-9/ws/> 20.791s Build step 'Execute shell' marked build as failure

See <https://ci.centos.org/job/libvirt-go-xml-check/systems=libvirt-debian-9/503/display/redirect> ------------------------------------------ Started by upstream project "libvirt-go-xml-check" build number 503 originally caused by: Started by upstream project "libvirt-go-xml-build" build number 505 originally caused by: Started by upstream project "libvirt-build" build number 593 originally caused by: Started by an SCM change Started by an SCM change Started by an SCM change Started by an SCM change Started by an SCM change Started by an SCM change Started by an SCM change Started by an SCM change [EnvInject] - Loading node environment variables. Building remotely on libvirt-debian-9 (libvirt) in workspace <https://ci.centos.org/job/libvirt-go-xml-check/systems=libvirt-debian-9/ws/> [libvirt-go-xml] $ /bin/sh -xe /tmp/jenkins3658303016544127254.sh + export TEST_ARGS=-tags xmlroundtrip + go test -tags xmlroundtrip --- FAIL: TestRoundTrip (7.51s) xml_test.go:433: open testdata/libvirt/tests/qemuargv2xmldata: no such file or directory FAIL exit status 1 FAIL _<https://ci.centos.org/job/libvirt-go-xml-check/systems=libvirt-debian-9/ws/> 7.548s Build step 'Execute shell' marked build as failure

See <https://ci.centos.org/job/libvirt-go-xml-check/systems=libvirt-debian-9/504/display/redirect> ------------------------------------------ Started by upstream project "libvirt-go-xml-check" build number 504 originally caused by: Started by upstream project "libvirt-go-xml-build" build number 506 originally caused by: Started by upstream project "libvirt-build" build number 594 originally caused by: Started by an SCM change Started by an SCM change Started by an SCM change Started by an SCM change Started by an SCM change Started by an SCM change Started by an SCM change Started by an SCM change Started by an SCM change [EnvInject] - Loading node environment variables. Building remotely on libvirt-debian-9 (libvirt) in workspace <https://ci.centos.org/job/libvirt-go-xml-check/systems=libvirt-debian-9/ws/> [libvirt-go-xml] $ /bin/sh -xe /tmp/jenkins7401533066505730676.sh + export TEST_ARGS=-tags xmlroundtrip + go test -tags xmlroundtrip --- FAIL: TestRoundTrip (17.11s) xml_test.go:433: open testdata/libvirt/tests/qemuargv2xmldata: no such file or directory FAIL exit status 1 FAIL _<https://ci.centos.org/job/libvirt-go-xml-check/systems=libvirt-debian-9/ws/> 17.185s Build step 'Execute shell' marked build as failure

See <https://ci.centos.org/job/libvirt-go-xml-check/systems=libvirt-debian-9/505/display/redirect> ------------------------------------------ Started by upstream project "libvirt-go-xml-check" build number 505 originally caused by: Started by upstream project "libvirt-go-xml-build" build number 507 originally caused by: Started by upstream project "libvirt-build" build number 595 originally caused by: Started by an SCM change [EnvInject] - Loading node environment variables. Building remotely on libvirt-debian-9 (libvirt) in workspace <https://ci.centos.org/job/libvirt-go-xml-check/systems=libvirt-debian-9/ws/> [libvirt-go-xml] $ /bin/sh -xe /tmp/jenkins1271887790279959372.sh + export TEST_ARGS=-tags xmlroundtrip + go test -tags xmlroundtrip --- FAIL: TestRoundTrip (28.71s) xml_test.go:433: open testdata/libvirt/tests/qemuargv2xmldata: no such file or directory FAIL exit status 1 FAIL _<https://ci.centos.org/job/libvirt-go-xml-check/systems=libvirt-debian-9/ws/> 28.769s Build step 'Execute shell' marked build as failure

See <https://ci.centos.org/job/libvirt-go-xml-check/systems=libvirt-debian-9/506/display/redirect> ------------------------------------------ Started by upstream project "libvirt-go-xml-check" build number 506 originally caused by: Started by upstream project "libvirt-go-xml-build" build number 508 originally caused by: Started by upstream project "libvirt-build" build number 596 originally caused by: Started by an SCM change Started by an SCM change Started by an SCM change Started by an SCM change Started by an SCM change Started by an SCM change Started by an SCM change [EnvInject] - Loading node environment variables. Building remotely on libvirt-debian-9 (libvirt) in workspace <https://ci.centos.org/job/libvirt-go-xml-check/systems=libvirt-debian-9/ws/> [libvirt-go-xml] $ /bin/sh -xe /tmp/jenkins7243637714353501759.sh + export TEST_ARGS=-tags xmlroundtrip + go test -tags xmlroundtrip --- FAIL: TestRoundTrip (15.23s) xml_test.go:433: open testdata/libvirt/tests/qemuargv2xmldata: no such file or directory FAIL exit status 1 FAIL _<https://ci.centos.org/job/libvirt-go-xml-check/systems=libvirt-debian-9/ws/> 15.288s Build step 'Execute shell' marked build as failure

See <https://ci.centos.org/job/libvirt-go-xml-check/systems=libvirt-debian-9/507/display/redirect> ------------------------------------------ Started by upstream project "libvirt-go-xml-check" build number 507 originally caused by: Started by upstream project "libvirt-go-xml-build" build number 509 originally caused by: Started by upstream project "libvirt-build" build number 599 originally caused by: Started by an SCM change Started by an SCM change [EnvInject] - Loading node environment variables. Building remotely on libvirt-debian-9 (libvirt) in workspace <https://ci.centos.org/job/libvirt-go-xml-check/systems=libvirt-debian-9/ws/> [libvirt-go-xml] $ /bin/sh -xe /tmp/jenkins3287543791044169875.sh + export TEST_ARGS=-tags xmlroundtrip + go test -tags xmlroundtrip --- FAIL: TestRoundTrip (13.98s) xml_test.go:433: open testdata/libvirt/tests/qemuargv2xmldata: no such file or directory FAIL exit status 1 FAIL _<https://ci.centos.org/job/libvirt-go-xml-check/systems=libvirt-debian-9/ws/> 14.031s Build step 'Execute shell' marked build as failure

See <https://ci.centos.org/job/libvirt-go-xml-check/systems=libvirt-debian-9/508/display/redirect> ------------------------------------------ Started by upstream project "libvirt-go-xml-check" build number 508 originally caused by: Started by upstream project "libvirt-go-xml-build" build number 510 originally caused by: Started by upstream project "libvirt-build" build number 600 originally caused by: Started by an SCM change Started by an SCM change Started by an SCM change Started by an SCM change Started by an SCM change [EnvInject] - Loading node environment variables. Building remotely on libvirt-debian-9 (libvirt) in workspace <https://ci.centos.org/job/libvirt-go-xml-check/systems=libvirt-debian-9/ws/> [libvirt-go-xml] $ /bin/sh -xe /tmp/jenkins8420898829170189195.sh + export TEST_ARGS=-tags xmlroundtrip + go test -tags xmlroundtrip --- FAIL: TestRoundTrip (6.09s) xml_test.go:433: open testdata/libvirt/tests/qemuargv2xmldata: no such file or directory FAIL exit status 1 FAIL _<https://ci.centos.org/job/libvirt-go-xml-check/systems=libvirt-debian-9/ws/> 6.130s Build step 'Execute shell' marked build as failure

See <https://ci.centos.org/job/libvirt-go-xml-check/systems=libvirt-debian-9/509/display/redirect> ------------------------------------------ Started by upstream project "libvirt-go-xml-check" build number 509 originally caused by: Started by upstream project "libvirt-go-xml-build" build number 511 originally caused by: Started by upstream project "libvirt-build" build number 601 originally caused by: Started by an SCM change [EnvInject] - Loading node environment variables. Building remotely on libvirt-debian-9 (libvirt) in workspace <https://ci.centos.org/job/libvirt-go-xml-check/systems=libvirt-debian-9/ws/> [libvirt-go-xml] $ /bin/sh -xe /tmp/jenkins4185698541248330727.sh + export TEST_ARGS=-tags xmlroundtrip + go test -tags xmlroundtrip --- FAIL: TestRoundTrip (7.70s) xml_test.go:433: open testdata/libvirt/tests/qemuargv2xmldata: no such file or directory FAIL exit status 1 FAIL _<https://ci.centos.org/job/libvirt-go-xml-check/systems=libvirt-debian-9/ws/> 7.799s Build step 'Execute shell' marked build as failure

See <https://ci.centos.org/job/libvirt-go-xml-check/systems=libvirt-debian-9/510/display/redirect> ------------------------------------------ Started by upstream project "libvirt-go-xml-check" build number 510 originally caused by: Started by upstream project "libvirt-go-xml-build" build number 512 originally caused by: Started by upstream project "libvirt-build" build number 602 originally caused by: Started by an SCM change Started by an SCM change Started by an SCM change Started by an SCM change Started by an SCM change Started by an SCM change Started by an SCM change [EnvInject] - Loading node environment variables. Building remotely on libvirt-debian-9 (libvirt) in workspace <https://ci.centos.org/job/libvirt-go-xml-check/systems=libvirt-debian-9/ws/> [libvirt-go-xml] $ /bin/sh -xe /tmp/jenkins6176533280352066613.sh + export TEST_ARGS=-tags xmlroundtrip + go test -tags xmlroundtrip --- FAIL: TestRoundTrip (8.14s) xml_test.go:433: open testdata/libvirt/tests/qemuargv2xmldata: no such file or directory FAIL exit status 1 FAIL _<https://ci.centos.org/job/libvirt-go-xml-check/systems=libvirt-debian-9/ws/> 8.313s Build step 'Execute shell' marked build as failure

See <https://ci.centos.org/job/libvirt-go-xml-check/systems=libvirt-debian-9/511/display/redirect> ------------------------------------------ Started by upstream project "libvirt-go-xml-check" build number 511 originally caused by: Started by upstream project "libvirt-go-xml-build" build number 513 originally caused by: Started by upstream project "libvirt-build" build number 614 originally caused by: Started by an SCM change [EnvInject] - Loading node environment variables. Building remotely on libvirt-debian-9 (libvirt) in workspace <https://ci.centos.org/job/libvirt-go-xml-check/systems=libvirt-debian-9/ws/> [libvirt-go-xml] $ /bin/sh -xe /tmp/jenkins6061621170625635238.sh + export TEST_ARGS=-tags xmlroundtrip + go test -tags xmlroundtrip --- FAIL: TestRoundTrip (27.63s) xml_test.go:433: open testdata/libvirt/tests/qemuargv2xmldata: no such file or directory FAIL exit status 1 FAIL _<https://ci.centos.org/job/libvirt-go-xml-check/systems=libvirt-debian-9/ws/> 27.716s Build step 'Execute shell' marked build as failure

See <https://ci.centos.org/job/libvirt-go-xml-check/systems=libvirt-debian-9/512/display/redirect> ------------------------------------------ Started by upstream project "libvirt-go-xml-check" build number 512 originally caused by: Started by upstream project "libvirt-go-xml-build" build number 514 originally caused by: Started by upstream project "libvirt-build" build number 615 originally caused by: Started by an SCM change Started by an SCM change Started by an SCM change Started by an SCM change [EnvInject] - Loading node environment variables. Building remotely on libvirt-debian-9 (libvirt) in workspace <https://ci.centos.org/job/libvirt-go-xml-check/systems=libvirt-debian-9/ws/> [libvirt-go-xml] $ /bin/sh -xe /tmp/jenkins6293581175861187995.sh + export TEST_ARGS=-tags xmlroundtrip + go test -tags xmlroundtrip --- FAIL: TestRoundTrip (13.22s) xml_test.go:433: open testdata/libvirt/tests/qemuargv2xmldata: no such file or directory FAIL exit status 1 FAIL _<https://ci.centos.org/job/libvirt-go-xml-check/systems=libvirt-debian-9/ws/> 13.310s Build step 'Execute shell' marked build as failure

See <https://ci.centos.org/job/libvirt-go-xml-check/systems=libvirt-debian-9/513/display/redirect> ------------------------------------------ Started by upstream project "libvirt-go-xml-check" build number 513 originally caused by: Started by upstream project "libvirt-go-xml-build" build number 515 originally caused by: Started by upstream project "libvirt-build" build number 616 originally caused by: Started by an SCM change [EnvInject] - Loading node environment variables. Building remotely on libvirt-debian-9 (libvirt) in workspace <https://ci.centos.org/job/libvirt-go-xml-check/systems=libvirt-debian-9/ws/> [libvirt-go-xml] $ /bin/sh -xe /tmp/jenkins8989021055248045682.sh + export TEST_ARGS=-tags xmlroundtrip + go test -tags xmlroundtrip --- FAIL: TestRoundTrip (18.20s) xml_test.go:433: open testdata/libvirt/tests/qemuargv2xmldata: no such file or directory FAIL exit status 1 FAIL _<https://ci.centos.org/job/libvirt-go-xml-check/systems=libvirt-debian-9/ws/> 18.248s Build step 'Execute shell' marked build as failure

participants (1)
-
ci@centos.org